hadoop-common-dev mailing list archives

Site index · List index
Message view « Date » · « Thread »
Top « Date » · « Thread »
From hud...@lucene.zones.apache.org
Subject Build failed in Hudson: Hadoop-Nightly #125
Date Mon, 18 Jun 2007 11:58:40 GMT
See http://lucene.zones.apache.org:8080/hudson/job/Hadoop-Nightly/125/changes

------------------------------------------
[...truncated 20493 lines...]
    [junit] Jobs in ready state: 0
    [junit] Jobs in running state: 2
    [junit] Jobs in success state: 0
    [junit] Jobs in failed state: 0


    [junit] 2007-06-18 11:56:13,723 INFO  mapred.LocalJobRunner (LocalJobRunner.java:progress(200))
- http://lucene.zones.apache.org:8080/hudson/job/Hadoop-Nightly/ws/trunk/build/test/data/TestJobControlData/indir/data.txt
:0+33554432
    [junit] 2007-06-18 11:56:14,430 INFO  mapred.LocalJobRunner (LocalJobRunner.java:progress(200))
- http://lucene.zones.apache.org:8080/hudson/job/Hadoop-Nightly/ws/trunk/build/test/data/TestJobControlData/indir/data.txt
:0+33554432
    [junit] 2007-06-18 11:56:14,969 INFO  mapred.LocalJobRunner (LocalJobRunner.java:progress(200))
- http://lucene.zones.apache.org:8080/hudson/job/Hadoop-Nightly/ws/trunk/build/test/data/TestJobControlData/indir/data.txt
:0+33554432
    [junit] 2007-06-18 11:56:15,745 INFO  mapred.LocalJobRunner (LocalJobRunner.java:progress(200))
- http://lucene.zones.apache.org:8080/hudson/job/Hadoop-Nightly/ws/trunk/build/test/data/TestJobControlData/indir/data.txt
:0+33554432
    [junit] Jobs in waiting state: 2
    [junit] Jobs in ready state: 0
    [junit] Jobs in running state: 2
    [junit] Jobs in success state: 0
    [junit] Jobs in failed state: 0


    [junit] 2007-06-18 11:56:18,440 INFO  mapred.LocalJobRunner (LocalJobRunner.java:progress(200))
- http://lucene.zones.apache.org:8080/hudson/job/Hadoop-Nightly/ws/trunk/build/test/data/TestJobControlData/indir/data.txt
:0+33554432
    [junit] 2007-06-18 11:56:18,670 INFO  mapred.LocalJobRunner (LocalJobRunner.java:progress(200))
- http://lucene.zones.apache.org:8080/hudson/job/Hadoop-Nightly/ws/trunk/build/test/data/TestJobControlData/indir/data.txt
:0+33554432
    [junit] 2007-06-18 11:56:19,749 INFO  mapred.LocalJobRunner (LocalJobRunner.java:progress(200))
- http://lucene.zones.apache.org:8080/hudson/job/Hadoop-Nightly/ws/trunk/build/test/data/TestJobControlData/indir/data.txt
:0+33554432
    [junit] 2007-06-18 11:56:20,809 INFO  mapred.LocalJobRunner (LocalJobRunner.java:progress(200))
- http://lucene.zones.apache.org:8080/hudson/job/Hadoop-Nightly/ws/trunk/build/test/data/TestJobControlData/indir/data.txt
:0+33554432
    [junit] 2007-06-18 11:56:21,606 INFO  mapred.LocalJobRunner (LocalJobRunner.java:progress(200))
- http://lucene.zones.apache.org:8080/hudson/job/Hadoop-Nightly/ws/trunk/build/test/data/TestJobControlData/indir/data.txt
:0+33554432
    [junit] 2007-06-18 11:56:21,810 INFO  mapred.LocalJobRunner (LocalJobRunner.java:progress(200))
- http://lucene.zones.apache.org:8080/hudson/job/Hadoop-Nightly/ws/trunk/build/test/data/TestJobControlData/indir/data.txt
:0+33554432
    [junit] 2007-06-18 11:56:22,607 INFO  mapred.LocalJobRunner (LocalJobRunner.java:progress(200))
- http://lucene.zones.apache.org:8080/hudson/job/Hadoop-Nightly/ws/trunk/build/test/data/TestJobControlData/indir/data.txt
:0+33554432
    [junit] 2007-06-18 11:56:22,977 INFO  mapred.LocalJobRunner (LocalJobRunner.java:progress(200))
- http://lucene.zones.apache.org:8080/hudson/job/Hadoop-Nightly/ws/trunk/build/test/data/TestJobControlData/indir/data.txt
:0+33554432
    [junit] Jobs in waiting state: 2
    [junit] Jobs in ready state: 0
    [junit] Jobs in running state: 2
    [junit] Jobs in success state: 0
    [junit] Jobs in failed state: 0


    [junit] 2007-06-18 11:56:24,730 INFO  mapred.LocalJobRunner (LocalJobRunner.java:progress(200))
- http://lucene.zones.apache.org:8080/hudson/job/Hadoop-Nightly/ws/trunk/build/test/data/TestJobControlData/indir/data.txt
:0+33554432
    [junit] 2007-06-18 11:56:24,802 INFO  mapred.LocalJobRunner (LocalJobRunner.java:progress(200))
- http://lucene.zones.apache.org:8080/hudson/job/Hadoop-Nightly/ws/trunk/build/test/data/TestJobControlData/indir/data.txt
:0+33554432
    [junit] 2007-06-18 11:56:25,803 INFO  mapred.LocalJobRunner (LocalJobRunner.java:progress(200))
- http://lucene.zones.apache.org:8080/hudson/job/Hadoop-Nightly/ws/trunk/build/test/data/TestJobControlData/indir/data.txt
:0+33554432
    [junit] 2007-06-18 11:56:26,011 INFO  mapred.LocalJobRunner (LocalJobRunner.java:progress(200))
- http://lucene.zones.apache.org:8080/hudson/job/Hadoop-Nightly/ws/trunk/build/test/data/TestJobControlData/indir/data.txt
:0+33554432
    [junit] 2007-06-18 11:56:27,046 INFO  mapred.LocalJobRunner (LocalJobRunner.java:progress(200))
- http://lucene.zones.apache.org:8080/hudson/job/Hadoop-Nightly/ws/trunk/build/test/data/TestJobControlData/indir/data.txt
:0+33554432
    [junit] 2007-06-18 11:56:28,263 INFO  mapred.LocalJobRunner (LocalJobRunner.java:progress(200))
- http://lucene.zones.apache.org:8080/hudson/job/Hadoop-Nightly/ws/trunk/build/test/data/TestJobControlData/indir/data.txt
:0+33554432
    [junit] Jobs in waiting state: 2
    [junit] Jobs in ready state: 0
    [junit] 2007-06-18 11:56:28,766 INFO  mapred.LocalJobRunner (LocalJobRunner.java:progress(200))
- http://lucene.zones.apache.org:8080/hudson/job/Hadoop-Nightly/ws/trunk/build/test/data/TestJobControlData/indir/data.txt
:0+33554432
    [junit] Jobs in running state: 2
    [junit] Jobs in success state: 0
    [junit] Jobs in failed state: 0


    [junit] 2007-06-18 11:56:29,353 INFO  mapred.LocalJobRunner (LocalJobRunner.java:progress(200))
- http://lucene.zones.apache.org:8080/hudson/job/Hadoop-Nightly/ws/trunk/build/test/data/TestJobControlData/indir/data.txt
:0+33554432
    [junit] 2007-06-18 11:56:29,769 INFO  mapred.LocalJobRunner (LocalJobRunner.java:progress(200))
- http://lucene.zones.apache.org:8080/hudson/job/Hadoop-Nightly/ws/trunk/build/test/data/TestJobControlData/indir/data.txt
:0+33554432
    [junit] 2007-06-18 11:56:30,719 INFO  mapred.LocalJobRunner (LocalJobRunner.java:progress(200))
- http://lucene.zones.apache.org:8080/hudson/job/Hadoop-Nightly/ws/trunk/build/test/data/TestJobControlData/indir/data.txt
:0+33554432
    [junit] 2007-06-18 11:56:30,778 INFO  mapred.LocalJobRunner (LocalJobRunner.java:progress(200))
- http://lucene.zones.apache.org:8080/hudson/job/Hadoop-Nightly/ws/trunk/build/test/data/TestJobControlData/indir/data.txt
:0+33554432
    [junit] 2007-06-18 11:56:31,728 INFO  mapred.LocalJobRunner (LocalJobRunner.java:progress(200))
- http://lucene.zones.apache.org:8080/hudson/job/Hadoop-Nightly/ws/trunk/build/test/data/TestJobControlData/indir/data.txt
:0+33554432
    [junit] 2007-06-18 11:56:31,788 INFO  mapred.LocalJobRunner (LocalJobRunner.java:progress(200))
- http://lucene.zones.apache.org:8080/hudson/job/Hadoop-Nightly/ws/trunk/build/test/data/TestJobControlData/indir/data.txt
:0+33554432
    [junit] 2007-06-18 11:56:32,741 INFO  mapred.LocalJobRunner (LocalJobRunner.java:progress(200))
- http://lucene.zones.apache.org:8080/hudson/job/Hadoop-Nightly/ws/trunk/build/test/data/TestJobControlData/indir/data.txt
:0+33554432
    [junit] 2007-06-18 11:56:32,799 INFO  mapred.LocalJobRunner (LocalJobRunner.java:progress(200))
- http://lucene.zones.apache.org:8080/hudson/job/Hadoop-Nightly/ws/trunk/build/test/data/TestJobControlData/indir/data.txt
:0+33554432
    [junit] 2007-06-18 11:56:33,748 INFO  mapred.LocalJobRunner (LocalJobRunner.java:progress(200))
- http://lucene.zones.apache.org:8080/hudson/job/Hadoop-Nightly/ws/trunk/build/test/data/TestJobControlData/indir/data.txt
:0+33554432
    [junit] Jobs in waiting state: 2
    [junit] Jobs in ready state: 0
    [junit] Jobs in running state: 2
    [junit] Jobs in success state: 0
    [junit] Jobs in failed state: 0


    [junit] 2007-06-18 11:56:33,808 INFO  mapred.LocalJobRunner (LocalJobRunner.java:progress(200))
- http://lucene.zones.apache.org:8080/hudson/job/Hadoop-Nightly/ws/trunk/build/test/data/TestJobControlData/indir/data.txt
:0+33554432
    [junit] 2007-06-18 11:56:33,859 INFO  mapred.LocalJobRunner (LocalJobRunner.java:progress(200))
- http://lucene.zones.apache.org:8080/hudson/job/Hadoop-Nightly/ws/trunk/build/test/data/TestJobControlData/indir/data.txt
:0+33554432
    [junit] 2007-06-18 11:56:33,899 INFO  mapred.MapTask (MapTask.java:run(120)) - numReduceTasks:
1
    [junit] 2007-06-18 11:56:34,060 WARN  mapred.LocalJobRunner (LocalJobRunner.java:run(176))
- job_27pus0
    [junit] org.apache.hadoop.util.DiskChecker$DiskErrorException: Could not find map_0000/spill0.out
in any of the configured local directories
    [junit] 	at org.apache.hadoop.fs.LocalDirAllocator$AllocatorPerContext.getLocalPathToRead(LocalDirAllocator.java:273)
    [junit] 	at org.apache.hadoop.fs.LocalDirAllocator.getLocalPathToRead(LocalDirAllocator.java:138)
    [junit] 	at org.apache.hadoop.mapred.MapOutputFile.getSpillFile(MapOutputFile.java:77)
    [junit] 	at org.apache.hadoop.mapred.MapTask$MapOutputBuffer.mergeParts(MapTask.java:499)
    [junit] 	at org.apache.hadoop.mapred.MapTask$MapOutputBuffer.flush(MapTask.java:620)
    [junit] 	at org.apache.hadoop.mapred.MapTask.run(MapTask.java:187)
    [junit] 	at org.apache.hadoop.mapred.LocalJobRunner$Job.run(LocalJobRunner.java:131)
    [junit] 2007-06-18 11:56:34,865 INFO  mapred.LocalJobRunner (LocalJobRunner.java:progress(200))
- http://lucene.zones.apache.org:8080/hudson/job/Hadoop-Nightly/ws/trunk/build/test/data/TestJobControlData/indir/data.txt
:33554432+7291398
    [junit] 2007-06-18 11:56:36,629 INFO  mapred.LocalJobRunner (LocalJobRunner.java:progress(200))
- http://lucene.zones.apache.org:8080/hudson/job/Hadoop-Nightly/ws/trunk/build/test/data/TestJobControlData/indir/data.txt
:33554432+7291398
    [junit] 2007-06-18 11:56:37,763 INFO  mapred.LocalJobRunner (LocalJobRunner.java:progress(200))
- http://lucene.zones.apache.org:8080/hudson/job/Hadoop-Nightly/ws/trunk/build/test/data/TestJobControlData/indir/data.txt
:33554432+7291398
    [junit] Jobs in waiting state: 2
    [junit] Jobs in ready state: 0
    [junit] Jobs in running state: 1
    [junit] Jobs in success state: 0
    [junit] Jobs in failed state: 3


    [junit] 2007-06-18 11:56:41,493 INFO  mapred.LocalJobRunner (LocalJobRunner.java:progress(200))
- reduce > sort
    [junit] 2007-06-18 11:56:42,494 INFO  mapred.LocalJobRunner (LocalJobRunner.java:progress(200))
- reduce > reduce
    [junit] 2007-06-18 11:56:42,642 INFO  fs.FSInputChecker (ChecksumFileSystem.java:readBuffer(223))
- Found checksum error: org.apache.hadoop.fs.ChecksumException: Checksum error: build/test/mapred/local/reduce_71tgkp/map_0.out
at 1571840
    [junit] 	at org.apache.hadoop.fs.ChecksumFileSystem$FSInputChecker.verifySum(ChecksumFileSystem.java:262)
    [junit] 	at org.apache.hadoop.fs.ChecksumFileSystem$FSInputChecker.readBuffer(ChecksumFileSystem.java:217)
    [junit] 	at org.apache.hadoop.fs.ChecksumFileSystem$FSInputChecker.read(ChecksumFileSystem.java:173)
    [junit] 	at org.apache.hadoop.fs.FSDataInputStream$PositionCache.read(FSDataInputStream.java:41)
    [junit] 	at java.io.BufferedInputStream.fill(BufferedInputStream.java:218)
    [junit] 	at java.io.BufferedInputStream.read1(BufferedInputStream.java:256)
    [junit] 	at java.io.BufferedInputStream.read(BufferedInputStream.java:313)
    [junit] 	at java.io.DataInputStream.readFully(DataInputStream.java:176)
    [junit] 	at java.io.DataInputStream.readFully(DataInputStream.java:152)
    [junit] 	at org.apache.hadoop.io.SequenceFile$UncompressedBytes.reset(SequenceFile.java:427)
    [junit] 	at org.apache.hadoop.io.SequenceFile$UncompressedBytes.access$700(SequenceFile.java:414)
    [junit] 	at org.apache.hadoop.io.SequenceFile$Reader.nextRawValue(SequenceFile.java:1677)
    [junit] 	at org.apache.hadoop.io.SequenceFile$Sorter$SegmentDescriptor.nextRawValue(SequenceFile.java:2620)
    [junit] 	at org.apache.hadoop.io.SequenceFile$Sorter$MergeQueue.next(SequenceFile.java:2364)
    [junit] 	at org.apache.hadoop.mapred.ReduceTask$ValuesIterator.getNext(ReduceTask.java:205)
    [junit] 	at org.apache.hadoop.mapred.ReduceTask$ValuesIterator.next(ReduceTask.java:168)
    [junit] 	at org.apache.hadoop.mapred.ReduceTask$ReduceValuesIterator.next(ReduceTask.java:243)
    [junit] 	at org.apache.hadoop.mapred.jobcontrol.TestJobControl$DataCopy.reduce(TestJobControl.java:98)
    [junit] 	at org.apache.hadoop.mapred.ReduceTask.run(ReduceTask.java:354)
    [junit] 	at org.apache.hadoop.mapred.LocalJobRunner$Job.run(LocalJobRunner.java:162)

    [junit] 2007-06-18 11:56:42,825 WARN  fs.FileSystem (LocalFileSystem.java:reportChecksumFailure(93))
- Moving bad file http://lucene.zones.apache.org:8080/hudson/job/Hadoop-Nightly/ws/trunk/build/test/mapred/local/reduce_71tgkp/map_0.out
 to /export/home/hudson/bad_files/map_0.out.-1654821144
    [junit] 2007-06-18 11:56:42,964 WARN  mapred.LocalJobRunner (LocalJobRunner.java:run(176))
- job_uql81x
    [junit] java.lang.RuntimeException: org.apache.hadoop.fs.ChecksumException: Checksum error:
build/test/mapred/local/reduce_71tgkp/map_0.out at 1571840
    [junit] 	at org.apache.hadoop.mapred.ReduceTask$ValuesIterator.next(ReduceTask.java:170)
    [junit] 	at org.apache.hadoop.mapred.ReduceTask$ReduceValuesIterator.next(ReduceTask.java:243)
    [junit] 	at org.apache.hadoop.mapred.jobcontrol.TestJobControl$DataCopy.reduce(TestJobControl.java:98)
    [junit] 	at org.apache.hadoop.mapred.ReduceTask.run(ReduceTask.java:354)
    [junit] 	at org.apache.hadoop.mapred.LocalJobRunner$Job.run(LocalJobRunner.java:162)
    [junit] Caused by: org.apache.hadoop.fs.ChecksumException: Checksum error: build/test/mapred/local/reduce_71tgkp/map_0.out
at 1571840
    [junit] 	at org.apache.hadoop.fs.ChecksumFileSystem$FSInputChecker.verifySum(ChecksumFileSystem.java:262)
    [junit] 	at org.apache.hadoop.fs.ChecksumFileSystem$FSInputChecker.readBuffer(ChecksumFileSystem.java:217)
    [junit] 	at org.apache.hadoop.fs.ChecksumFileSystem$FSInputChecker.read(ChecksumFileSystem.java:173)
    [junit] 	at org.apache.hadoop.fs.FSDataInputStream$PositionCache.read(FSDataInputStream.java:41)
    [junit] 	at java.io.BufferedInputStream.fill(BufferedInputStream.java:218)
    [junit] 	at java.io.BufferedInputStream.read1(BufferedInputStream.java:256)
    [junit] 	at java.io.BufferedInputStream.read(BufferedInputStream.java:313)
    [junit] 	at java.io.DataInputStream.readFully(DataInputStream.java:176)
    [junit] 	at java.io.DataInputStream.readFully(DataInputStream.java:152)
    [junit] 	at org.apache.hadoop.io.SequenceFile$UncompressedBytes.reset(SequenceFile.java:427)
    [junit] 	at org.apache.hadoop.io.SequenceFile$UncompressedBytes.access$700(SequenceFile.java:414)
    [junit] 	at org.apache.hadoop.io.SequenceFile$Reader.nextRawValue(SequenceFile.java:1677)
    [junit] 	at org.apache.hadoop.io.SequenceFile$Sorter$SegmentDescriptor.nextRawValue(SequenceFile.java:2620)
    [junit] 	at org.apache.hadoop.io.SequenceFile$Sorter$MergeQueue.next(SequenceFile.java:2364)
    [junit] 	at org.apache.hadoop.mapred.ReduceTask$ValuesIterator.getNext(ReduceTask.java:205)
    [junit] 	at org.apache.hadoop.mapred.ReduceTask$ValuesIterator.next(ReduceTask.java:168)
    [junit] 	... 4 more
    [junit] Jobs in waiting state: 0
    [junit] Jobs in ready state: 0
    [junit] Jobs in running state: 0
    [junit] Jobs in success state: 0
    [junit] Jobs in failed state: 3


    [junit] Jobs are all done???
    [junit] Jobs in waiting state: 0
    [junit] Jobs in ready state: 0
    [junit] Jobs in running state: 0
    [junit] Jobs in success state: 0
    [junit] Jobs in failed state: 4


    [junit] Tests run: 1, Failures: 0, Errors: 0, Time elapsed: 96.404 sec
    [junit] Running org.apache.hadoop.mapred.pipes.TestPipes
    [junit] 2007-06-18 11:56:50,205 INFO  pipes.TestPipes (TestPipes.java:testPipes(47)) -
compile.c++ is not defined, so skipping TestPipes
    [junit] Tests run: 1, Failures: 0, Errors: 0, Time elapsed: 0.058 sec
    [junit] Running org.apache.hadoop.net.TestNetworkTopology
    [junit] 2007-06-18 11:56:51,889 INFO  net.NetworkTopology (NetworkTopology.java:add(320))
- Adding a new node: /d1/r1/h1:5020
    [junit] 2007-06-18 11:56:51,896 INFO  net.NetworkTopology (NetworkTopology.java:add(320))
- Adding a new node: /d1/r1/h2:5020
    [junit] 2007-06-18 11:56:51,897 INFO  net.NetworkTopology (NetworkTopology.java:add(320))
- Adding a new node: /d1/r2/h3:5020
    [junit] 2007-06-18 11:56:51,898 INFO  net.NetworkTopology (NetworkTopology.java:add(320))
- Adding a new node: /d1/r2/h4:5020
    [junit] 2007-06-18 11:56:51,899 INFO  net.NetworkTopology (NetworkTopology.java:add(320))
- Adding a new node: /d1/r2/h5:5020
    [junit] 2007-06-18 11:56:51,900 INFO  net.NetworkTopology (NetworkTopology.java:add(320))
- Adding a new node: /d2/r3/h6:5020
    [junit] 2007-06-18 11:56:51,901 INFO  net.NetworkTopology (NetworkTopology.java:add(320))
- Adding a new node: /d2/r3/h7:5020
    [junit] 2007-06-18 11:56:52,729 INFO  net.NetworkTopology (NetworkTopology.java:remove(347))
- Removing a node: /d1/r1/h1:5020
    [junit] 2007-06-18 11:56:52,730 INFO  net.NetworkTopology (NetworkTopology.java:remove(347))
- Removing a node: /d1/r1/h2:5020
    [junit] 2007-06-18 11:56:52,732 INFO  net.NetworkTopology (NetworkTopology.java:remove(347))
- Removing a node: /d1/r2/h3:5020
    [junit] 2007-06-18 11:56:52,733 INFO  net.NetworkTopology (NetworkTopology.java:remove(347))
- Removing a node: /d1/r2/h4:5020
    [junit] 2007-06-18 11:56:52,858 INFO  net.NetworkTopology (NetworkTopology.java:remove(347))
- Removing a node: /d1/r2/h5:5020
    [junit] 2007-06-18 11:56:52,859 INFO  net.NetworkTopology (NetworkTopology.java:remove(347))
- Removing a node: /d2/r3/h6:5020
    [junit] 2007-06-18 11:56:52,859 INFO  net.NetworkTopology (NetworkTopology.java:remove(347))
- Removing a node: /d2/r3/h7:5020
    [junit] 2007-06-18 11:56:52,860 INFO  net.NetworkTopology (NetworkTopology.java:add(320))
- Adding a new node: /d1/r1/h1:5020
    [junit] 2007-06-18 11:56:52,861 INFO  net.NetworkTopology (NetworkTopology.java:add(320))
- Adding a new node: /d1/r1/h2:5020
    [junit] 2007-06-18 11:56:52,862 INFO  net.NetworkTopology (NetworkTopology.java:add(320))
- Adding a new node: /d1/r2/h3:5020
    [junit] 2007-06-18 11:56:52,863 INFO  net.NetworkTopology (NetworkTopology.java:add(320))
- Adding a new node: /d1/r2/h4:5020
    [junit] 2007-06-18 11:56:52,864 INFO  net.NetworkTopology (NetworkTopology.java:add(320))
- Adding a new node: /d1/r2/h5:5020
    [junit] 2007-06-18 11:56:52,864 INFO  net.NetworkTopology (NetworkTopology.java:add(320))
- Adding a new node: /d2/r3/h6:5020
    [junit] 2007-06-18 11:56:52,865 INFO  net.NetworkTopology (NetworkTopology.java:add(320))
- Adding a new node: /d2/r3/h7:5020
    [junit] Tests run: 5, Failures: 0, Errors: 0, Time elapsed: 0.961 sec
    [junit] Running org.apache.hadoop.record.TestBuffer
    [junit] Tests run: 6, Failures: 0, Errors: 0, Time elapsed: 0.358 sec
    [junit] Running org.apache.hadoop.record.TestRecordIO
    [junit] Illustrating toString bugT,102,4567,99344109427290,3.1449999809265137,1.5234,'random
text,#000102030405060708090a0b0c0d0e0f101112131415161718191a1b1c1d1e1f202122232425262728292a2b2c2d2e2f303132333435363738393a3b3c3d3e3f404142434445464748494a4b4c4d4e4f505152535455565758595a5b5c5d5e5f606162636465666768696a6b6c6d6e6f707172737475767778797a7b7c7d7e7f808182838485868788898a8b8c8d8e8f909192939495969798999a9b9c9d9e9fa0a1a2a3a4a5a6a7a8a9aaabacadaeafb0b1b2b3b4b5b6b7b8b9babbbcbdbebfc0c1c2c3c4c5c6c7c8c9cacbcccdcecfd0d1d2d3d4d5d6d7d8d9dadbdcdddedfe0e1e2e3e4e5e6e7e8e9eaebecedeeeff0f1f2f3f4f5f6f7f8f9fafbfcfdfeff,v{},m{},s{'other
random text}

    [junit] Illustrating toString bugT,102,4567,99344109427290,3.1449999809265137,1.5234,'random
text,#000102030405060708090a0b0c0d0e0f101112131415161718191a1b1c1d1e1f202122232425262728292a2b2c2d2e2f303132333435363738393a3b3c3d3e3f404142434445464748494a4b4c4d4e4f505152535455565758595a5b5c5d5e5f606162636465666768696a6b6c6d6e6f707172737475767778797a7b7c7d7e7f808182838485868788898a8b8c8d8e8f909192939495969798999a9b9c9d9e9fa0a1a2a3a4a5a6a7a8a9aaabacadaeafb0b1b2b3b4b5b6b7b8b9babbbcbdbebfc0c1c2c3c4c5c6c7c8c9cacbcccdcecfd0d1d2d3d4d5d6d7d8d9dadbdcdddedfe0e1e2e3e4e5e6e7e8e9eaebecedeeeff0f1f2f3f4f5f6f7f8f9fafbfcfdfeff,v{},m{},s{'other
random text}

    [junit] Tests run: 5, Failures: 0, Errors: 0, Time elapsed: 1.775 sec
    [junit] Running org.apache.hadoop.record.TestRecordMR
    [junit] 2007-06-18 11:56:59,134 INFO  mapred.FileInputFormat (FileInputFormat.java:validateInput(142))
- Total input paths to process : 1
    [junit] 2007-06-18 11:57:00,077 INFO  mapred.JobClient (JobClient.java:runJob(552)) -
Running job: job_wjh210
    [junit] 2007-06-18 11:57:00,133 INFO  mapred.MapTask (MapTask.java:run(120)) - numReduceTasks:
1
    [junit] 2007-06-18 11:57:01,857 INFO  mapred.LocalJobRunner (LocalJobRunner.java:progress(200))
- http://lucene.zones.apache.org:8080/hudson/job/Hadoop-Nightly/ws/trunk/mapred.loadtest/genins/answer.key
:0+190
    [junit] 2007-06-18 11:57:01,860 INFO  mapred.LocalJobRunner (LocalJobRunner.java:progress(200))
- http://lucene.zones.apache.org:8080/hudson/job/Hadoop-Nightly/ws/trunk/mapred.loadtest/genins/answer.key
:0+190
    [junit] 2007-06-18 11:57:01,967 INFO  mapred.LocalJobRunner (LocalJobRunner.java:progress(200))
- reduce > reduce
    [junit] 2007-06-18 11:57:01,972 INFO  mapred.TaskRunner (Task.java:saveTaskOutput(347))
- Saved output of task 'reduce_4zzsru' to http://lucene.zones.apache.org:8080/hudson/job/Hadoop-Nightly/ws/trunk/mapred.loadtest/genouts

    [junit] 2007-06-18 11:57:02,717 INFO  mapred.JobClient (JobClient.java:runJob(613)) -
Job complete: job_wjh210
    [junit] 2007-06-18 11:57:02,728 INFO  mapred.JobClient (Counters.java:log(359)) - Counters:
7
    [junit] 2007-06-18 11:57:02,962 INFO  mapred.JobClient (Counters.java:log(363)) -   Map-Reduce
Framework
    [junit] 2007-06-18 11:57:02,963 INFO  mapred.JobClient (Counters.java:log(365)) -    
Map input records=10
    [junit] 2007-06-18 11:57:02,964 INFO  mapred.JobClient (Counters.java:log(365)) -    
Map output records=100
    [junit] 2007-06-18 11:57:02,965 INFO  mapred.JobClient (Counters.java:log(365)) -    
Map input bytes=100
    [junit] 2007-06-18 11:57:02,967 INFO  mapred.JobClient (Counters.java:log(365)) -    
Map output bytes=700
    [junit] 2007-06-18 11:57:02,968 INFO  mapred.JobClient (Counters.java:log(365)) -    
Reduce input groups=100
    [junit] 2007-06-18 11:57:02,969 INFO  mapred.JobClient (Counters.java:log(365)) -    
Reduce input records=100
    [junit] 2007-06-18 11:57:02,970 INFO  mapred.JobClient (Counters.java:log(365)) -    
Reduce output records=100
    [junit] 2007-06-18 11:57:03,009 INFO  mapred.FileInputFormat (FileInputFormat.java:validateInput(142))
- Total input paths to process : 1
    [junit] 2007-06-18 11:57:03,224 INFO  mapred.JobClient (JobClient.java:runJob(552)) -
Running job: job_y2zne1
    [junit] 2007-06-18 11:57:03,259 INFO  mapred.MapTask (MapTask.java:run(120)) - numReduceTasks:
1
    [junit] 2007-06-18 11:57:03,290 INFO  mapred.LocalJobRunner (LocalJobRunner.java:progress(200))
- http://lucene.zones.apache.org:8080/hudson/job/Hadoop-Nightly/ws/trunk/mapred.loadtest/genouts/part-00000
:0+1093
    [junit] 2007-06-18 11:57:03,337 INFO  mapred.LocalJobRunner (LocalJobRunner.java:progress(200))
- reduce > reduce
    [junit] 2007-06-18 11:57:03,343 INFO  mapred.TaskRunner (Task.java:saveTaskOutput(347))
- Saved output of task 'reduce_u51pwi' to http://lucene.zones.apache.org:8080/hudson/job/Hadoop-Nightly/ws/trunk/mapred.loadtest/intermediateouts

    [junit] 2007-06-18 11:57:04,226 INFO  mapred.JobClient (JobClient.java:runJob(613)) -
Job complete: job_y2zne1
    [junit] 2007-06-18 11:57:04,228 INFO  mapred.JobClient (Counters.java:log(359)) - Counters:
7
    [junit] 2007-06-18 11:57:04,229 INFO  mapred.JobClient (Counters.java:log(363)) -   Map-Reduce
Framework
    [junit] 2007-06-18 11:57:04,229 INFO  mapred.JobClient (Counters.java:log(365)) -    
Map input records=100
    [junit] 2007-06-18 11:57:04,230 INFO  mapred.JobClient (Counters.java:log(365)) -    
Map output records=100
    [junit] 2007-06-18 11:57:04,230 INFO  mapred.JobClient (Counters.java:log(365)) -    
Map input bytes=1000
    [junit] 2007-06-18 11:57:04,231 INFO  mapred.JobClient (Counters.java:log(365)) -    
Map output bytes=300
    [junit] 2007-06-18 11:57:04,231 INFO  mapred.JobClient (Counters.java:log(365)) -    
Reduce input groups=10
    [junit] 2007-06-18 11:57:04,232 INFO  mapred.JobClient (Counters.java:log(365)) -    
Reduce input records=100
    [junit] 2007-06-18 11:57:04,233 INFO  mapred.JobClient (Counters.java:log(365)) -    
Reduce output records=10
    [junit] 2007-06-18 11:57:04,345 INFO  mapred.FileInputFormat (FileInputFormat.java:validateInput(142))
- Total input paths to process : 1
    [junit] 2007-06-18 11:57:05,049 INFO  mapred.JobClient (JobClient.java:runJob(552)) -
Running job: job_b9qamt
    [junit] 2007-06-18 11:57:05,102 INFO  mapred.MapTask (MapTask.java:run(120)) - numReduceTasks:
1
    [junit] 2007-06-18 11:57:05,169 INFO  mapred.LocalJobRunner (LocalJobRunner.java:progress(200))
- http://lucene.zones.apache.org:8080/hudson/job/Hadoop-Nightly/ws/trunk/mapred.loadtest/intermediateouts/part-00000
:0+209
    [junit] 2007-06-18 11:57:05,330 INFO  mapred.LocalJobRunner (LocalJobRunner.java:progress(200))
- reduce > reduce
    [junit] 2007-06-18 11:57:05,677 INFO  mapred.TaskRunner (Task.java:saveTaskOutput(347))
- Saved output of task 'reduce_6gc737' to http://lucene.zones.apache.org:8080/hudson/job/Hadoop-Nightly/ws/trunk/mapred.loadtest/finalouts

    [junit] 2007-06-18 11:57:06,127 INFO  mapred.JobClient (JobClient.java:runJob(613)) -
Job complete: job_b9qamt
    [junit] 2007-06-18 11:57:06,128 INFO  mapred.JobClient (Counters.java:log(359)) - Counters:
7
    [junit] 2007-06-18 11:57:06,128 INFO  mapred.JobClient (Counters.java:log(363)) -   Map-Reduce
Framework
    [junit] 2007-06-18 11:57:06,129 INFO  mapred.JobClient (Counters.java:log(365)) -    
Map input records=10
    [junit] 2007-06-18 11:57:06,129 INFO  mapred.JobClient (Counters.java:log(365)) -    
Map output records=10
    [junit] 2007-06-18 11:57:06,130 INFO  mapred.JobClient (Counters.java:log(365)) -    
Map input bytes=116
    [junit] 2007-06-18 11:57:06,131 INFO  mapred.JobClient (Counters.java:log(365)) -    
Map output bytes=20
    [junit] 2007-06-18 11:57:06,132 INFO  mapred.JobClient (Counters.java:log(365)) -    
Reduce input groups=10
    [junit] 2007-06-18 11:57:06,132 INFO  mapred.JobClient (Counters.java:log(365)) -    
Reduce input records=10
    [junit] 2007-06-18 11:57:06,133 INFO  mapred.JobClient (Counters.java:log(365)) -    
Reduce output records=10
    [junit] Original sum: 100
    [junit] Recomputed sum: 100
    [junit] Success=true
    [junit] Tests run: 1, Failures: 0, Errors: 0, Time elapsed: 9.733 sec
    [junit] Running org.apache.hadoop.record.TestRecordWritable
    [junit] Tests run: 1, Failures: 0, Errors: 0, Time elapsed: 13.477 sec
    [junit] Running org.apache.hadoop.util.TestReflectionUtils
    [junit] Tests run: 4, Failures: 0, Errors: 0, Time elapsed: 1.466 sec

BUILD FAILED
http://lucene.zones.apache.org:8080/hudson/job/Hadoop-Nightly/ws/trunk/build.xml :483: Tests
failed!

Total time: 46 minutes 45 seconds
Recording fingerprints
Publishing Javadoc
Recording test results


Mime
View raw message