hadoop-common-dev mailing list archives

Site index · List index
Message view « Date » · « Thread »
Top « Date » · « Thread »
From hud...@lucene.zones.apache.org
Subject Build failed in Hudson: Hadoop-Nightly #105
Date Wed, 30 May 2007 11:37:31 GMT
See http://lucene.zones.apache.org:8080/hudson/job/Hadoop-Nightly/105/

Changes:

[jimk] HADOOP-1391. Part1: includes create/delete table; enable/disable table; add/remove
column.

Patch has been tested locally and a new test has been added for administrative functions.

Still to do: merge regions.

[jimk] HADOOP-1391. Update CHANGES.txt

------------------------------------------
[...truncated 18590 lines...]
    [junit] 2007-05-30 11:35:42,793 INFO  mapred.FileInputFormat (TestSequenceFileInputFilter.java:countRecords(90))
- Accept record 10057
    [junit] 2007-05-30 11:35:42,800 INFO  mapred.FileInputFormat (TestSequenceFileInputFilter.java:countRecords(90))
- Accept record 12945
    [junit] 2007-05-30 11:35:42,802 INFO  mapred.FileInputFormat (TestSequenceFileInputFilter.java:testMD5Filter(165))
- Accepted 9 records
    [junit] 2007-05-30 11:35:42,802 INFO  mapred.FileInputFormat (TestSequenceFileInputFilter.java:testMD5Filter(163))
- ******Number of records: 14790
    [junit] 2007-05-30 11:35:43,047 INFO  mapred.FileInputFormat (TestSequenceFileInputFilter.java:countRecords(84))
- Generated 130 splits.
    [junit] 2007-05-30 11:35:43,052 INFO  mapred.FileInputFormat (TestSequenceFileInputFilter.java:countRecords(90))
- Accept record 826
    [junit] 2007-05-30 11:35:43,054 INFO  mapred.FileInputFormat (TestSequenceFileInputFilter.java:countRecords(90))
- Accept record 1026
    [junit] 2007-05-30 11:35:43,056 INFO  mapred.FileInputFormat (TestSequenceFileInputFilter.java:countRecords(90))
- Accept record 1302
    [junit] 2007-05-30 11:35:43,066 INFO  mapred.FileInputFormat (TestSequenceFileInputFilter.java:countRecords(90))
- Accept record 3184
    [junit] 2007-05-30 11:35:43,075 INFO  mapred.FileInputFormat (TestSequenceFileInputFilter.java:countRecords(90))
- Accept record 4839
    [junit] 2007-05-30 11:35:43,076 INFO  mapred.FileInputFormat (TestSequenceFileInputFilter.java:countRecords(90))
- Accept record 4863
    [junit] 2007-05-30 11:35:43,089 INFO  mapred.FileInputFormat (TestSequenceFileInputFilter.java:countRecords(90))
- Accept record 7606
    [junit] 2007-05-30 11:35:43,103 INFO  mapred.FileInputFormat (TestSequenceFileInputFilter.java:countRecords(90))
- Accept record 10057
    [junit] 2007-05-30 11:35:43,117 INFO  mapred.FileInputFormat (TestSequenceFileInputFilter.java:countRecords(90))
- Accept record 12945
    [junit] 2007-05-30 11:35:43,127 INFO  mapred.FileInputFormat (TestSequenceFileInputFilter.java:testMD5Filter(165))
- Accepted 9 records
    [junit] Tests run: 3, Failures: 0, Errors: 0, Time elapsed: 10.64 sec
    [junit] Running org.apache.hadoop.mapred.TestSequenceFileInputFormat
    [junit] 2007-05-30 11:35:44,170 WARN  util.NativeCodeLoader (NativeCodeLoader.java:<clinit>(51))
- Unable to load native-hadoop library for your platform... using builtin-java classes where
applicable
    [junit] Tests run: 1, Failures: 0, Errors: 0, Time elapsed: 7.793 sec
    [junit] Running org.apache.hadoop.mapred.TestTextInputFormat
    [junit] 2007-05-30 11:35:52,175 INFO  mapred.TestTextInputFormat (TestTextInputFormat.java:testFormat(58))
- seed = -695638352
    [junit] 2007-05-30 11:35:56,902 WARN  util.NativeCodeLoader (NativeCodeLoader.java:<clinit>(51))
- Unable to load native-hadoop library for your platform... using builtin-java classes where
applicable
    [junit] Tests run: 4, Failures: 0, Errors: 0, Time elapsed: 4.801 sec
    [junit] Running org.apache.hadoop.mapred.TestTextOutputFormat
    [junit] Tests run: 1, Failures: 0, Errors: 0, Time elapsed: 0.092 sec
    [junit] Running org.apache.hadoop.mapred.TestUserValueGrouping
    [junit] 2007-05-30 11:35:58,934 WARN  util.NativeCodeLoader (NativeCodeLoader.java:<clinit>(51))
- Unable to load native-hadoop library for your platform... using builtin-java classes where
applicable
    [junit] 2007-05-30 11:35:59,009 INFO  mapred.FileInputFormat (FileInputFormat.java:validateInput(142))
- Total input paths to process : 1
    [junit] 2007-05-30 11:35:59,552 INFO  mapred.MapTask (MapTask.java:run(120)) - numReduceTasks:
1
    [junit] 2007-05-30 11:35:59,671 INFO  mapred.LocalJobRunner (LocalJobRunner.java:progress(200))
- http://lucene.zones.apache.org:8080/hudson/job/Hadoop-Nightly/ws/trunk/build/test/test.mapred.spill/in/part0
:0+207
    [junit] 2007-05-30 11:35:59,763 INFO  mapred.LocalJobRunner (LocalJobRunner.java:progress(200))
- reduce > reduce
    [junit] 2007-05-30 11:35:59,769 INFO  mapred.TaskRunner (Task.java:saveTaskOutput(331))
- Saved output of task 'reduce_u0m0kl' to http://lucene.zones.apache.org:8080/hudson/job/Hadoop-Nightly/ws/trunk/build/test/test.mapred.spill/out

    [junit] Tests run: 1, Failures: 0, Errors: 0, Time elapsed: 2.159 sec
    [junit] Running org.apache.hadoop.mapred.jobcontrol.TestJobControl
    [junit] Jobs in waiting state: 4
    [junit] Jobs in ready state: 0
    [junit] Jobs in running state: 0
    [junit] Jobs in success state: 0
    [junit] Jobs in failed state: 0


    [junit] 2007-05-30 11:36:11,687 INFO  mapred.FileInputFormat (FileInputFormat.java:validateInput(142))
- Total input paths to process : 1
    [junit] 2007-05-30 11:36:11,858 INFO  mapred.FileInputFormat (FileInputFormat.java:validateInput(142))
- Total input paths to process : 1
    [junit] 2007-05-30 11:36:11,920 INFO  mapred.MapTask (MapTask.java:run(120)) - numReduceTasks:
1
    [junit] 2007-05-30 11:36:11,984 INFO  mapred.MapTask (MapTask.java:run(120)) - numReduceTasks:
1
    [junit] 2007-05-30 11:36:13,007 INFO  mapred.LocalJobRunner (LocalJobRunner.java:progress(200))
- http://lucene.zones.apache.org:8080/hudson/job/Hadoop-Nightly/ws/trunk/build/test/data/TestJobControlData/indir/data.txt
:0+33554432
    [junit] 2007-05-30 11:36:13,007 INFO  mapred.LocalJobRunner (LocalJobRunner.java:progress(200))
- http://lucene.zones.apache.org:8080/hudson/job/Hadoop-Nightly/ws/trunk/build/test/data/TestJobControlData/indir/data.txt
:0+33554432
    [junit] 2007-05-30 11:36:14,010 INFO  mapred.LocalJobRunner (LocalJobRunner.java:progress(200))
- http://lucene.zones.apache.org:8080/hudson/job/Hadoop-Nightly/ws/trunk/build/test/data/TestJobControlData/indir/data.txt
:0+33554432
    [junit] 2007-05-30 11:36:14,010 INFO  mapred.LocalJobRunner (LocalJobRunner.java:progress(200))
- http://lucene.zones.apache.org:8080/hudson/job/Hadoop-Nightly/ws/trunk/build/test/data/TestJobControlData/indir/data.txt
:0+33554432
    [junit] 2007-05-30 11:36:15,025 INFO  mapred.LocalJobRunner (LocalJobRunner.java:progress(200))
- http://lucene.zones.apache.org:8080/hudson/job/Hadoop-Nightly/ws/trunk/build/test/data/TestJobControlData/indir/data.txt
:0+33554432
    [junit] 2007-05-30 11:36:15,610 INFO  mapred.LocalJobRunner (LocalJobRunner.java:progress(200))
- http://lucene.zones.apache.org:8080/hudson/job/Hadoop-Nightly/ws/trunk/build/test/data/TestJobControlData/indir/data.txt
:0+33554432
    [junit] 2007-05-30 11:36:16,029 INFO  mapred.LocalJobRunner (LocalJobRunner.java:progress(200))
- http://lucene.zones.apache.org:8080/hudson/job/Hadoop-Nightly/ws/trunk/build/test/data/TestJobControlData/indir/data.txt
:0+33554432
    [junit] 2007-05-30 11:36:16,619 INFO  mapred.LocalJobRunner (LocalJobRunner.java:progress(200))
- http://lucene.zones.apache.org:8080/hudson/job/Hadoop-Nightly/ws/trunk/build/test/data/TestJobControlData/indir/data.txt
:0+33554432
    [junit] Jobs in waiting state: 2
    [junit] Jobs in ready state: 0
    [junit] Jobs in running state: 2
    [junit] Jobs in success state: 0
    [junit] Jobs in failed state: 0


    [junit] 2007-05-30 11:36:17,088 INFO  mapred.LocalJobRunner (LocalJobRunner.java:progress(200))
- http://lucene.zones.apache.org:8080/hudson/job/Hadoop-Nightly/ws/trunk/build/test/data/TestJobControlData/indir/data.txt
:0+33554432
    [junit] 2007-05-30 11:36:17,640 INFO  mapred.LocalJobRunner (LocalJobRunner.java:progress(200))
- http://lucene.zones.apache.org:8080/hudson/job/Hadoop-Nightly/ws/trunk/build/test/data/TestJobControlData/indir/data.txt
:0+33554432
    [junit] 2007-05-30 11:36:18,089 INFO  mapred.LocalJobRunner (LocalJobRunner.java:progress(200))
- http://lucene.zones.apache.org:8080/hudson/job/Hadoop-Nightly/ws/trunk/build/test/data/TestJobControlData/indir/data.txt
:0+33554432
    [junit] 2007-05-30 11:36:18,740 INFO  mapred.LocalJobRunner (LocalJobRunner.java:progress(200))
- http://lucene.zones.apache.org:8080/hudson/job/Hadoop-Nightly/ws/trunk/build/test/data/TestJobControlData/indir/data.txt
:0+33554432
    [junit] 2007-05-30 11:36:19,099 INFO  mapred.LocalJobRunner (LocalJobRunner.java:progress(200))
- http://lucene.zones.apache.org:8080/hudson/job/Hadoop-Nightly/ws/trunk/build/test/data/TestJobControlData/indir/data.txt
:0+33554432
    [junit] 2007-05-30 11:36:19,307 WARN  mapred.LocalJobRunner (LocalJobRunner.java:run(176))
- job_tda653
    [junit] java.io.IOException: Target build/test/mapred/local/map_0000/file.out already
exists
    [junit] 	at org.apache.hadoop.fs.FileUtil.checkDest(FileUtil.java:249)
    [junit] 	at org.apache.hadoop.fs.FileUtil.copy(FileUtil.java:93)
    [junit] 	at org.apache.hadoop.fs.RawLocalFileSystem.rename(RawLocalFileSystem.java:212)
    [junit] 	at org.apache.hadoop.fs.ChecksumFileSystem.rename(ChecksumFileSystem.java:482)
    [junit] 	at org.apache.hadoop.mapred.MapTask$MapOutputBuffer.mergeParts(MapTask.java:506)
    [junit] 	at org.apache.hadoop.mapred.MapTask$MapOutputBuffer.flush(MapTask.java:606)
    [junit] 	at org.apache.hadoop.mapred.MapTask.run(MapTask.java:188)
    [junit] 	at org.apache.hadoop.mapred.LocalJobRunner$Job.run(LocalJobRunner.java:131)
    [junit] 2007-05-30 11:36:19,603 INFO  mapred.LocalJobRunner (LocalJobRunner.java:progress(200))
- http://lucene.zones.apache.org:8080/hudson/job/Hadoop-Nightly/ws/trunk/build/test/data/TestJobControlData/indir/data.txt
:0+33554432
    [junit] 2007-05-30 11:36:19,627 INFO  mapred.MapTask (MapTask.java:run(120)) - numReduceTasks:
1
    [junit] 2007-05-30 11:36:20,749 INFO  mapred.LocalJobRunner (LocalJobRunner.java:progress(200))
- http://lucene.zones.apache.org:8080/hudson/job/Hadoop-Nightly/ws/trunk/build/test/data/TestJobControlData/indir/data.txt
:33554432+7292041
    [junit] 2007-05-30 11:36:20,835 INFO  mapred.LocalJobRunner (LocalJobRunner.java:progress(200))
- http://lucene.zones.apache.org:8080/hudson/job/Hadoop-Nightly/ws/trunk/build/test/data/TestJobControlData/indir/data.txt
:33554432+7292041
    [junit] Jobs in waiting state: 2
    [junit] Jobs in ready state: 0
    [junit] Jobs in running state: 2
    [junit] Jobs in success state: 0
    [junit] Jobs in failed state: 0


    [junit] 2007-05-30 11:36:22,296 INFO  fs.FSInputChecker (ChecksumFileSystem.java:readBuffer(225))
- Found checksum error: org.apache.hadoop.fs.ChecksumException: Checksum error: build/test/mapred/local/reduce_8vm9sj/map_0.out
at 7336448
    [junit] 	at org.apache.hadoop.fs.ChecksumFileSystem$FSInputChecker.verifySum(ChecksumFileSystem.java:264)
    [junit] 	at org.apache.hadoop.fs.ChecksumFileSystem$FSInputChecker.readBuffer(ChecksumFileSystem.java:219)
    [junit] 	at org.apache.hadoop.fs.ChecksumFileSystem$FSInputChecker.read(ChecksumFileSystem.java:175)
    [junit] 	at org.apache.hadoop.fs.FSDataInputStream$PositionCache.read(FSDataInputStream.java:41)
    [junit] 	at java.io.BufferedInputStream.fill(BufferedInputStream.java:218)
    [junit] 	at java.io.BufferedInputStream.read1(BufferedInputStream.java:256)
    [junit] 	at java.io.BufferedInputStream.read(BufferedInputStream.java:313)
    [junit] 	at java.io.DataInputStream.readFully(DataInputStream.java:176)
    [junit] 	at java.io.DataInputStream.readFully(DataInputStream.java:152)
    [junit] 	at org.apache.hadoop.io.SequenceFile$UncompressedBytes.reset(SequenceFile.java:427)
    [junit] 	at org.apache.hadoop.io.SequenceFile$UncompressedBytes.access$700(SequenceFile.java:414)
    [junit] 	at org.apache.hadoop.io.SequenceFile$Reader.nextRawValue(SequenceFile.java:1667)
    [junit] 	at org.apache.hadoop.io.SequenceFile$Sorter$SegmentDescriptor.nextRawValue(SequenceFile.java:2592)
    [junit] 	at org.apache.hadoop.io.SequenceFile$Sorter$MergeQueue.next(SequenceFile.java:2354)
    [junit] 	at org.apache.hadoop.mapred.ReduceTask$ValuesIterator.getNext(ReduceTask.java:205)
    [junit] 	at org.apache.hadoop.mapred.ReduceTask$ValuesIterator.next(ReduceTask.java:168)
    [junit] 	at org.apache.hadoop.mapred.ReduceTask$ReduceValuesIterator.next(ReduceTask.java:243)
    [junit] 	at org.apache.hadoop.mapred.jobcontrol.TestJobControl$DataCopy.reduce(TestJobControl.java:98)
    [junit] 	at org.apache.hadoop.mapred.ReduceTask.run(ReduceTask.java:353)
    [junit] 	at org.apache.hadoop.mapred.LocalJobRunner$Job.run(LocalJobRunner.java:162)

    [junit] 2007-05-30 11:36:22,360 WARN  fs.FileSystem (LocalFileSystem.java:reportChecksumFailure(92))
- Moving bad file http://lucene.zones.apache.org:8080/hudson/job/Hadoop-Nightly/ws/trunk/build/test/mapred/local/reduce_8vm9sj/map_0.out
 to /export/home/hudson/bad_files/map_0.out.-1342284223
    [junit] 2007-05-30 11:36:22,441 WARN  mapred.LocalJobRunner (LocalJobRunner.java:run(176))
- job_n2u7ga
    [junit] java.lang.RuntimeException: org.apache.hadoop.fs.ChecksumException: Checksum error:
build/test/mapred/local/reduce_8vm9sj/map_0.out at 7336448
    [junit] 	at org.apache.hadoop.mapred.ReduceTask$ValuesIterator.next(ReduceTask.java:170)
    [junit] 	at org.apache.hadoop.mapred.ReduceTask$ReduceValuesIterator.next(ReduceTask.java:243)
    [junit] 	at org.apache.hadoop.mapred.jobcontrol.TestJobControl$DataCopy.reduce(TestJobControl.java:98)
    [junit] 	at org.apache.hadoop.mapred.ReduceTask.run(ReduceTask.java:353)
    [junit] 	at org.apache.hadoop.mapred.LocalJobRunner$Job.run(LocalJobRunner.java:162)
    [junit] Caused by: org.apache.hadoop.fs.ChecksumException: Checksum error: build/test/mapred/local/reduce_8vm9sj/map_0.out
at 7336448
    [junit] 	at org.apache.hadoop.fs.ChecksumFileSystem$FSInputChecker.verifySum(ChecksumFileSystem.java:264)
    [junit] 	at org.apache.hadoop.fs.ChecksumFileSystem$FSInputChecker.readBuffer(ChecksumFileSystem.java:219)
    [junit] 	at org.apache.hadoop.fs.ChecksumFileSystem$FSInputChecker.read(ChecksumFileSystem.java:175)
    [junit] 	at org.apache.hadoop.fs.FSDataInputStream$PositionCache.read(FSDataInputStream.java:41)
    [junit] 	at java.io.BufferedInputStream.fill(BufferedInputStream.java:218)
    [junit] 	at java.io.BufferedInputStream.read1(BufferedInputStream.java:256)
    [junit] 	at java.io.BufferedInputStream.read(BufferedInputStream.java:313)
    [junit] 	at java.io.DataInputStream.readFully(DataInputStream.java:176)
    [junit] 	at java.io.DataInputStream.readFully(DataInputStream.java:152)
    [junit] 	at org.apache.hadoop.io.SequenceFile$UncompressedBytes.reset(SequenceFile.java:427)
    [junit] 	at org.apache.hadoop.io.SequenceFile$UncompressedBytes.access$700(SequenceFile.java:414)
    [junit] 	at org.apache.hadoop.io.SequenceFile$Reader.nextRawValue(SequenceFile.java:1667)
    [junit] 	at org.apache.hadoop.io.SequenceFile$Sorter$SegmentDescriptor.nextRawValue(SequenceFile.java:2592)
    [junit] 	at org.apache.hadoop.io.SequenceFile$Sorter$MergeQueue.next(SequenceFile.java:2354)
    [junit] 	at org.apache.hadoop.mapred.ReduceTask$ValuesIterator.getNext(ReduceTask.java:205)
    [junit] 	at org.apache.hadoop.mapred.ReduceTask$ValuesIterator.next(ReduceTask.java:168)
    [junit] 	... 4 more
    [junit] Jobs in waiting state: 0
    [junit] Jobs in ready state: 0
    [junit] Jobs in running state: 1
    [junit] Jobs in success state: 0
    [junit] Jobs in failed state: 3


    [junit] Jobs are all done???
    [junit] Jobs in waiting state: 0
    [junit] Jobs in ready state: 0
    [junit] Jobs in running state: 0
    [junit] Jobs in success state: 0
    [junit] Jobs in failed state: 4


    [junit] Tests run: 1, Failures: 0, Errors: 0, Time elapsed: 30.884 sec
    [junit] Running org.apache.hadoop.mapred.pipes.TestPipes
    [junit] 2007-05-30 11:36:32,606 INFO  pipes.TestPipes (TestPipes.java:testPipes(47)) -
compile.c++ is not defined, so skipping TestPipes
    [junit] Tests run: 1, Failures: 0, Errors: 0, Time elapsed: 0.044 sec
    [junit] Running org.apache.hadoop.net.TestNetworkTopology
    [junit] 2007-05-30 11:36:33,411 INFO  net.NetworkTopology (NetworkTopology.java:add(315))
- Adding a new node: /d1/r1/h1:5020
    [junit] 2007-05-30 11:36:33,417 INFO  net.NetworkTopology (NetworkTopology.java:add(315))
- Adding a new node: /d1/r1/h2:5020
    [junit] 2007-05-30 11:36:33,418 INFO  net.NetworkTopology (NetworkTopology.java:add(315))
- Adding a new node: /d1/r2/h3:5020
    [junit] 2007-05-30 11:36:33,418 INFO  net.NetworkTopology (NetworkTopology.java:add(315))
- Adding a new node: /d1/r2/h4:5020
    [junit] 2007-05-30 11:36:33,419 INFO  net.NetworkTopology (NetworkTopology.java:add(315))
- Adding a new node: /d1/r2/h5:5020
    [junit] 2007-05-30 11:36:33,420 INFO  net.NetworkTopology (NetworkTopology.java:add(315))
- Adding a new node: /d2/r3/h6:5020
    [junit] 2007-05-30 11:36:33,421 INFO  net.NetworkTopology (NetworkTopology.java:add(315))
- Adding a new node: /d2/r3/h7:5020
    [junit] 2007-05-30 11:36:33,463 INFO  net.NetworkTopology (NetworkTopology.java:remove(337))
- Removing a node: /d1/r1/h1:5020
    [junit] 2007-05-30 11:36:33,465 INFO  net.NetworkTopology (NetworkTopology.java:remove(337))
- Removing a node: /d1/r1/h2:5020
    [junit] 2007-05-30 11:36:33,466 INFO  net.NetworkTopology (NetworkTopology.java:remove(337))
- Removing a node: /d1/r2/h3:5020
    [junit] 2007-05-30 11:36:33,467 INFO  net.NetworkTopology (NetworkTopology.java:remove(337))
- Removing a node: /d1/r2/h4:5020
    [junit] 2007-05-30 11:36:33,468 INFO  net.NetworkTopology (NetworkTopology.java:remove(337))
- Removing a node: /d1/r2/h5:5020
    [junit] 2007-05-30 11:36:33,469 INFO  net.NetworkTopology (NetworkTopology.java:remove(337))
- Removing a node: /d2/r3/h6:5020
    [junit] 2007-05-30 11:36:33,470 INFO  net.NetworkTopology (NetworkTopology.java:remove(337))
- Removing a node: /d2/r3/h7:5020
    [junit] 2007-05-30 11:36:33,472 INFO  net.NetworkTopology (NetworkTopology.java:add(315))
- Adding a new node: /d1/r1/h1:5020
    [junit] 2007-05-30 11:36:33,473 INFO  net.NetworkTopology (NetworkTopology.java:add(315))
- Adding a new node: /d1/r1/h2:5020
    [junit] 2007-05-30 11:36:33,474 INFO  net.NetworkTopology (NetworkTopology.java:add(315))
- Adding a new node: /d1/r2/h3:5020
    [junit] 2007-05-30 11:36:33,475 INFO  net.NetworkTopology (NetworkTopology.java:add(315))
- Adding a new node: /d1/r2/h4:5020
    [junit] 2007-05-30 11:36:33,476 INFO  net.NetworkTopology (NetworkTopology.java:add(315))
- Adding a new node: /d1/r2/h5:5020
    [junit] 2007-05-30 11:36:33,477 INFO  net.NetworkTopology (NetworkTopology.java:add(315))
- Adding a new node: /d2/r3/h6:5020
    [junit] 2007-05-30 11:36:33,479 INFO  net.NetworkTopology (NetworkTopology.java:add(315))
- Adding a new node: /d2/r3/h7:5020
    [junit] Tests run: 5, Failures: 0, Errors: 0, Time elapsed: 0.055 sec
    [junit] Running org.apache.hadoop.record.TestBuffer
    [junit] Tests run: 6, Failures: 0, Errors: 0, Time elapsed: 0.083 sec
    [junit] Running org.apache.hadoop.record.TestRecordIO
    [junit] Illustrating toString bugT,102,4567,99344109427290,3.1449999809265137,1.5234,'random
text,#000102030405060708090a0b0c0d0e0f101112131415161718191a1b1c1d1e1f202122232425262728292a2b2c2d2e2f303132333435363738393a3b3c3d3e3f404142434445464748494a4b4c4d4e4f505152535455565758595a5b5c5d5e5f606162636465666768696a6b6c6d6e6f707172737475767778797a7b7c7d7e7f808182838485868788898a8b8c8d8e8f909192939495969798999a9b9c9d9e9fa0a1a2a3a4a5a6a7a8a9aaabacadaeafb0b1b2b3b4b5b6b7b8b9babbbcbdbebfc0c1c2c3c4c5c6c7c8c9cacbcccdcecfd0d1d2d3d4d5d6d7d8d9dadbdcdddedfe0e1e2e3e4e5e6e7e8e9eaebecedeeeff0f1f2f3f4f5f6f7f8f9fafbfcfdfeff,v{},m{},s{'other
random text}

    [junit] Illustrating toString bugT,102,4567,99344109427290,3.1449999809265137,1.5234,'random
text,#000102030405060708090a0b0c0d0e0f101112131415161718191a1b1c1d1e1f202122232425262728292a2b2c2d2e2f303132333435363738393a3b3c3d3e3f404142434445464748494a4b4c4d4e4f505152535455565758595a5b5c5d5e5f606162636465666768696a6b6c6d6e6f707172737475767778797a7b7c7d7e7f808182838485868788898a8b8c8d8e8f909192939495969798999a9b9c9d9e9fa0a1a2a3a4a5a6a7a8a9aaabacadaeafb0b1b2b3b4b5b6b7b8b9babbbcbdbebfc0c1c2c3c4c5c6c7c8c9cacbcccdcecfd0d1d2d3d4d5d6d7d8d9dadbdcdddedfe0e1e2e3e4e5e6e7e8e9eaebecedeeeff0f1f2f3f4f5f6f7f8f9fafbfcfdfeff,v{},m{},s{'other
random text}

    [junit] Tests run: 5, Failures: 0, Errors: 0, Time elapsed: 0.156 sec
    [junit] Running org.apache.hadoop.record.TestRecordMR
    [junit] 2007-05-30 11:36:35,527 INFO  mapred.FileInputFormat (FileInputFormat.java:validateInput(142))
- Total input paths to process : 1
    [junit] 2007-05-30 11:36:35,819 INFO  mapred.JobClient (JobClient.java:runJob(552)) -
Running job: job_ubzvum
    [junit] 2007-05-30 11:36:35,880 INFO  mapred.MapTask (MapTask.java:run(120)) - numReduceTasks:
1
    [junit] 2007-05-30 11:36:36,019 INFO  mapred.LocalJobRunner (LocalJobRunner.java:progress(200))
- http://lucene.zones.apache.org:8080/hudson/job/Hadoop-Nightly/ws/trunk/mapred.loadtest/genins/answer.key
:0+190
    [junit] 2007-05-30 11:36:36,097 INFO  mapred.LocalJobRunner (LocalJobRunner.java:progress(200))
- reduce > reduce
    [junit] 2007-05-30 11:36:36,101 INFO  mapred.TaskRunner (Task.java:saveTaskOutput(331))
- Saved output of task 'reduce_drxanx' to http://lucene.zones.apache.org:8080/hudson/job/Hadoop-Nightly/ws/trunk/mapred.loadtest/genouts

    [junit] 2007-05-30 11:36:36,828 INFO  mapred.JobClient (JobClient.java:runJob(613)) -
Job complete: job_ubzvum
    [junit] 2007-05-30 11:36:36,829 INFO  mapred.JobClient (Counters.java:log(359)) - Counters:
7
    [junit] 2007-05-30 11:36:36,834 INFO  mapred.JobClient (Counters.java:log(363)) -   Map-Reduce
Framework
    [junit] 2007-05-30 11:36:36,835 INFO  mapred.JobClient (Counters.java:log(365)) -    
Map input records=10
    [junit] 2007-05-30 11:36:36,836 INFO  mapred.JobClient (Counters.java:log(365)) -    
Map output records=100
    [junit] 2007-05-30 11:36:36,836 INFO  mapred.JobClient (Counters.java:log(365)) -    
Map input bytes=100
    [junit] 2007-05-30 11:36:36,837 INFO  mapred.JobClient (Counters.java:log(365)) -    
Map output bytes=698
    [junit] 2007-05-30 11:36:36,837 INFO  mapred.JobClient (Counters.java:log(365)) -    
Reduce input groups=100
    [junit] 2007-05-30 11:36:36,838 INFO  mapred.JobClient (Counters.java:log(365)) -    
Reduce input records=100
    [junit] 2007-05-30 11:36:36,839 INFO  mapred.JobClient (Counters.java:log(365)) -    
Reduce output records=100
    [junit] 2007-05-30 11:36:36,889 INFO  mapred.FileInputFormat (FileInputFormat.java:validateInput(142))
- Total input paths to process : 1
    [junit] 2007-05-30 11:36:36,958 INFO  mapred.JobClient (JobClient.java:runJob(552)) -
Running job: job_8hbwi1
    [junit] 2007-05-30 11:36:36,993 INFO  mapred.MapTask (MapTask.java:run(120)) - numReduceTasks:
1
    [junit] 2007-05-30 11:36:37,021 INFO  mapred.LocalJobRunner (LocalJobRunner.java:progress(200))
- http://lucene.zones.apache.org:8080/hudson/job/Hadoop-Nightly/ws/trunk/mapred.loadtest/genouts/part-00000
:0+1093
    [junit] 2007-05-30 11:36:37,058 INFO  mapred.LocalJobRunner (LocalJobRunner.java:progress(200))
- reduce > reduce
    [junit] 2007-05-30 11:36:37,062 INFO  mapred.TaskRunner (Task.java:saveTaskOutput(331))
- Saved output of task 'reduce_pdrwet' to http://lucene.zones.apache.org:8080/hudson/job/Hadoop-Nightly/ws/trunk/mapred.loadtest/intermediateouts

    [junit] 2007-05-30 11:36:37,968 INFO  mapred.JobClient (JobClient.java:runJob(613)) -
Job complete: job_8hbwi1
    [junit] 2007-05-30 11:36:37,969 INFO  mapred.JobClient (Counters.java:log(359)) - Counters:
7
    [junit] 2007-05-30 11:36:37,970 INFO  mapred.JobClient (Counters.java:log(363)) -   Map-Reduce
Framework
    [junit] 2007-05-30 11:36:37,970 INFO  mapred.JobClient (Counters.java:log(365)) -    
Map input records=100
    [junit] 2007-05-30 11:36:37,971 INFO  mapred.JobClient (Counters.java:log(365)) -    
Map output records=100
    [junit] 2007-05-30 11:36:37,971 INFO  mapred.JobClient (Counters.java:log(365)) -    
Map input bytes=1000
    [junit] 2007-05-30 11:36:37,972 INFO  mapred.JobClient (Counters.java:log(365)) -    
Map output bytes=300
    [junit] 2007-05-30 11:36:37,972 INFO  mapred.JobClient (Counters.java:log(365)) -    
Reduce input groups=10
    [junit] 2007-05-30 11:36:37,973 INFO  mapred.JobClient (Counters.java:log(365)) -    
Reduce input records=100
    [junit] 2007-05-30 11:36:37,973 INFO  mapred.JobClient (Counters.java:log(365)) -    
Reduce output records=10
    [junit] 2007-05-30 11:36:38,047 INFO  mapred.FileInputFormat (FileInputFormat.java:validateInput(142))
- Total input paths to process : 1
    [junit] 2007-05-30 11:36:38,253 INFO  mapred.JobClient (JobClient.java:runJob(552)) -
Running job: job_cjslbv
    [junit] 2007-05-30 11:36:38,335 INFO  mapred.MapTask (MapTask.java:run(120)) - numReduceTasks:
1
    [junit] 2007-05-30 11:36:38,351 INFO  mapred.LocalJobRunner (LocalJobRunner.java:progress(200))
- http://lucene.zones.apache.org:8080/hudson/job/Hadoop-Nightly/ws/trunk/mapred.loadtest/intermediateouts/part-00000
:0+209
    [junit] 2007-05-30 11:36:38,378 INFO  mapred.LocalJobRunner (LocalJobRunner.java:progress(200))
- reduce > reduce
    [junit] 2007-05-30 11:36:38,382 INFO  mapred.TaskRunner (Task.java:saveTaskOutput(331))
- Saved output of task 'reduce_icg6zh' to http://lucene.zones.apache.org:8080/hudson/job/Hadoop-Nightly/ws/trunk/mapred.loadtest/finalouts

    [junit] 2007-05-30 11:36:39,258 INFO  mapred.JobClient (JobClient.java:runJob(613)) -
Job complete: job_cjslbv
    [junit] 2007-05-30 11:36:39,259 INFO  mapred.JobClient (Counters.java:log(359)) - Counters:
7
    [junit] 2007-05-30 11:36:39,259 INFO  mapred.JobClient (Counters.java:log(363)) -   Map-Reduce
Framework
    [junit] 2007-05-30 11:36:39,260 INFO  mapred.JobClient (Counters.java:log(365)) -    
Map input records=10
    [junit] 2007-05-30 11:36:39,260 INFO  mapred.JobClient (Counters.java:log(365)) -    
Map output records=10
    [junit] 2007-05-30 11:36:39,261 INFO  mapred.JobClient (Counters.java:log(365)) -    
Map input bytes=116
    [junit] 2007-05-30 11:36:39,261 INFO  mapred.JobClient (Counters.java:log(365)) -    
Map output bytes=20
    [junit] 2007-05-30 11:36:39,262 INFO  mapred.JobClient (Counters.java:log(365)) -    
Reduce input groups=10
    [junit] 2007-05-30 11:36:39,262 INFO  mapred.JobClient (Counters.java:log(365)) -    
Reduce input records=10
    [junit] 2007-05-30 11:36:39,262 INFO  mapred.JobClient (Counters.java:log(365)) -    
Reduce output records=10
    [junit] Original sum: 100
    [junit] Recomputed sum: 100
    [junit] Success=true
    [junit] Tests run: 1, Failures: 0, Errors: 0, Time elapsed: 4.343 sec
    [junit] Running org.apache.hadoop.record.TestRecordWritable
    [junit] Tests run: 1, Failures: 0, Errors: 0, Time elapsed: 3.903 sec
    [junit] Running org.apache.hadoop.util.TestReflectionUtils
    [junit] Tests run: 4, Failures: 0, Errors: 0, Time elapsed: 0.709 sec

BUILD FAILED
http://lucene.zones.apache.org:8080/hudson/job/Hadoop-Nightly/ws/trunk/build.xml :483: Tests
failed!

Total time: 32 minutes 27 seconds
Recording fingerprints
Publishing Javadoc
Recording test results
Updating HADOOP-1391


Mime
View raw message