hadoop-common-dev mailing list archives

Site index · List index
Message view « Date » · « Thread »
Top « Date » · « Thread »
From hadoop-...@lucene.apache.org
Subject Hadoop nightly build failure
Date Wed, 21 Feb 2007 19:35:33 GMT

init:
    [mkdir] Created dir: /tmp/hadoop-nightly/build
    [mkdir] Created dir: /tmp/hadoop-nightly/build/classes
    [mkdir] Created dir: /tmp/hadoop-nightly/build/src
    [mkdir] Created dir: /tmp/hadoop-nightly/build/webapps/task/WEB-INF
    [mkdir] Created dir: /tmp/hadoop-nightly/build/webapps/job/WEB-INF
    [mkdir] Created dir: /tmp/hadoop-nightly/build/webapps/dfs/WEB-INF
    [mkdir] Created dir: /tmp/hadoop-nightly/build/webapps/datanode/WEB-INF
    [mkdir] Created dir: /tmp/hadoop-nightly/build/examples
    [mkdir] Created dir: /tmp/hadoop-nightly/build/test
    [mkdir] Created dir: /tmp/hadoop-nightly/build/test/classes
    [mkdir] Created dir: /tmp/hadoop-nightly/build/test/testjar
     [copy] Copying 6 files to /tmp/hadoop-nightly/build/webapps
     [copy] Copying 5 files to /tmp/hadoop-nightly/conf
     [copy] Copying /tmp/hadoop-nightly/conf/slaves.template to /tmp/hadoop-nightly/conf/slaves
     [copy] Copying /tmp/hadoop-nightly/conf/hadoop-site.xml.template to /tmp/hadoop-nightly/conf/hadoop-site.xml
     [copy] Copying /tmp/hadoop-nightly/conf/mapred-default.xml.template to /tmp/hadoop-nightly/conf/mapred-default.xml
     [copy] Copying /tmp/hadoop-nightly/conf/masters.template to /tmp/hadoop-nightly/conf/masters
     [copy] Copying /tmp/hadoop-nightly/conf/hadoop-env.sh.template to /tmp/hadoop-nightly/conf/hadoop-env.sh
     [copy] Copying 1 file to /tmp/hadoop-nightly/src/contrib
     [copy] Copying /tmp/hadoop-nightly/src/contrib/ec2/bin/hadoop-ec2-env.sh.template to
/tmp/hadoop-nightly/src/contrib/ec2/bin/hadoop-ec2-env.sh
     [exec] src/saveVersion.sh: svn: not found
     [exec] src/saveVersion.sh: svn: not found
     [exec] src/saveVersion.sh: whoami: not found

record-parser:

compile-rcc-compiler:
    [javac] Compiling 25 source files to /tmp/hadoop-nightly/build/classes
    [javac] Note: /tmp/hadoop-nightly/src/java/org/apache/hadoop/record/compiler/generated/Rcc.java
uses unchecked or unsafe operations.
    [javac] Note: Recompile with -Xlint:unchecked for details.

compile-core-classes:
    [javac] Compiling 275 source files to /tmp/hadoop-nightly/build/classes
    [javac] Note: Some input files use or override a deprecated API.
    [javac] Note: Recompile with -Xlint:deprecation for details.
    [javac] Note: Some input files use unchecked or unsafe operations.
    [javac] Note: Recompile with -Xlint:unchecked for details.

compile-core-native:

compile-core:

compile-examples:
    [javac] Compiling 6 source files to /tmp/hadoop-nightly/build/examples
    [javac] Note: Some input files use unchecked or unsafe operations.
    [javac] Note: Recompile with -Xlint:unchecked for details.

generate-test-records:

compile-core-test:
    [javac] Compiling 5 source files to /tmp/hadoop-nightly/build/test/classes
    [javac] Note: /tmp/hadoop-nightly/build/test/src/org/apache/hadoop/record/test/RecRecord1.java
uses unchecked or unsafe operations.
    [javac] Note: Recompile with -Xlint:unchecked for details.
    [javac] Compiling 72 source files to /tmp/hadoop-nightly/build/test/classes
    [javac] Note: Some input files use or override a deprecated API.
    [javac] Note: Recompile with -Xlint:deprecation for details.
    [javac] Note: Some input files use unchecked or unsafe operations.
    [javac] Note: Recompile with -Xlint:unchecked for details.
    [javac] Compiling 3 source files to /tmp/hadoop-nightly/build/test/testjar
      [jar] Building jar: /tmp/hadoop-nightly/build/test/testjar/testjob.jar
      [jar] Building jar: /tmp/hadoop-nightly/build/hadoop-nightly-test.jar
    [mkdir] Created dir: /tmp/hadoop-nightly/build/test/cache
     [copy] Copying 1 file to /tmp/hadoop-nightly/build/test/cache
     [copy] Copying 1 file to /tmp/hadoop-nightly/build/test/cache
     [copy] Copying 1 file to /tmp/hadoop-nightly/build/test/cache

test-core:
    [mkdir] Created dir: /tmp/hadoop-nightly/build/test/data
    [mkdir] Created dir: /tmp/hadoop-nightly/build/test/logs
    [junit] Running org.apache.hadoop.conf.TestConfiguration
    [junit] Tests run: 2, Failures: 0, Errors: 0, Time elapsed: 2.768 sec
    [junit] Running org.apache.hadoop.dfs.TestCheckpoint
    [junit] Tests run: 1, Failures: 0, Errors: 1, Time elapsed: 41.771 sec
    [junit] Test org.apache.hadoop.dfs.TestCheckpoint FAILED
    [junit] Running org.apache.hadoop.dfs.TestDFSMkdirs
    [junit] Tests run: 1, Failures: 0, Errors: 0, Time elapsed: 19.11 sec
    [junit] Running org.apache.hadoop.dfs.TestDFSShell
    [junit] Tests run: 1, Failures: 0, Errors: 0, Time elapsed: 25.024 sec
    [junit] Running org.apache.hadoop.dfs.TestDFSShellGenericOptions
    [junit] Tests run: 1, Failures: 0, Errors: 0, Time elapsed: 71.768 sec
    [junit] Running org.apache.hadoop.dfs.TestDecommission
    [junit] Tests run: 1, Failures: 0, Errors: 0, Time elapsed: 69.119 sec
    [junit] Running org.apache.hadoop.dfs.TestFileCorruption
    [junit] Tests run: 1, Failures: 0, Errors: 1, Time elapsed: 117.932 sec
    [junit] Data node crashed:
    [junit] java.lang.NullPointerException
    [junit] 	at org.apache.hadoop.ipc.Client$Connection.sendParam(Client.java:306)
    [junit] 	at org.apache.hadoop.ipc.Client.call(Client.java:457)
    [junit] 	at org.apache.hadoop.ipc.RPC$Invoker.invoke(RPC.java:164)
    [junit] 	at org.apache.hadoop.dfs.$Proxy0.register(Unknown Source)
    [junit] 	at org.apache.hadoop.dfs.DataNode.register(DataNode.java:325)
    [junit] 	at org.apache.hadoop.dfs.DataNode.<init>(DataNode.java:211)
    [junit] 	at org.apache.hadoop.dfs.MiniDFSCluster$DataNodeRunner.run(MiniDFSCluster.java:124)
    [junit] 	at java.lang.Thread.run(Thread.java:595)
    [junit] Test org.apache.hadoop.dfs.TestFileCorruption FAILED
    [junit] Running org.apache.hadoop.dfs.TestFsck
    [junit] Tests run: 2, Failures: 0, Errors: 2, Time elapsed: 233.527 sec
    [junit] Data node crashed:
    [junit] java.lang.NullPointerException
    [junit] 	at org.apache.hadoop.ipc.Client$Connection.sendParam(Client.java:306)
    [junit] 	at org.apache.hadoop.ipc.Client.call(Client.java:457)
    [junit] 	at org.apache.hadoop.ipc.RPC$Invoker.invoke(RPC.java:164)
    [junit] 	at org.apache.hadoop.dfs.$Proxy0.getProtocolVersion(Unknown Source)
    [junit] 	at org.apache.hadoop.ipc.RPC.getProxy(RPC.java:248)
    [junit] 	at org.apache.hadoop.ipc.RPC.waitForProxy(RPC.java:227)
    [junit] 	at org.apache.hadoop.dfs.DataNode.<init>(DataNode.java:254)
    [junit] 	at org.apache.hadoop.dfs.DataNode.<init>(DataNode.java:197)
    [junit] 	at org.apache.hadoop.dfs.MiniDFSCluster$DataNodeRunner.run(MiniDFSCluster.java:124)
    [junit] 	at java.lang.Thread.run(Thread.java:595)
    [junit] Data node crashed:
    [junit] java.lang.NullPointerException
    [junit] 	at org.apache.hadoop.ipc.Client$Connection.sendParam(Client.java:306)
    [junit] 	at org.apache.hadoop.ipc.Client.call(Client.java:457)
    [junit] 	at org.apache.hadoop.ipc.RPC$Invoker.invoke(RPC.java:164)
    [junit] 	at org.apache.hadoop.dfs.$Proxy0.getProtocolVersion(Unknown Source)
    [junit] 	at org.apache.hadoop.ipc.RPC.getProxy(RPC.java:248)
    [junit] 	at org.apache.hadoop.ipc.RPC.waitForProxy(RPC.java:227)
    [junit] 	at org.apache.hadoop.dfs.DataNode.<init>(DataNode.java:254)
    [junit] 	at org.apache.hadoop.dfs.DataNode.<init>(DataNode.java:197)
    [junit] 	at org.apache.hadoop.dfs.MiniDFSCluster$DataNodeRunner.run(MiniDFSCluster.java:124)
    [junit] 	at java.lang.Thread.run(Thread.java:595)
    [junit] Test org.apache.hadoop.dfs.TestFsck FAILED
    [junit] Running org.apache.hadoop.dfs.TestLocalDFS
    [junit] Tests run: 1, Failures: 0, Errors: 0, Time elapsed: 17.202 sec
    [junit] Running org.apache.hadoop.dfs.TestPread
    [junit] Tests run: 2, Failures: 0, Errors: 0, Time elapsed: 18.945 sec
    [junit] Running org.apache.hadoop.dfs.TestReplication
    [junit] Tests run: 1, Failures: 0, Errors: 1, Time elapsed: 30.686 sec
    [junit] Test org.apache.hadoop.dfs.TestReplication FAILED
    [junit] Running org.apache.hadoop.dfs.TestReplicationPolicy
    [junit] Tests run: 8, Failures: 0, Errors: 0, Time elapsed: 0.052 sec
    [junit] Running org.apache.hadoop.dfs.TestRestartDFS
    [junit] Tests run: 1, Failures: 0, Errors: 1, Time elapsed: 122.382 sec
    [junit] Test org.apache.hadoop.dfs.TestRestartDFS FAILED
    [junit] Running org.apache.hadoop.dfs.TestSeekBug
    [junit] Tests run: 2, Failures: 0, Errors: 0, Time elapsed: 18.051 sec
    [junit] Running org.apache.hadoop.dfs.TestSmallBlock
    [junit] Tests run: 1, Failures: 0, Errors: 0, Time elapsed: 19.246 sec
    [junit] Running org.apache.hadoop.fs.TestCopyFiles
    [junit] Tests run: 4, Failures: 0, Errors: 3, Time elapsed: 338.771 sec
    [junit] Test org.apache.hadoop.fs.TestCopyFiles FAILED
    [junit] Running org.apache.hadoop.fs.TestDFSIO
    [junit] Tests run: 1, Failures: 0, Errors: 0, Time elapsed: 9.229 sec
    [junit] Running org.apache.hadoop.fs.TestFileSystem
    [junit] Tests run: 1, Failures: 0, Errors: 0, Time elapsed: 5.425 sec
    [junit] Running org.apache.hadoop.fs.TestGlobPaths
    [junit] Tests run: 1, Failures: 0, Errors: 0, Time elapsed: 16.353 sec
    [junit] Running org.apache.hadoop.fs.TestLocalFileSystem
    [junit] Tests run: 1, Failures: 0, Errors: 0, Time elapsed: 0.623 sec
    [junit] Running org.apache.hadoop.fs.TestPath
    [junit] Tests run: 7, Failures: 0, Errors: 0, Time elapsed: 0.031 sec
    [junit] Running org.apache.hadoop.fs.s3.TestINode
    [junit] Tests run: 3, Failures: 0, Errors: 0, Time elapsed: 0.012 sec
    [junit] Running org.apache.hadoop.fs.s3.TestInMemoryS3FileSystem
    [junit] Tests run: 22, Failures: 0, Errors: 0, Time elapsed: 1.686 sec
    [junit] Running org.apache.hadoop.io.TestArrayFile
    [junit] Tests run: 2, Failures: 0, Errors: 0, Time elapsed: 4.28 sec
    [junit] Running org.apache.hadoop.io.TestBytesWritable
    [junit] Tests run: 3, Failures: 0, Errors: 0, Time elapsed: 0.013 sec
    [junit] Running org.apache.hadoop.io.TestMD5Hash
    [junit] Tests run: 1, Failures: 0, Errors: 0, Time elapsed: 0.297 sec
    [junit] Running org.apache.hadoop.io.TestSequenceFile
    [junit] Tests run: 3, Failures: 0, Errors: 0, Time elapsed: 21.702 sec
    [junit] Running org.apache.hadoop.io.TestSetFile
    [junit] Tests run: 1, Failures: 0, Errors: 0, Time elapsed: 7.408 sec
    [junit] Running org.apache.hadoop.io.TestText
    [junit] Tests run: 7, Failures: 0, Errors: 0, Time elapsed: 0.823 sec
    [junit] Running org.apache.hadoop.io.TestTextNonUTF8
    [junit] Tests run: 1, Failures: 0, Errors: 0, Time elapsed: 0.018 sec
    [junit] Running org.apache.hadoop.io.TestUTF8
    [junit] Tests run: 3, Failures: 0, Errors: 0, Time elapsed: 0.171 sec
    [junit] Running org.apache.hadoop.io.TestVersionedWritable
    [junit] Tests run: 3, Failures: 0, Errors: 0, Time elapsed: 0.032 sec
    [junit] Running org.apache.hadoop.io.TestWritable
    [junit] Tests run: 1, Failures: 0, Errors: 0, Time elapsed: 0.01 sec
    [junit] Running org.apache.hadoop.io.compress.TestCodec
    [junit] Tests run: 3, Failures: 0, Errors: 0, Time elapsed: 2.581 sec
    [junit] Running org.apache.hadoop.io.compress.TestCodecFactory
    [junit] Tests run: 1, Failures: 0, Errors: 0, Time elapsed: 0.582 sec
    [junit] Running org.apache.hadoop.ipc.TestIPC
    [junit] Tests run: 2, Failures: 0, Errors: 0, Time elapsed: 0.768 sec
    [junit] Running org.apache.hadoop.ipc.TestRPC
    [junit] Tests run: 1, Failures: 0, Errors: 0, Time elapsed: 0.155 sec
    [junit] Running org.apache.hadoop.mapred.TestEmptyJobWithDFS
    [junit] Tests run: 1, Failures: 0, Errors: 1, Time elapsed: 796.344 sec
    [junit] Test org.apache.hadoop.mapred.TestEmptyJobWithDFS FAILED
    [junit] Running org.apache.hadoop.mapred.TestMapRed
    [junit] Tests run: 4, Failures: 0, Errors: 0, Time elapsed: 21.436 sec
    [junit] Running org.apache.hadoop.mapred.TestMiniMRBringup
    [junit] Tests run: 1, Failures: 0, Errors: 0, Time elapsed: 5.691 sec
    [junit] Running org.apache.hadoop.mapred.TestMiniMRClasspath

BUILD FAILED
/tmp/hadoop-nightly/build.xml:433: Could not delete temporary properties file.

Total time: 9,478 minutes 7 seconds



Mime
View raw message