hadoop-common-dev mailing list archives

Site index · List index
Message view « Date » · « Thread »
Top « Date » · « Thread »
From hadoop-...@lucene.apache.org
Subject Hadoop nightly build failure
Date Mon, 12 Feb 2007 06:00:44 GMT

init:
    [mkdir] Created dir: /tmp/hadoop-nightly/build
    [mkdir] Created dir: /tmp/hadoop-nightly/build/classes
    [mkdir] Created dir: /tmp/hadoop-nightly/build/src
    [mkdir] Created dir: /tmp/hadoop-nightly/build/webapps/task/WEB-INF
    [mkdir] Created dir: /tmp/hadoop-nightly/build/webapps/job/WEB-INF
    [mkdir] Created dir: /tmp/hadoop-nightly/build/webapps/dfs/WEB-INF
    [mkdir] Created dir: /tmp/hadoop-nightly/build/webapps/datanode/WEB-INF
    [mkdir] Created dir: /tmp/hadoop-nightly/build/examples
    [mkdir] Created dir: /tmp/hadoop-nightly/build/test
    [mkdir] Created dir: /tmp/hadoop-nightly/build/test/classes
    [mkdir] Created dir: /tmp/hadoop-nightly/build/test/testjar
     [copy] Copying 6 files to /tmp/hadoop-nightly/build/webapps
     [copy] Copying 5 files to /tmp/hadoop-nightly/conf
     [copy] Copying /tmp/hadoop-nightly/conf/slaves.template to /tmp/hadoop-nightly/conf/slaves
     [copy] Copying /tmp/hadoop-nightly/conf/hadoop-site.xml.template to /tmp/hadoop-nightly/conf/hadoop-site.xml
     [copy] Copying /tmp/hadoop-nightly/conf/mapred-default.xml.template to /tmp/hadoop-nightly/conf/mapred-default.xml
     [copy] Copying /tmp/hadoop-nightly/conf/masters.template to /tmp/hadoop-nightly/conf/masters
     [copy] Copying /tmp/hadoop-nightly/conf/hadoop-env.sh.template to /tmp/hadoop-nightly/conf/hadoop-env.sh
     [copy] Copying 1 file to /tmp/hadoop-nightly/src/contrib
     [copy] Copying /tmp/hadoop-nightly/src/contrib/ec2/bin/hadoop-ec2-env.sh.template to
/tmp/hadoop-nightly/src/contrib/ec2/bin/hadoop-ec2-env.sh
     [exec] src/saveVersion.sh: svn: not found
     [exec] src/saveVersion.sh: svn: not found
     [exec] src/saveVersion.sh: whoami: not found

record-parser:

compile-rcc-compiler:
    [javac] Compiling 25 source files to /tmp/hadoop-nightly/build/classes
    [javac] Note: /tmp/hadoop-nightly/src/java/org/apache/hadoop/record/compiler/generated/Rcc.java
uses unchecked or unsafe operations.
    [javac] Note: Recompile with -Xlint:unchecked for details.

compile-core-classes:
    [javac] Compiling 275 source files to /tmp/hadoop-nightly/build/classes
    [javac] Note: Some input files use or override a deprecated API.
    [javac] Note: Recompile with -Xlint:deprecation for details.
    [javac] Note: Some input files use unchecked or unsafe operations.
    [javac] Note: Recompile with -Xlint:unchecked for details.

compile-core-native:

compile-core:

compile-examples:
    [javac] Compiling 6 source files to /tmp/hadoop-nightly/build/examples
    [javac] Note: Some input files use unchecked or unsafe operations.
    [javac] Note: Recompile with -Xlint:unchecked for details.

generate-test-records:

compile-core-test:
    [javac] Compiling 5 source files to /tmp/hadoop-nightly/build/test/classes
    [javac] Note: /tmp/hadoop-nightly/build/test/src/org/apache/hadoop/record/test/RecRecord1.java
uses unchecked or unsafe operations.
    [javac] Note: Recompile with -Xlint:unchecked for details.
    [javac] Compiling 72 source files to /tmp/hadoop-nightly/build/test/classes
    [javac] Note: Some input files use or override a deprecated API.
    [javac] Note: Recompile with -Xlint:deprecation for details.
    [javac] Note: Some input files use unchecked or unsafe operations.
    [javac] Note: Recompile with -Xlint:unchecked for details.
    [javac] Compiling 3 source files to /tmp/hadoop-nightly/build/test/testjar
      [jar] Building jar: /tmp/hadoop-nightly/build/test/testjar/testjob.jar
      [jar] Building jar: /tmp/hadoop-nightly/build/hadoop-nightly-test.jar
    [mkdir] Created dir: /tmp/hadoop-nightly/build/test/cache
     [copy] Copying 1 file to /tmp/hadoop-nightly/build/test/cache
     [copy] Copying 1 file to /tmp/hadoop-nightly/build/test/cache
     [copy] Copying 1 file to /tmp/hadoop-nightly/build/test/cache

test-core:
    [mkdir] Created dir: /tmp/hadoop-nightly/build/test/data
    [mkdir] Created dir: /tmp/hadoop-nightly/build/test/logs
    [junit] Running org.apache.hadoop.conf.TestConfiguration
    [junit] Tests run: 2, Failures: 0, Errors: 0, Time elapsed: 0.568 sec
    [junit] Running org.apache.hadoop.dfs.TestCheckpoint
    [junit] Tests run: 1, Failures: 0, Errors: 0, Time elapsed: 287.582 sec
    [junit] Running org.apache.hadoop.dfs.TestDFSMkdirs
    [junit] Tests run: 1, Failures: 0, Errors: 0, Time elapsed: 8.334 sec
    [junit] Running org.apache.hadoop.dfs.TestDFSShell
    [junit] Tests run: 1, Failures: 0, Errors: 0, Time elapsed: 12.667 sec
    [junit] Running org.apache.hadoop.dfs.TestDFSShellGenericOptions
    [junit] Tests run: 1, Failures: 0, Errors: 0, Time elapsed: 13.227 sec
    [junit] Running org.apache.hadoop.dfs.TestDecommission
    [junit] Tests run: 1, Failures: 0, Errors: 0, Time elapsed: 55.149 sec
    [junit] Running org.apache.hadoop.dfs.TestFileCorruption
    [junit] Tests run: 1, Failures: 0, Errors: 0, Time elapsed: 12.262 sec
    [junit] Running org.apache.hadoop.dfs.TestFsck
    [junit] Tests run: 2, Failures: 0, Errors: 0, Time elapsed: 25.234 sec
    [junit] Running org.apache.hadoop.dfs.TestLocalDFS
    [junit] Tests run: 1, Failures: 0, Errors: 0, Time elapsed: 9.212 sec
    [junit] Running org.apache.hadoop.dfs.TestPread
    [junit] Tests run: 2, Failures: 0, Errors: 0, Time elapsed: 9.671 sec
    [junit] Running org.apache.hadoop.dfs.TestReplication
    [junit] Tests run: 1, Failures: 0, Errors: 0, Time elapsed: 27.146 sec
    [junit] Running org.apache.hadoop.dfs.TestReplicationPolicy
    [junit] Tests run: 8, Failures: 0, Errors: 0, Time elapsed: 0.053 sec
    [junit] Running org.apache.hadoop.dfs.TestRestartDFS
    [junit] Tests run: 1, Failures: 0, Errors: 0, Time elapsed: 23.731 sec
    [junit] Running org.apache.hadoop.dfs.TestSeekBug
    [junit] Tests run: 2, Failures: 0, Errors: 0, Time elapsed: 8.521 sec
    [junit] Running org.apache.hadoop.dfs.TestSmallBlock
    [junit] Tests run: 1, Failures: 0, Errors: 0, Time elapsed: 10.467 sec
    [junit] Running org.apache.hadoop.fs.TestCopyFiles
    [junit] Tests run: 4, Failures: 0, Errors: 0, Time elapsed: 47.293 sec
    [junit] Running org.apache.hadoop.fs.TestDFSIO
    [junit] Tests run: 1, Failures: 0, Errors: 0, Time elapsed: 5.016 sec
    [junit] Running org.apache.hadoop.fs.TestFileSystem
    [junit] Tests run: 1, Failures: 0, Errors: 0, Time elapsed: 5.071 sec
    [junit] Running org.apache.hadoop.fs.TestGlobPaths
    [junit] Tests run: 1, Failures: 0, Errors: 0, Time elapsed: 8.031 sec
    [junit] Running org.apache.hadoop.fs.TestLocalFileSystem
    [junit] Tests run: 1, Failures: 0, Errors: 0, Time elapsed: 0.439 sec
    [junit] Running org.apache.hadoop.fs.TestPath
    [junit] Tests run: 7, Failures: 0, Errors: 0, Time elapsed: 0.035 sec
    [junit] Running org.apache.hadoop.fs.s3.TestINode
    [junit] Tests run: 3, Failures: 0, Errors: 0, Time elapsed: 0.014 sec
    [junit] Running org.apache.hadoop.fs.s3.TestInMemoryS3FileSystem
    [junit] Tests run: 22, Failures: 0, Errors: 0, Time elapsed: 1.867 sec
    [junit] Running org.apache.hadoop.io.TestArrayFile
    [junit] Tests run: 2, Failures: 0, Errors: 0, Time elapsed: 4.114 sec
    [junit] Running org.apache.hadoop.io.TestBytesWritable
    [junit] Tests run: 3, Failures: 0, Errors: 0, Time elapsed: 0.014 sec
    [junit] Running org.apache.hadoop.io.TestMD5Hash
    [junit] Tests run: 1, Failures: 0, Errors: 0, Time elapsed: 0.322 sec
    [junit] Running org.apache.hadoop.io.TestSequenceFile
    [junit] Tests run: 3, Failures: 0, Errors: 0, Time elapsed: 23.863 sec
    [junit] Running org.apache.hadoop.io.TestSetFile
    [junit] Tests run: 1, Failures: 0, Errors: 0, Time elapsed: 4.721 sec
    [junit] Running org.apache.hadoop.io.TestText
    [junit] Tests run: 7, Failures: 0, Errors: 0, Time elapsed: 1.43 sec
    [junit] Running org.apache.hadoop.io.TestTextNonUTF8
    [junit] Tests run: 1, Failures: 0, Errors: 0, Time elapsed: 0.022 sec
    [junit] Running org.apache.hadoop.io.TestUTF8
    [junit] Tests run: 3, Failures: 0, Errors: 0, Time elapsed: 0.295 sec
    [junit] Running org.apache.hadoop.io.TestVersionedWritable
    [junit] Tests run: 3, Failures: 0, Errors: 0, Time elapsed: 0.032 sec
    [junit] Running org.apache.hadoop.io.TestWritable
    [junit] Tests run: 1, Failures: 0, Errors: 0, Time elapsed: 0.017 sec
    [junit] Running org.apache.hadoop.io.compress.TestCodec
    [junit] Tests run: 3, Failures: 0, Errors: 0, Time elapsed: 1.859 sec
    [junit] Running org.apache.hadoop.io.compress.TestCodecFactory
    [junit] Tests run: 1, Failures: 0, Errors: 0, Time elapsed: 0.342 sec
    [junit] Running org.apache.hadoop.ipc.TestIPC
    [junit] Tests run: 2, Failures: 0, Errors: 0, Time elapsed: 0.993 sec
    [junit] Running org.apache.hadoop.ipc.TestRPC
    [junit] Tests run: 1, Failures: 0, Errors: 0, Time elapsed: 0.146 sec
    [junit] Running org.apache.hadoop.mapred.TestEmptyJobWithDFS
    [junit] Tests run: 1, Failures: 0, Errors: 0, Time elapsed: 40.889 sec
    [junit] Running org.apache.hadoop.mapred.TestMapRed
    [junit] Tests run: 4, Failures: 0, Errors: 0, Time elapsed: 21.786 sec
    [junit] Running org.apache.hadoop.mapred.TestMiniMRBringup
    [junit] Tests run: 1, Failures: 0, Errors: 0, Time elapsed: 2.903 sec
    [junit] Running org.apache.hadoop.mapred.TestMiniMRClasspath
    [junit] Tests run: 2, Failures: 0, Errors: 1, Time elapsed: 106.922 sec
    [junit] Test org.apache.hadoop.mapred.TestMiniMRClasspath FAILED
    [junit] Running org.apache.hadoop.mapred.TestMiniMRDFSCaching
    [junit] Tests run: 1, Failures: 0, Errors: 0, Time elapsed: 46.007 sec
    [junit] Running org.apache.hadoop.mapred.TestMiniMRLocalFS
    [junit] Tests run: 1, Failures: 0, Errors: 0, Time elapsed: 93.301 sec
    [junit] Running org.apache.hadoop.mapred.TestMiniMRWithDFS
    [junit] Tests run: 1, Failures: 1, Errors: 0, Time elapsed: 238.882 sec
    [junit] Test org.apache.hadoop.mapred.TestMiniMRWithDFS FAILED
    [junit] Running org.apache.hadoop.mapred.TestSequenceFileInputFilter
    [junit] Tests run: 3, Failures: 0, Errors: 0, Time elapsed: 12.012 sec
    [junit] Running org.apache.hadoop.mapred.TestSequenceFileInputFormat
    [junit] Tests run: 1, Failures: 0, Errors: 0, Time elapsed: 5.685 sec
    [junit] Running org.apache.hadoop.mapred.TestTextInputFormat
    [junit] Tests run: 4, Failures: 0, Errors: 0, Time elapsed: 7.71 sec
    [junit] Running org.apache.hadoop.mapred.jobcontrol.TestJobControl
    [junit] Tests run: 1, Failures: 0, Errors: 0, Time elapsed: 98.962 sec
    [junit] Running org.apache.hadoop.net.TestNetworkTopology
    [junit] Tests run: 6, Failures: 0, Errors: 0, Time elapsed: 0.022 sec
    [junit] Running org.apache.hadoop.record.test.TestMapRed
    [junit] Tests run: 1, Failures: 0, Errors: 0, Time elapsed: 4.068 sec
    [junit] Running org.apache.hadoop.record.test.TestRecordIO
    [junit] Tests run: 4, Failures: 0, Errors: 0, Time elapsed: 0.391 sec
    [junit] Running org.apache.hadoop.record.test.TestWritable
    [junit] Tests run: 1, Failures: 0, Errors: 0, Time elapsed: 3.867 sec

BUILD FAILED
/tmp/hadoop-nightly/build.xml:452: Tests failed!

Total time: 23 minutes 6 seconds



Mime
View raw message