hadoop-common-dev mailing list archives

Site index · List index
Message view « Date » · « Thread »
Top « Date » · « Thread »
From hadoop-...@lucene.apache.org
Subject Hadoop nightly build failure
Date Sat, 10 Feb 2007 05:54:03 GMT

init:
    [mkdir] Created dir: /tmp/hadoop-nightly/build
    [mkdir] Created dir: /tmp/hadoop-nightly/build/classes
    [mkdir] Created dir: /tmp/hadoop-nightly/build/src
    [mkdir] Created dir: /tmp/hadoop-nightly/build/webapps/task/WEB-INF
    [mkdir] Created dir: /tmp/hadoop-nightly/build/webapps/job/WEB-INF
    [mkdir] Created dir: /tmp/hadoop-nightly/build/webapps/dfs/WEB-INF
    [mkdir] Created dir: /tmp/hadoop-nightly/build/webapps/datanode/WEB-INF
    [mkdir] Created dir: /tmp/hadoop-nightly/build/examples
    [mkdir] Created dir: /tmp/hadoop-nightly/build/test
    [mkdir] Created dir: /tmp/hadoop-nightly/build/test/classes
    [mkdir] Created dir: /tmp/hadoop-nightly/build/test/testjar
     [copy] Copying 6 files to /tmp/hadoop-nightly/build/webapps
     [copy] Copying 5 files to /tmp/hadoop-nightly/conf
     [copy] Copying /tmp/hadoop-nightly/conf/slaves.template to /tmp/hadoop-nightly/conf/slaves
     [copy] Copying /tmp/hadoop-nightly/conf/hadoop-site.xml.template to /tmp/hadoop-nightly/conf/hadoop-site.xml
     [copy] Copying /tmp/hadoop-nightly/conf/mapred-default.xml.template to /tmp/hadoop-nightly/conf/mapred-default.xml
     [copy] Copying /tmp/hadoop-nightly/conf/masters.template to /tmp/hadoop-nightly/conf/masters
     [copy] Copying /tmp/hadoop-nightly/conf/hadoop-env.sh.template to /tmp/hadoop-nightly/conf/hadoop-env.sh
     [copy] Copying 1 file to /tmp/hadoop-nightly/src/contrib
     [copy] Copying /tmp/hadoop-nightly/src/contrib/ec2/bin/hadoop-ec2-env.sh.template to
/tmp/hadoop-nightly/src/contrib/ec2/bin/hadoop-ec2-env.sh
     [exec] src/saveVersion.sh: svn: not found
     [exec] src/saveVersion.sh: svn: not found
     [exec] src/saveVersion.sh: whoami: not found

record-parser:

compile-rcc-compiler:
    [javac] Compiling 25 source files to /tmp/hadoop-nightly/build/classes
    [javac] Note: /tmp/hadoop-nightly/src/java/org/apache/hadoop/record/compiler/generated/Rcc.java
uses unchecked or unsafe operations.
    [javac] Note: Recompile with -Xlint:unchecked for details.

compile-core-classes:
    [javac] Compiling 275 source files to /tmp/hadoop-nightly/build/classes
    [javac] Note: Some input files use or override a deprecated API.
    [javac] Note: Recompile with -Xlint:deprecation for details.
    [javac] Note: Some input files use unchecked or unsafe operations.
    [javac] Note: Recompile with -Xlint:unchecked for details.

compile-core-native:

compile-core:

compile-examples:
    [javac] Compiling 6 source files to /tmp/hadoop-nightly/build/examples
    [javac] Note: Some input files use unchecked or unsafe operations.
    [javac] Note: Recompile with -Xlint:unchecked for details.

generate-test-records:

compile-core-test:
    [javac] Compiling 5 source files to /tmp/hadoop-nightly/build/test/classes
    [javac] Note: /tmp/hadoop-nightly/build/test/src/org/apache/hadoop/record/test/RecRecord1.java
uses unchecked or unsafe operations.
    [javac] Note: Recompile with -Xlint:unchecked for details.
    [javac] Compiling 72 source files to /tmp/hadoop-nightly/build/test/classes
    [javac] Note: Some input files use or override a deprecated API.
    [javac] Note: Recompile with -Xlint:deprecation for details.
    [javac] Note: Some input files use unchecked or unsafe operations.
    [javac] Note: Recompile with -Xlint:unchecked for details.
    [javac] Compiling 3 source files to /tmp/hadoop-nightly/build/test/testjar
      [jar] Building jar: /tmp/hadoop-nightly/build/test/testjar/testjob.jar
      [jar] Building jar: /tmp/hadoop-nightly/build/hadoop-nightly-test.jar
    [mkdir] Created dir: /tmp/hadoop-nightly/build/test/cache
     [copy] Copying 1 file to /tmp/hadoop-nightly/build/test/cache
     [copy] Copying 1 file to /tmp/hadoop-nightly/build/test/cache
     [copy] Copying 1 file to /tmp/hadoop-nightly/build/test/cache

test-core:
    [mkdir] Created dir: /tmp/hadoop-nightly/build/test/data
    [mkdir] Created dir: /tmp/hadoop-nightly/build/test/logs
    [junit] Running org.apache.hadoop.conf.TestConfiguration
    [junit] Tests run: 2, Failures: 0, Errors: 0, Time elapsed: 0.525 sec
    [junit] Running org.apache.hadoop.dfs.TestCheckpoint
    [junit] Tests run: 1, Failures: 0, Errors: 0, Time elapsed: 260.893 sec
    [junit] Data node crashed:
    [junit] java.lang.NullPointerException
    [junit] 	at org.apache.hadoop.ipc.Client$Connection.sendParam(Client.java:306)
    [junit] 	at org.apache.hadoop.ipc.Client.call(Client.java:457)
    [junit] 	at org.apache.hadoop.ipc.RPC$Invoker.invoke(RPC.java:164)
    [junit] 	at org.apache.hadoop.dfs.$Proxy0.getProtocolVersion(Unknown Source)
    [junit] 	at org.apache.hadoop.ipc.RPC.getProxy(RPC.java:248)
    [junit] 	at org.apache.hadoop.ipc.RPC.waitForProxy(RPC.java:227)
    [junit] 	at org.apache.hadoop.dfs.DataNode.<init>(DataNode.java:254)
    [junit] 	at org.apache.hadoop.dfs.DataNode.<init>(DataNode.java:197)
    [junit] 	at org.apache.hadoop.dfs.MiniDFSCluster$DataNodeRunner.run(MiniDFSCluster.java:124)
    [junit] 	at java.lang.Thread.run(Thread.java:595)
    [junit] Data node crashed:
    [junit] java.lang.NullPointerException
    [junit] 	at org.apache.hadoop.ipc.Client$Connection.sendParam(Client.java:306)
    [junit] 	at org.apache.hadoop.ipc.Client.call(Client.java:457)
    [junit] 	at org.apache.hadoop.ipc.RPC$Invoker.invoke(RPC.java:164)
    [junit] 	at org.apache.hadoop.dfs.$Proxy0.getProtocolVersion(Unknown Source)
    [junit] 	at org.apache.hadoop.ipc.RPC.getProxy(RPC.java:248)
    [junit] 	at org.apache.hadoop.ipc.RPC.waitForProxy(RPC.java:227)
    [junit] 	at org.apache.hadoop.dfs.DataNode.<init>(DataNode.java:254)
    [junit] 	at org.apache.hadoop.dfs.DataNode.<init>(DataNode.java:197)
    [junit] 	at org.apache.hadoop.dfs.MiniDFSCluster$DataNodeRunner.run(MiniDFSCluster.java:124)
    [junit] 	at java.lang.Thread.run(Thread.java:595)
    [junit] Running org.apache.hadoop.dfs.TestDFSMkdirs
    [junit] Tests run: 1, Failures: 0, Errors: 0, Time elapsed: 7.091 sec
    [junit] Running org.apache.hadoop.dfs.TestDFSShell
    [junit] Tests run: 1, Failures: 0, Errors: 0, Time elapsed: 12.251 sec
    [junit] Running org.apache.hadoop.dfs.TestDFSShellGenericOptions
    [junit] Tests run: 1, Failures: 0, Errors: 0, Time elapsed: 12.114 sec
    [junit] Running org.apache.hadoop.dfs.TestDecommission
    [junit] Tests run: 1, Failures: 0, Errors: 0, Time elapsed: 53.07 sec
    [junit] Running org.apache.hadoop.dfs.TestFileCorruption
    [junit] Tests run: 1, Failures: 0, Errors: 0, Time elapsed: 8.427 sec
    [junit] Running org.apache.hadoop.dfs.TestFsck
    [junit] Tests run: 2, Failures: 0, Errors: 0, Time elapsed: 16.21 sec
    [junit] Running org.apache.hadoop.dfs.TestLocalDFS
    [junit] Tests run: 1, Failures: 0, Errors: 0, Time elapsed: 6.845 sec
    [junit] Running org.apache.hadoop.dfs.TestPread
    [junit] Tests run: 2, Failures: 0, Errors: 0, Time elapsed: 7.735 sec
    [junit] Running org.apache.hadoop.dfs.TestReplication
    [junit] Tests run: 1, Failures: 1, Errors: 0, Time elapsed: 24.933 sec
    [junit] Test org.apache.hadoop.dfs.TestReplication FAILED
    [junit] Running org.apache.hadoop.dfs.TestReplicationPolicy
    [junit] Tests run: 8, Failures: 0, Errors: 0, Time elapsed: 0.051 sec
    [junit] Running org.apache.hadoop.dfs.TestRestartDFS
    [junit] Tests run: 1, Failures: 0, Errors: 0, Time elapsed: 16.501 sec
    [junit] Running org.apache.hadoop.dfs.TestSeekBug
    [junit] Tests run: 2, Failures: 0, Errors: 0, Time elapsed: 6.992 sec
    [junit] Running org.apache.hadoop.dfs.TestSmallBlock
    [junit] Tests run: 1, Failures: 0, Errors: 0, Time elapsed: 6.831 sec
    [junit] Running org.apache.hadoop.fs.TestCopyFiles
    [junit] Tests run: 4, Failures: 0, Errors: 0, Time elapsed: 31.635 sec
    [junit] Running org.apache.hadoop.fs.TestDFSIO
    [junit] Tests run: 1, Failures: 0, Errors: 0, Time elapsed: 4.963 sec
    [junit] Running org.apache.hadoop.fs.TestFileSystem
    [junit] Tests run: 1, Failures: 0, Errors: 0, Time elapsed: 4.883 sec
    [junit] Running org.apache.hadoop.fs.TestGlobPaths
    [junit] Tests run: 1, Failures: 0, Errors: 0, Time elapsed: 5.824 sec
    [junit] Running org.apache.hadoop.fs.TestLocalFileSystem
    [junit] Tests run: 1, Failures: 0, Errors: 0, Time elapsed: 0.35 sec
    [junit] Running org.apache.hadoop.fs.TestPath
    [junit] Tests run: 7, Failures: 0, Errors: 0, Time elapsed: 0.027 sec
    [junit] Running org.apache.hadoop.fs.s3.TestINode
    [junit] Tests run: 3, Failures: 0, Errors: 0, Time elapsed: 0.017 sec
    [junit] Running org.apache.hadoop.fs.s3.TestInMemoryS3FileSystem
    [junit] Tests run: 22, Failures: 0, Errors: 0, Time elapsed: 0.86 sec
    [junit] Running org.apache.hadoop.io.TestArrayFile
    [junit] Tests run: 2, Failures: 0, Errors: 0, Time elapsed: 3.532 sec
    [junit] Running org.apache.hadoop.io.TestBytesWritable
    [junit] Tests run: 3, Failures: 0, Errors: 0, Time elapsed: 0.014 sec
    [junit] Running org.apache.hadoop.io.TestMD5Hash
    [junit] Tests run: 1, Failures: 0, Errors: 0, Time elapsed: 0.304 sec
    [junit] Running org.apache.hadoop.io.TestSequenceFile
    [junit] Tests run: 3, Failures: 0, Errors: 0, Time elapsed: 18.268 sec
    [junit] Running org.apache.hadoop.io.TestSetFile
    [junit] Tests run: 1, Failures: 0, Errors: 0, Time elapsed: 4.384 sec
    [junit] Running org.apache.hadoop.io.TestText
    [junit] Tests run: 7, Failures: 0, Errors: 0, Time elapsed: 0.732 sec
    [junit] Running org.apache.hadoop.io.TestTextNonUTF8
    [junit] Tests run: 1, Failures: 0, Errors: 0, Time elapsed: 0.016 sec
    [junit] Running org.apache.hadoop.io.TestUTF8
    [junit] Tests run: 3, Failures: 0, Errors: 0, Time elapsed: 0.232 sec
    [junit] Running org.apache.hadoop.io.TestVersionedWritable
    [junit] Tests run: 3, Failures: 0, Errors: 0, Time elapsed: 0.03 sec
    [junit] Running org.apache.hadoop.io.TestWritable
    [junit] Tests run: 1, Failures: 0, Errors: 0, Time elapsed: 0.011 sec
    [junit] Running org.apache.hadoop.io.compress.TestCodec
    [junit] Tests run: 3, Failures: 0, Errors: 0, Time elapsed: 1.743 sec
    [junit] Running org.apache.hadoop.io.compress.TestCodecFactory
    [junit] Tests run: 1, Failures: 0, Errors: 0, Time elapsed: 0.353 sec
    [junit] Running org.apache.hadoop.ipc.TestIPC
    [junit] Tests run: 2, Failures: 0, Errors: 0, Time elapsed: 0.515 sec
    [junit] Running org.apache.hadoop.ipc.TestRPC
    [junit] Tests run: 1, Failures: 0, Errors: 0, Time elapsed: 0.138 sec
    [junit] Running org.apache.hadoop.mapred.TestEmptyJobWithDFS
    [junit] Tests run: 1, Failures: 0, Errors: 0, Time elapsed: 24.892 sec
    [junit] Running org.apache.hadoop.mapred.TestMapRed
    [junit] Tests run: 4, Failures: 0, Errors: 0, Time elapsed: 18.795 sec
    [junit] Running org.apache.hadoop.mapred.TestMiniMRBringup
    [junit] Tests run: 1, Failures: 0, Errors: 0, Time elapsed: 2.575 sec
    [junit] Running org.apache.hadoop.mapred.TestMiniMRClasspath
    [junit] Tests run: 2, Failures: 0, Errors: 0, Time elapsed: 78.816 sec
    [junit] Running org.apache.hadoop.mapred.TestMiniMRDFSCaching
    [junit] Tests run: 1, Failures: 0, Errors: 0, Time elapsed: 28.506 sec
    [junit] Running org.apache.hadoop.mapred.TestMiniMRLocalFS
    [junit] Tests run: 1, Failures: 0, Errors: 0, Time elapsed: 61.045 sec
    [junit] Running org.apache.hadoop.mapred.TestMiniMRWithDFS
    [junit] Tests run: 1, Failures: 1, Errors: 0, Time elapsed: 104.38 sec
    [junit] Test org.apache.hadoop.mapred.TestMiniMRWithDFS FAILED
    [junit] Running org.apache.hadoop.mapred.TestSequenceFileInputFilter
    [junit] Tests run: 3, Failures: 0, Errors: 0, Time elapsed: 9.99 sec
    [junit] Running org.apache.hadoop.mapred.TestSequenceFileInputFormat
    [junit] Tests run: 1, Failures: 0, Errors: 0, Time elapsed: 5.851 sec
    [junit] Running org.apache.hadoop.mapred.TestTextInputFormat
    [junit] Tests run: 4, Failures: 0, Errors: 0, Time elapsed: 4.954 sec
    [junit] Running org.apache.hadoop.mapred.jobcontrol.TestJobControl
    [junit] Tests run: 1, Failures: 0, Errors: 0, Time elapsed: 66.691 sec
    [junit] Running org.apache.hadoop.net.TestNetworkTopology
    [junit] Tests run: 6, Failures: 0, Errors: 0, Time elapsed: 0.019 sec
    [junit] Running org.apache.hadoop.record.test.TestMapRed
    [junit] Tests run: 1, Failures: 0, Errors: 0, Time elapsed: 4.07 sec
    [junit] Running org.apache.hadoop.record.test.TestRecordIO
    [junit] Tests run: 4, Failures: 0, Errors: 0, Time elapsed: 0.255 sec
    [junit] Running org.apache.hadoop.record.test.TestWritable
    [junit] Tests run: 1, Failures: 0, Errors: 0, Time elapsed: 2.398 sec

BUILD FAILED
/tmp/hadoop-nightly/build.xml:452: Tests failed!

Total time: 16 minutes 26 seconds



Mime
View raw message