hadoop-common-dev mailing list archives

Site index · List index
Message view « Date » · « Thread »
Top « Date » · « Thread »
From hadoop-...@lucene.apache.org
Subject Hadoop nightly build failure
Date Mon, 05 Feb 2007 21:19:12 GMT

init:
    [mkdir] Created dir: /tmp/hadoop-nightly/build
    [mkdir] Created dir: /tmp/hadoop-nightly/build/classes
    [mkdir] Created dir: /tmp/hadoop-nightly/build/src
    [mkdir] Created dir: /tmp/hadoop-nightly/build/webapps/task/WEB-INF
    [mkdir] Created dir: /tmp/hadoop-nightly/build/webapps/job/WEB-INF
    [mkdir] Created dir: /tmp/hadoop-nightly/build/webapps/dfs/WEB-INF
    [mkdir] Created dir: /tmp/hadoop-nightly/build/webapps/datanode/WEB-INF
    [mkdir] Created dir: /tmp/hadoop-nightly/build/examples
    [mkdir] Created dir: /tmp/hadoop-nightly/build/test
    [mkdir] Created dir: /tmp/hadoop-nightly/build/test/classes
    [mkdir] Created dir: /tmp/hadoop-nightly/build/test/testjar
     [copy] Copying 6 files to /tmp/hadoop-nightly/build/webapps
     [copy] Copying 5 files to /tmp/hadoop-nightly/conf
     [copy] Copying /tmp/hadoop-nightly/conf/slaves.template to /tmp/hadoop-nightly/conf/slaves
     [copy] Copying /tmp/hadoop-nightly/conf/hadoop-site.xml.template to /tmp/hadoop-nightly/conf/hadoop-site.xml
     [copy] Copying /tmp/hadoop-nightly/conf/mapred-default.xml.template to /tmp/hadoop-nightly/conf/mapred-default.xml
     [copy] Copying /tmp/hadoop-nightly/conf/masters.template to /tmp/hadoop-nightly/conf/masters
     [copy] Copying /tmp/hadoop-nightly/conf/hadoop-env.sh.template to /tmp/hadoop-nightly/conf/hadoop-env.sh
     [exec] src/saveVersion.sh: svn: not found
     [exec] src/saveVersion.sh: svn: not found
     [exec] src/saveVersion.sh: whoami: not found

record-parser:

compile-rcc-compiler:
    [javac] Compiling 25 source files to /tmp/hadoop-nightly/build/classes
    [javac] Note: /tmp/hadoop-nightly/src/java/org/apache/hadoop/record/compiler/generated/Rcc.java
uses unchecked or unsafe operations.
    [javac] Note: Recompile with -Xlint:unchecked for details.

compile-core-classes:
    [javac] Compiling 271 source files to /tmp/hadoop-nightly/build/classes
    [javac] Note: Some input files use or override a deprecated API.
    [javac] Note: Recompile with -Xlint:deprecation for details.
    [javac] Note: Some input files use unchecked or unsafe operations.
    [javac] Note: Recompile with -Xlint:unchecked for details.

compile-core-native:

compile-core:

compile-examples:
    [javac] Compiling 6 source files to /tmp/hadoop-nightly/build/examples
    [javac] Note: Some input files use unchecked or unsafe operations.
    [javac] Note: Recompile with -Xlint:unchecked for details.

generate-test-records:

compile-core-test:
    [javac] Compiling 5 source files to /tmp/hadoop-nightly/build/test/classes
    [javac] Note: /tmp/hadoop-nightly/build/test/src/org/apache/hadoop/record/test/RecRecord1.java
uses unchecked or unsafe operations.
    [javac] Note: Recompile with -Xlint:unchecked for details.
    [javac] Compiling 69 source files to /tmp/hadoop-nightly/build/test/classes
    [javac] Note: Some input files use or override a deprecated API.
    [javac] Note: Recompile with -Xlint:deprecation for details.
    [javac] Note: Some input files use unchecked or unsafe operations.
    [javac] Note: Recompile with -Xlint:unchecked for details.
    [javac] Compiling 1 source file to /tmp/hadoop-nightly/build/test/testjar
      [jar] Building jar: /tmp/hadoop-nightly/build/test/testjar/testjob.jar
      [jar] Building jar: /tmp/hadoop-nightly/build/hadoop-nightly-test.jar
    [mkdir] Created dir: /tmp/hadoop-nightly/build/test/cache
     [copy] Copying 1 file to /tmp/hadoop-nightly/build/test/cache
     [copy] Copying 1 file to /tmp/hadoop-nightly/build/test/cache
     [copy] Copying 1 file to /tmp/hadoop-nightly/build/test/cache

test-core:
    [mkdir] Created dir: /tmp/hadoop-nightly/build/test/data
    [mkdir] Created dir: /tmp/hadoop-nightly/build/test/logs
    [junit] Running org.apache.hadoop.conf.TestConfiguration
    [junit] Tests run: 2, Failures: 0, Errors: 0, Time elapsed: 0.871 sec
    [junit] Running org.apache.hadoop.dfs.TestCheckpoint
    [junit] Tests run: 1, Failures: 1, Errors: 0, Time elapsed: 522.264 sec
    [junit] Test org.apache.hadoop.dfs.TestCheckpoint FAILED
    [junit] Running org.apache.hadoop.dfs.TestDFSMkdirs
    [junit] Tests run: 1, Failures: 0, Errors: 0, Time elapsed: 270.297 sec
    [junit] Running org.apache.hadoop.dfs.TestDFSShell
    [junit] Tests run: 1, Failures: 0, Errors: 0, Time elapsed: 157.82 sec
    [junit] Running org.apache.hadoop.dfs.TestDFSShellGenericOptions
    [junit] Tests run: 1, Failures: 0, Errors: 0, Time elapsed: 15.95 sec
    [junit] Running org.apache.hadoop.dfs.TestDecommission
    [junit] Tests run: 1, Failures: 0, Errors: 0, Time elapsed: 54.718 sec
    [junit] Running org.apache.hadoop.dfs.TestFileCorruption
    [junit] Tests run: 1, Failures: 0, Errors: 1, Time elapsed: 27.492 sec
    [junit] Test org.apache.hadoop.dfs.TestFileCorruption FAILED
    [junit] Running org.apache.hadoop.dfs.TestFsck
    [junit] Tests run: 2, Failures: 0, Errors: 0, Time elapsed: 95.623 sec
    [junit] Running org.apache.hadoop.dfs.TestLocalDFS
    [junit] Tests run: 1, Failures: 0, Errors: 0, Time elapsed: 18.667 sec
    [junit] Running org.apache.hadoop.dfs.TestPread
    [junit] Tests run: 2, Failures: 0, Errors: 0, Time elapsed: 185.401 sec
    [junit] Running org.apache.hadoop.dfs.TestReplication
    [junit] Tests run: 1, Failures: 0, Errors: 1, Time elapsed: 99.611 sec
    [junit] Test org.apache.hadoop.dfs.TestReplication FAILED
    [junit] Running org.apache.hadoop.dfs.TestRestartDFS
    [junit] Tests run: 1, Failures: 0, Errors: 1, Time elapsed: 114.679 sec
    [junit] Test org.apache.hadoop.dfs.TestRestartDFS FAILED
    [junit] Running org.apache.hadoop.dfs.TestSeekBug
    [junit] Tests run: 2, Failures: 0, Errors: 0, Time elapsed: 24.469 sec
    [junit] Running org.apache.hadoop.dfs.TestSmallBlock
    [junit] Tests run: 1, Failures: 0, Errors: 0, Time elapsed: 13.002 sec
    [junit] Running org.apache.hadoop.fs.TestCopyFiles
    [junit] Tests run: 4, Failures: 0, Errors: 1, Time elapsed: 63.793 sec
    [junit] Test org.apache.hadoop.fs.TestCopyFiles FAILED
    [junit] Running org.apache.hadoop.fs.TestDFSIO
    [junit] Tests run: 1, Failures: 0, Errors: 0, Time elapsed: 12.721 sec
    [junit] Running org.apache.hadoop.fs.TestFileSystem
    [junit] Tests run: 1, Failures: 0, Errors: 0, Time elapsed: 12.241 sec
    [junit] Running org.apache.hadoop.fs.TestGlobPaths
    [junit] Tests run: 1, Failures: 0, Errors: 0, Time elapsed: 8.859 sec
    [junit] Running org.apache.hadoop.fs.TestLocalFileSystem
    [junit] Tests run: 1, Failures: 0, Errors: 0, Time elapsed: 0.428 sec
    [junit] Running org.apache.hadoop.fs.TestPath
    [junit] Tests run: 7, Failures: 0, Errors: 0, Time elapsed: 0.062 sec
    [junit] Running org.apache.hadoop.fs.s3.TestINode
    [junit] Tests run: 3, Failures: 0, Errors: 0, Time elapsed: 0.014 sec
    [junit] Running org.apache.hadoop.fs.s3.TestInMemoryS3FileSystem
    [junit] Tests run: 22, Failures: 0, Errors: 0, Time elapsed: 1.762 sec
    [junit] Running org.apache.hadoop.io.TestArrayFile
    [junit] Tests run: 2, Failures: 0, Errors: 0, Time elapsed: 9.485 sec
    [junit] Running org.apache.hadoop.io.TestBytesWritable
    [junit] Tests run: 3, Failures: 0, Errors: 0, Time elapsed: 0.015 sec
    [junit] Running org.apache.hadoop.io.TestMD5Hash
    [junit] Tests run: 1, Failures: 0, Errors: 0, Time elapsed: 0.733 sec
    [junit] Running org.apache.hadoop.io.TestSequenceFile
    [junit] Tests run: 3, Failures: 0, Errors: 0, Time elapsed: 47.369 sec
    [junit] Running org.apache.hadoop.io.TestSetFile
    [junit] Tests run: 1, Failures: 0, Errors: 0, Time elapsed: 13.802 sec
    [junit] Running org.apache.hadoop.io.TestText
    [junit] Tests run: 7, Failures: 0, Errors: 0, Time elapsed: 1.894 sec
    [junit] Running org.apache.hadoop.io.TestTextNonUTF8
    [junit] Tests run: 1, Failures: 0, Errors: 0, Time elapsed: 0.022 sec
    [junit] Running org.apache.hadoop.io.TestUTF8
    [junit] Tests run: 3, Failures: 0, Errors: 0, Time elapsed: 1.213 sec
    [junit] Running org.apache.hadoop.io.TestVersionedWritable
    [junit] Tests run: 3, Failures: 0, Errors: 0, Time elapsed: 0.052 sec
    [junit] Running org.apache.hadoop.io.TestWritable
    [junit] Tests run: 1, Failures: 0, Errors: 0, Time elapsed: 0.011 sec
    [junit] Running org.apache.hadoop.io.compress.TestCodec
    [junit] Tests run: 3, Failures: 0, Errors: 0, Time elapsed: 12.115 sec
    [junit] Running org.apache.hadoop.io.compress.TestCodecFactory
    [junit] Tests run: 1, Failures: 0, Errors: 0, Time elapsed: 1.37 sec
    [junit] Running org.apache.hadoop.ipc.TestIPC
    [junit] Tests run: 2, Failures: 1, Errors: 0, Time elapsed: 6.269 sec
    [junit] Test org.apache.hadoop.ipc.TestIPC FAILED
    [junit] Running org.apache.hadoop.ipc.TestRPC
    [junit] Tests run: 1, Failures: 0, Errors: 0, Time elapsed: 0.537 sec
    [junit] Running org.apache.hadoop.mapred.TestEmptyJobWithDFS
    [junit] Tests run: 1, Failures: 0, Errors: 0, Time elapsed: 45.378 sec
    [junit] Running org.apache.hadoop.mapred.TestMapRed
    [junit] Tests run: 2, Failures: 0, Errors: 0, Time elapsed: 13.842 sec
    [junit] Running org.apache.hadoop.mapred.TestMiniMRBringup
    [junit] Tests run: 1, Failures: 0, Errors: 0, Time elapsed: 13.198 sec
    [junit] Running org.apache.hadoop.mapred.TestMiniMRClasspath
    [junit] Tests run: 1, Failures: 0, Errors: 0, Time elapsed: 75.486 sec
    [junit] Running org.apache.hadoop.mapred.TestMiniMRDFSCaching
    [junit] Tests run: 1, Failures: 0, Errors: 0, Time elapsed: 64.356 sec
    [junit] Running org.apache.hadoop.mapred.TestMiniMRLocalFS
    [junit] Exception in thread "main" java.lang.OutOfMemoryError: Java heap space

BUILD FAILED
/tmp/hadoop-nightly/build.xml:427: Could not delete temporary properties file.

Total time: 9,907 minutes 22 seconds



Mime
View raw message