gump-general mailing list archives

Site index · List index
Message view « Date » · « Thread »
Top « Date » · « Thread »
From g...@vmgump-vm3.apache.org
Subject BATCH: All dressed up, with nowhere to go...
Date Wed, 13 Mar 2019 05:09:14 GMT
Dear Gumpmeisters,
            
The following 5 notifys should have been sent

*********************************************************** G U M P
[GUMP@vmgump-vm3]: Project java-hamcrest (in module java-hamcrest) failed
[GUMP@vmgump-vm3]: Project fontbox (in module pdfbox) failed
[GUMP@vmgump-vm3]: Project test-ant (in module ant) failed
[GUMP@vmgump-vm3]: Project commons-exec (in module apache-commons) failed
[GUMP@vmgump-vm3]: Project commons-beanutils2 (in module apache-commons) failed
*********************************************************** G U M P
[GUMP@vmgump-vm3]: Project java-hamcrest (in module java-hamcrest) failed
To whom it may engage...
        
This is an automated request, but not an unsolicited one. For 
more information please visit http://gump.apache.org/nagged.html, 
and/or contact the folk at general@gump.apache.org.

Project java-hamcrest has an issue affecting its community integration.
This issue affects 1 projects,
 and has been outstanding for 540 runs.
The current state of this project is 'Failed', with reason 'Build Failed'.
For reference only, the following projects are affected by this:
    - java-hamcrest :  Provides a library of matcher objects (also known as constra...


Full details are available at:
    http://vmgump-vm3.apache.org/java-hamcrest/java-hamcrest/index.html

That said, some information snippets are provided here.

The following annotations (debug/informational/warning/error messages) were provided:
 -DEBUG- Sole jar output [java-hamcrest-*[0-9T].jar] identifier set to project name
 -DEBUG- (Apache Gump generated) Gradle Init Script in: /srv/gump/public/workspace/java-hamcrest/gump_init_script.gradle
 -INFO- Failed with reason build failed
 -DEBUG- Gradle build in: /srv/gump/public/workspace/java-hamcrest/build.gradle
 -INFO- Failed to extract fallback artifacts from Gump Repository



The following work was performed:
http://vmgump-vm3.apache.org/java-hamcrest/java-hamcrest/gump_work/build_java-hamcrest_java-hamcrest.html
Work Name: build_java-hamcrest_java-hamcrest (Type: Build)
Work ended in a state of : Failed
Elapsed: 5 secs
Command Line: gradle --debug -Djava.awt.headless=true -Dbuild.sysclasspath=only -Dsun.zip.disableMemoryMapping=true
-Dmaven.repo.local=/srv/gump/public/workspace/mvnlocalrepo/java-hamcrest.mvnlocalrepo --refresh-dependencies
--init-script /srv/gump/public/workspace/java-hamcrest/gump_init_script.gradle build 
[Working Directory: /srv/gump/public/workspace/java-hamcrest]
---------------------------------------------
00:20:37.368 [DEBUG] [org.gradle.cache.internal.DefaultFileLockManager] Releasing lock on
proj remapped class cache for gq4awl0mk6zsdllfou3uguod (/home/gump/.gradle/caches/2.14.1/scripts-remapped/build_el7aipplekpufwz1suifpnm7v/gq4awl0mk6zsdllfou3uguod/proj57408229).
00:20:37.628 [DEBUG] [org.gradle.model.internal.registry.DefaultModelRegistry] Project : -
Registering model element 'tasks.clean' (hidden = false)
00:20:37.630 [DEBUG] [org.gradle.model.internal.registry.DefaultModelRegistry] Project : -
Registering model element 'tasks.assemble' (hidden = false)
00:20:37.630 [DEBUG] [org.gradle.model.internal.registry.DefaultModelRegistry] Project : -
Registering model element 'tasks.check' (hidden = false)
00:20:37.631 [DEBUG] [org.gradle.model.internal.registry.DefaultModelRegistry] Project : -
Registering model element 'tasks.build' (hidden = false)
00:20:37.729 [DEBUG] [org.gradle.model.internal.registry.DefaultModelRegistry] Project : -
Transitioning model element 'tasks.assemble' from state Registered to Initialized
00:20:37.731 [DEBUG] [org.gradle.model.internal.registry.DefaultModelRegistry] Project : -
Running model element 'tasks.assemble' rule action tasks.addPlaceholderAction(assemble)
00:20:37.731 [DEBUG] [org.gradle.model.internal.registry.DefaultModelRegistry] Project : -
Mutating tasks.assemble using tasks.addPlaceholderAction(assemble)
00:20:37.731 [DEBUG] [org.gradle.model.internal.registry.DefaultModelRegistry] Project : -
Transitioning model element 'tasks.assemble' to state Discovered.
00:20:37.732 [DEBUG] [org.gradle.model.internal.registry.DefaultModelRegistry] Project : -
Running model element 'tasks.assemble' rule action tasks.addPlaceholderAction(assemble)
00:20:37.732 [DEBUG] [org.gradle.model.internal.registry.DefaultModelRegistry] Project : -
Mutating tasks.assemble using tasks.addPlaceholderAction(assemble)
00:20:37.761 [DEBUG] [org.gradle.model.internal.registry.DefaultModelRegistry] Project : -
Transitioning model element 'tasks.assemble' to state Created.
00:20:37.762 [DEBUG] [org.gradle.model.internal.registry.DefaultModelRegistry] Project : -
Transitioning model element 'tasks.assemble' to state DefaultsApplied.
00:20:37.763 [DEBUG] [org.gradle.model.internal.registry.DefaultModelRegistry] Project : -
Running model element 'tasks.assemble' rule action copyToTaskContainer
00:20:37.764 [DEBUG] [org.gradle.model.internal.registry.DefaultModelRegistry] Project : -
Mutating tasks.assemble using copyToTaskContainer
00:20:37.765 [DEBUG] [org.gradle.model.internal.registry.DefaultModelRegistry] Project : -
Transitioning model element 'tasks.assemble' to state Initialized.
00:20:37.974 [DEBUG] [org.gradle.model.internal.registry.DefaultModelRegistry] Project : -
Registering model element 'componentSpecFactory' (hidden = true)
00:20:37.979 [DEBUG] [org.gradle.model.internal.registry.DefaultModelRegistry] Project : -
Registering model element 'components' (hidden = false)
00:20:37.983 [DEBUG] [org.gradle.model.internal.registry.DefaultModelRegistry] Project : -
Registering model element 'sources' (hidden = false)
00:20:38.263 [DEBUG] [org.gradle.model.internal.registry.DefaultModelRegistry] Project : -
Registering model element 'binaries' (hidden = false)
00:20:38.280 [DEBUG] [org.gradle.model.internal.registry.DefaultModelRegistry] Project : -
Registering model element 'bridgedBinaries' (hidden = true)
00:20:38.288 [DEBUG] [org.gradle.model.internal.registry.DefaultModelRegistry] Project : -
Registering model element 'tasks.buildNeeded' (hidden = false)
00:20:38.289 [DEBUG] [org.gradle.model.internal.registry.DefaultModelRegistry] Project : -
Registering model element 'tasks.buildDependents' (hidden = false)
00:20:38.306 [DEBUG] [org.gradle.model.internal.registry.DefaultModelRegistry] Project : -
Registering model element 'tasks.publish' (hidden = false)
00:20:38.308 [DEBUG] [org.gradle.model.internal.registry.DefaultModelRegistry] Project : -
Registering model element 'projectPublicationRegistry' (hidden = false)
00:20:38.308 [DEBUG] [org.gradle.model.internal.registry.DefaultModelRegistry] Project : -
Registering model element 'publishing' (hidden = false)
00:20:38.309 [DEBUG] [org.gradle.model.internal.registry.DefaultModelRegistry] Project : -
Registering model element 'tasks.publishToMavenLocal' (hidden = false)
00:20:38.322 [DEBUG] [org.gradle.configuration.project.BuildScriptProcessor] Timing: Running
the build script took 0.976 secs
00:20:38.337 [ERROR] [org.gradle.BuildExceptionReporter] 
00:20:38.340 [ERROR] [org.gradle.BuildExceptionReporter] FAILURE: Build failed with an exception.
00:20:38.341 [ERROR] [org.gradle.BuildExceptionReporter] 
00:20:38.348 [ERROR] [org.gradle.BuildExceptionReporter] * Where:
00:20:38.348 [ERROR] [org.gradle.BuildExceptionReporter] Build file '/srv/gump/public/workspace/java-hamcrest/build.gradle'
line: 9
00:20:38.348 [ERROR] [org.gradle.BuildExceptionReporter] 
00:20:38.349 [ERROR] [org.gradle.BuildExceptionReporter] * What went wrong:
00:20:38.349 [ERROR] [org.gradle.BuildExceptionReporter] A problem occurred evaluating root
project 'JavaHamcrest'.
00:20:38.349 [ERROR] [org.gradle.BuildExceptionReporter] > Plugin with id 'java-library'
not found.
00:20:38.349 [ERROR] [org.gradle.BuildExceptionReporter] 
00:20:38.349 [ERROR] [org.gradle.BuildExceptionReporter] * Try:
00:20:38.350 [ERROR] [org.gradle.BuildExceptionReporter] Run with --stacktrace option to get
the stack trace. 
00:20:38.350 [LIFECYCLE] [org.gradle.BuildResultLogger] 
00:20:38.350 [LIFECYCLE] [org.gradle.BuildResultLogger] BUILD FAILED
00:20:38.351 [LIFECYCLE] [org.gradle.BuildResultLogger] 
00:20:38.351 [LIFECYCLE] [org.gradle.BuildResultLogger] Total time: 5.596 secs
00:20:38.353 [DEBUG] [org.gradle.api.internal.artifacts.ivyservice.resolveengine.store.ResolutionResultsStoreFactory]
Deleted 0 resolution results binary files in 0.0 secs
00:20:38.353 [DEBUG] [org.gradle.cache.internal.DefaultCacheAccess] Cache artifact cache (/home/gump/.gradle/caches/modules-2)
was closed 0 times.
00:20:38.354 [DEBUG] [org.gradle.api.internal.artifacts.ivyservice.ivyresolve.memcache.InMemoryCachedRepositoryFactory]
In-memory dependency metadata cache closed. Repos cached: 0, cache instances: 0, modules served
from cache: 0, artifacts: 0
00:20:38.354 [DEBUG] [org.gradle.cache.internal.DefaultCacheAccess] Cache Plugin Resolution
Cache (/home/gump/.gradle/caches/2.14.1/plugin-resolution) was closed 0 times.
00:20:38.354 [DEBUG] [org.gradle.api.internal.tasks.compile.daemon.CompilerDaemonManager]
Stopping 0 compiler daemon(s).
00:20:38.354 [INFO] [org.gradle.api.internal.tasks.compile.daemon.CompilerDaemonManager] Stopped
0 compiler daemon(s).
---------------------------------------------

To subscribe to this information via syndicated feeds:
- RSS: http://vmgump-vm3.apache.org/java-hamcrest/java-hamcrest/rss.xml
- Atom: http://vmgump-vm3.apache.org/java-hamcrest/java-hamcrest/atom.xml

============================== Gump Tracking Only ===
Produced by Apache Gump(TM) version 2.3.
Gump Run 20190313000007, vmgump-vm3.apache.org:vmgump:20190313000007
Gump E-mail Identifier (unique within run) #1.

*********************************************************** G U M P
[GUMP@vmgump-vm3]: Project fontbox (in module pdfbox) failed
To whom it may engage...
        
This is an automated request, but not an unsolicited one. For 
more information please visit http://gump.apache.org/nagged.html, 
and/or contact the folk at general@gump.apache.org.

Project fontbox has an issue affecting its community integration.
This issue affects 1 projects,
 and has been outstanding for 54 runs.
The current state of this project is 'Failed', with reason 'Build Failed'.
For reference only, the following projects are affected by this:
    - fontbox :  Apache PDFBox is an open source Java PDF library for working...


Full details are available at:
    http://vmgump-vm3.apache.org/pdfbox/fontbox/index.html

That said, some information snippets are provided here.

The following annotations (debug/informational/warning/error messages) were provided:
 -DEBUG- Sole jar output [fontbox-*[0-9T].jar] identifier set to project name
 -DEBUG- (Apache Gump generated) Apache Maven Settings in: /srv/gump/public/workspace/pdfbox/fontbox/gump_mvn_settings.xml
 -INFO- Failed with reason build failed
 -DEBUG- Maven POM in: /srv/gump/public/workspace/pdfbox/fontbox/pom.xml
 -INFO- Failed to extract fallback artifacts from Gump Repository



The following work was performed:
http://vmgump-vm3.apache.org/pdfbox/fontbox/gump_work/build_pdfbox_fontbox.html
Work Name: build_pdfbox_fontbox (Type: Build)
Work ended in a state of : Failed
Elapsed: 5 secs
Command Line: /opt/maven3/bin/mvn --batch-mode --settings /srv/gump/public/workspace/pdfbox/fontbox/gump_mvn_settings.xml
package 
[Working Directory: /srv/gump/public/workspace/pdfbox/fontbox]
M2_HOME: /opt/maven3
---------------------------------------------
[INFO] Scanning for projects...
[INFO]                                                                         
[INFO] ------------------------------------------------------------------------
[INFO] Building Apache FontBox 3.0.0-SNAPSHOT
[INFO] ------------------------------------------------------------------------
[INFO] Downloading: http://localhost:8192/maven2/commons-logging/commons-logging/1.2/commons-logging-1.2.jar
[INFO] Downloaded: http://localhost:8192/maven2/commons-logging/commons-logging/1.2/commons-logging-1.2.jar
(56 KB at 653.1 KB/sec)
[INFO] 
[INFO] --- maven-enforcer-plugin:1.4.1:enforce (default) @ fontbox ---
[WARNING] Rule 0: org.apache.maven.plugins.enforcer.RequireMavenVersion failed with message:
Detected Maven Version: 3.3.9 is not in the allowed range 3.5.
[INFO] ------------------------------------------------------------------------
[INFO] BUILD FAILURE
[INFO] ------------------------------------------------------------------------
[INFO] Total time: 3.028 s
[INFO] Finished at: 2019-03-13T01:06:13+00:00
[INFO] Final Memory: 16M/178M
[INFO] ------------------------------------------------------------------------
[ERROR] Failed to execute goal org.apache.maven.plugins:maven-enforcer-plugin:1.4.1:enforce
(default) on project fontbox: Some Enforcer rules have failed. Look above for specific messages
explaining why the rule failed. -> [Help 1]
[ERROR] 
[ERROR] To see the full stack trace of the errors, re-run Maven with the -e switch.
[ERROR] Re-run Maven using the -X switch to enable full debug logging.
[ERROR] 
[ERROR] For more information about the errors and possible solutions, please read the following
articles:
[ERROR] [Help 1] http://cwiki.apache.org/confluence/display/MAVEN/MojoExecutionException
---------------------------------------------

To subscribe to this information via syndicated feeds:
- RSS: http://vmgump-vm3.apache.org/pdfbox/fontbox/rss.xml
- Atom: http://vmgump-vm3.apache.org/pdfbox/fontbox/atom.xml

============================== Gump Tracking Only ===
Produced by Apache Gump(TM) version 2.3.
Gump Run 20190313000007, vmgump-vm3.apache.org:vmgump:20190313000007
Gump E-mail Identifier (unique within run) #2.

*********************************************************** G U M P
[GUMP@vmgump-vm3]: Project test-ant (in module ant) failed
To whom it may engage...
        
This is an automated request, but not an unsolicited one. For 
more information please visit http://gump.apache.org/nagged.html, 
and/or contact the folk at general@gump.apache.org.

Project test-ant has an issue affecting its community integration.
This issue affects 1 projects,
 and has been outstanding for 27 runs.
The current state of this project is 'Failed', with reason 'Build Failed'.
For reference only, the following projects are affected by this:
    - test-ant :  Java based build tool


Full details are available at:
    http://vmgump-vm3.apache.org/ant/test-ant/index.html

That said, some information snippets are provided here.

The following annotations (debug/informational/warning/error messages) were provided:
 -WARNING- Bad *Optional* Dependency. Project: bsh : unknown to *this* workspace
 -INFO- Failed with reason build failed



The following work was performed:
http://vmgump-vm3.apache.org/ant/test-ant/gump_work/build_ant_test-ant.html
Work Name: build_ant_test-ant (Type: Build)
Work ended in a state of : Failed
Elapsed: 9 mins 2 secs
Command Line: /usr/lib/jvm/java-8-oracle/bin/java -Djava.awt.headless=true -Dbuild.sysclasspath=only
-Dsun.zip.disableMemoryMapping=true -Xbootclasspath/p:/srv/gump/public/workspace/xml-xerces2/build/xercesImpl.jar:/srv/gump/public/workspace/xml-commons/java/external/build/xml-apis.jar:/srv/gump/public/workspace/xml-xalan/build/xalan-unbundled.jar:/srv/gump/public/workspace/xml-xalan/build/serializer.jar
org.apache.tools.ant.Main -Dgump.merge=/srv/gump/public/gump/work/merge.xml -Dtest.haltonfailure=false
-Dant.home=/srv/gump/public/workspace/ant/dist run-tests 
[Working Directory: /srv/gump/public/workspace/ant]
CLASSPATH: /usr/lib/jvm/java-8-oracle/lib/tools.jar:/srv/gump/public/workspace/ant/build/testcases:/srv/gump/public/workspace/ant/src/tests/junit:/srv/gump/public/workspace/ant/src/etc/testcases:/srv/gump/public/workspace/ant/src/etc/testcases/taskdefs/optional/out:/srv/gump/public/workspace/ant/src/tests/antunit/filters:/srv/gump/public/workspace/ant/src/tests/antunit/taskdefs/importtests:/srv/gump/public/workspace/ant/src/tests/antunit/filters/foo:/srv/gump/public/workspace/ant/src/tests/antunit/taskdefs/foo:/srv/gump/public/workspace/ant/build/antunit/tmp/testinput/build:/srv/gump/public/workspace/ant/build/antunit/tmp/testoutput:/srv/gump/public/workspace/ant/build/antunit/tmp/test.jar:/srv/gump/public/workspace/ant/build/antunit/tmp/test1.jar:/srv/gump/public/workspace/ant/build/antunit/tmp/test2.jar:/srv/gump/public/workspace/ant/build/antunit/tmp/test3.jar:/srv/gump/public/workspace/ant/build/antunit/tmp/test4.jar:/srv/gump/public/workspace/ant/build/antunit/tmp/test5.jar:/srv
 /gump/public/workspace/ant/build/antunit/tmp/resources:/srv/gump/public/workspace/ant/build/lib/ant.jar:/srv/gump/public/workspace/ant/build/lib/ant-launcher.jar:/srv/gump/public/workspace/ant/build/lib/ant-antlr.jar:/srv/gump/public/workspace/ant/build/lib/ant-apache-bcel.jar:/srv/gump/public/workspace/ant/build/lib/ant-apache-bsf.jar:/srv/gump/public/workspace/ant/build/lib/ant-apache-log4j.jar:/srv/gump/public/workspace/ant/build/lib/ant-apache-oro.jar:/srv/gump/public/workspace/ant/build/lib/ant-apache-regexp.jar:/srv/gump/public/workspace/ant/build/lib/ant-apache-resolver.jar:/srv/gump/public/workspace/ant/build/lib/ant-apache-xalan2.jar:/srv/gump/public/workspace/ant/build/lib/ant-commons-logging.jar:/srv/gump/public/workspace/ant/build/lib/ant-commons-net.jar:/srv/gump/public/workspace/ant/build/lib/ant-jai.jar:/srv/gump/public/workspace/ant/build/lib/ant-javamail.jar:/srv/gump/public/workspace/ant/build/lib/ant-jdepend.jar:/srv/gump/public/workspace/ant/build/lib/ant-jmf.jar
 :/srv/gump/public/workspace/ant/build/lib/ant-jsch.jar:/srv/gump/public/workspace/ant/build/lib/ant-junit.jar:/srv/gump/public/workspace/ant/build/lib/ant-junit4.jar:/srv/gump/public/workspace/ant/build/lib/ant-swing.jar:/srv/gump/public/workspace/ant/build/lib/ant-xz.jar:/srv/gump/packages/antlr/antlr-3.1.3.jar:/srv/gump/public/workspace/ant-contrib/lib/bcel/jars/bcel-5.1.jar:/srv/gump/public/workspace/apache-commons/logging/target/commons-logging-20190313.jar:/srv/gump/public/workspace/apache-commons/logging/target/commons-logging-api-20190313.jar:/srv/gump/public/workspace/apache-commons/net/target/commons-net-3.7-SNAPSHOT.jar:/srv/gump/public/workspace/apache-commons/net/target/commons-net-ftp-3.7-SNAPSHOT.jar:/srv/gump/packages/jaf-1.1ea/activation.jar:/srv/gump/public/workspace/jakarta-bsf/build/lib/bsf.jar:/srv/gump/packages/apache-attic/jakarta-regexp-1.5.jar:/srv/gump/public/workspace/jakarta-servletapi-5/jsr154/dist/lib/servlet-api.jar:/srv/gump/packages/javamail-1.4/mail.
 jar:/srv/gump/packages/javamail-1.4/lib/mailapi.jar:/srv/gump/packages/jdepend-2.6/lib/jdepend.jar:/srv/gump/packages/jsch/jsch-0.1.45.jar:/srv/gump/public/workspace/logging-log4j-12/target/log4j-1.2.18-SNAPSHOT.jar:/srv/gump/packages/apache-attic/oro-2.0.8.jar:/srv/gump/public/workspace/xz-java/build/jar-20190313/xz.jar:/srv/gump/public/workspace/antlibs-antunit/build/ant-antunit-20190313.jar:/srv/gump/packages/hamcrest/hamcrest-core-1.3.jar:/srv/gump/public/workspace/junit/target/junit-4.13-SNAPSHOT.jar:/srv/gump/public/workspace/xml-commons/java/external/build/xml-apis-ext.jar:/srv/gump/packages/hamcrest/hamcrest-library-1.3.jar:/srv/gump/public/workspace/commons-codec-1.x/dist/commons-codec-20190313.jar
---------------------------------------------
[au:antunit] Build File: /srv/gump/public/workspace/ant/src/tests/antunit/types/selectors/modified-test.xml
[au:antunit] Tests run: 1, Failures: 0, Errors: 0, Time elapsed: 0.009 sec
[au:antunit] Target: testUpdate took 0.007 sec
[au:antunit] Build File: /srv/gump/public/workspace/ant/src/tests/antunit/types/selectors/ownedby-test.xml
[au:antunit] Tests run: 3, Failures: 0, Errors: 0, Time elapsed: 0.011 sec
[au:antunit] Target: testOwnedBy took 0.002 sec
[au:antunit] Target: testAsTrueConditions took 0.001 sec
[au:antunit] Target: testRequiresOwner took 0.001 sec
[au:antunit] Build File: /srv/gump/public/workspace/ant/src/tests/antunit/types/selectors/present-test.xml
[au:antunit] Tests run: 1, Failures: 0, Errors: 0, Time elapsed: 0.006 sec
[au:antunit] Target: testMapperByTypedef took 0.002 sec
[au:antunit] Build File: /srv/gump/public/workspace/ant/src/tests/antunit/types/selectors/readwrite-test.xml
[au:antunit] Tests run: 4, Failures: 0, Errors: 0, Time elapsed: 0.012 sec
[au:antunit] Target: testWritable took 0.001 sec
[au:antunit] Target: testAsConditions took 0 sec
[au:antunit] Target: testReadable took 0 sec
[au:antunit] Target: testUnwritable took 0 sec
[au:antunit] Build File: /srv/gump/public/workspace/ant/src/tests/antunit/types/selectors/select-test.xml
[au:antunit] Tests run: 4, Failures: 0, Errors: 0, Time elapsed: 0.019 sec
[au:antunit] Target: testIfFalse took 0.003 sec
[au:antunit] Target: testIfNotSet took 0.003 sec
[au:antunit] Target: testIfTrue took 0.002 sec
[au:antunit] Target: testIfSet took 0.003 sec
[au:antunit] Build File: /srv/gump/public/workspace/ant/src/tests/antunit/types/selectors/symlink-test.xml
[au:antunit] Tests run: 4, Failures: 0, Errors: 0, Time elapsed: 0.012 sec
[au:antunit] Target: testAsFalseConditions took 0.001 sec
[au:antunit] Target: testAsTrueConditions took 0 sec
[au:antunit] Target: testNoSymlink took 0.001 sec
[au:antunit] Target: testSymlink took 0.001 sec
[au:antunit] Build File: /srv/gump/public/workspace/ant/src/tests/antunit/types/tarfileset-test.xml
[au:antunit] Tests run: 3, Failures: 0, Errors: 0, Time elapsed: 0.008 sec
[au:antunit] Target: test-refid-check-encoding took 0.001 sec
[au:antunit] Target: testMissingArchive took 0.001 sec
[au:antunit] Target: testMissingArchiveDoesntMatter took 0 sec
[au:antunit] Build File: /srv/gump/public/workspace/ant/src/tests/antunit/types/zipfileset-test.xml
[au:antunit] Tests run: 5, Failures: 0, Errors: 0, Time elapsed: 0.022 sec
[au:antunit] Target: testMissingArchive took 0 sec
[au:antunit] Target: test-refid-check-encoding took 0.001 sec
[au:antunit] Target: test-refid-modify took 0.009 sec
[au:antunit] Target: test-refid-check-prefix took 0 sec
[au:antunit] Target: testMissingArchiveDoesntMatter took 0 sec

check-failed:

run-tests:

BUILD FAILED
/srv/gump/public/workspace/ant/build.xml:1698: Unit tests failed

Total time: 9 minutes 2 seconds
---------------------------------------------

To subscribe to this information via syndicated feeds:
- RSS: http://vmgump-vm3.apache.org/ant/test-ant/rss.xml
- Atom: http://vmgump-vm3.apache.org/ant/test-ant/atom.xml

============================== Gump Tracking Only ===
Produced by Apache Gump(TM) version 2.3.
Gump Run 20190313000007, vmgump-vm3.apache.org:vmgump:20190313000007
Gump E-mail Identifier (unique within run) #4.

*********************************************************** G U M P
[GUMP@vmgump-vm3]: Project commons-exec (in module apache-commons) failed
To whom it may engage...
        
This is an automated request, but not an unsolicited one. For 
more information please visit http://gump.apache.org/nagged.html, 
and/or contact the folk at general@gump.apache.org.

Project commons-exec has an issue affecting its community integration.
This issue affects 2 projects,
 and has been outstanding for 54 runs.
The current state of this project is 'Failed', with reason 'Build Failed'.
For reference only, the following projects are affected by this:
    - commons-exec :  Commons Exec Package
    - xmlgraphics-commons-test :  Apache XML Graphics Commons - Common Components for Batik
an...


Full details are available at:
    http://vmgump-vm3.apache.org/apache-commons/commons-exec/index.html

That said, some information snippets are provided here.

The following annotations (debug/informational/warning/error messages) were provided:
 -DEBUG- Sole jar output [commons-exec-*[0-9T].jar] identifier set to project name
 -DEBUG- (Apache Gump generated) Apache Maven Settings in: /srv/gump/public/workspace/apache-commons/exec/gump_mvn_settings.xml
 -INFO- Failed with reason build failed
 -DEBUG- Maven POM in: /srv/gump/public/workspace/apache-commons/exec/pom.xml
 -INFO- Failed to extract fallback artifacts from Gump Repository



The following work was performed:
http://vmgump-vm3.apache.org/apache-commons/commons-exec/gump_work/build_apache-commons_commons-exec.html
Work Name: build_apache-commons_commons-exec (Type: Build)
Work ended in a state of : Failed
Elapsed: 2 secs
Command Line: /opt/maven3/bin/mvn --batch-mode -DskipTests=true --settings /srv/gump/public/workspace/apache-commons/exec/gump_mvn_settings.xml
package 
[Working Directory: /srv/gump/public/workspace/apache-commons/exec]
M2_HOME: /opt/maven3
---------------------------------------------
[INFO] Scanning for projects...
[WARNING] 
[WARNING] Some problems were encountered while building the effective model for org.apache.commons:commons-exec:jar:1.4.0-SNAPSHOT
[WARNING] 'parent.relativePath' of POM org.apache.commons:commons-exec:1.4.0-SNAPSHOT (/srv/gump/public/workspace/apache-commons/exec/pom.xml)
points at org.apache.commons:commons-proper-aggregator instead of org.apache.commons:commons-parent,
please verify your project structure @ line 19, column 13
[WARNING] 
[WARNING] It is highly recommended to fix these problems because they threaten the stability
of your build.
[WARNING] 
[WARNING] For this reason, future Maven versions might no longer support building such malformed
projects.
[WARNING] 
[INFO]                                                                         
[INFO] ------------------------------------------------------------------------
[INFO] Building Apache Commons Exec 1.4.0-SNAPSHOT
[INFO] ------------------------------------------------------------------------
[INFO] Downloading: http://localhost:8192/maven2/org/codehaus/mojo/build-helper-maven-plugin/1.8/build-helper-maven-plugin-1.8.pom
[INFO] ------------------------------------------------------------------------
[INFO] BUILD FAILURE
[INFO] ------------------------------------------------------------------------
[INFO] Total time: 0.894 s
[INFO] Finished at: 2019-03-13T01:43:18+00:00
[INFO] Final Memory: 11M/106M
[INFO] ------------------------------------------------------------------------
[ERROR] Plugin org.codehaus.mojo:build-helper-maven-plugin:1.8 or one of its dependencies
could not be resolved: Failed to read artifact descriptor for org.codehaus.mojo:build-helper-maven-plugin:jar:1.8:
Could not transfer artifact org.codehaus.mojo:build-helper-maven-plugin:pom:1.8 from/to gump-central
(http://localhost:8192/maven2): TransferFailedException: ClientProtocolException: Status line
contains invalid status code: HTTP/1.1 :01 :01 -> [Help 1]
[ERROR] 
[ERROR] To see the full stack trace of the errors, re-run Maven with the -e switch.
[ERROR] Re-run Maven using the -X switch to enable full debug logging.
[ERROR] 
[ERROR] For more information about the errors and possible solutions, please read the following
articles:
[ERROR] [Help 1] http://cwiki.apache.org/confluence/display/MAVEN/PluginResolutionException
---------------------------------------------

To subscribe to this information via syndicated feeds:
- RSS: http://vmgump-vm3.apache.org/apache-commons/commons-exec/rss.xml
- Atom: http://vmgump-vm3.apache.org/apache-commons/commons-exec/atom.xml

============================== Gump Tracking Only ===
Produced by Apache Gump(TM) version 2.3.
Gump Run 20190313000007, vmgump-vm3.apache.org:vmgump:20190313000007
Gump E-mail Identifier (unique within run) #5.

*********************************************************** G U M P
[GUMP@vmgump-vm3]: Project commons-beanutils2 (in module apache-commons) failed
To whom it may engage...
        
This is an automated request, but not an unsolicited one. For 
more information please visit http://gump.apache.org/nagged.html, 
and/or contact the folk at general@gump.apache.org.

Project commons-beanutils2 has an issue affecting its community integration.
This issue affects 1 projects,
 and has been outstanding for 43 runs.
The current state of this project is 'Failed', with reason 'Build Failed'.
For reference only, the following projects are affected by this:
    - commons-beanutils2 :  Bean Utilities


Full details are available at:
    http://vmgump-vm3.apache.org/apache-commons/commons-beanutils2/index.html

That said, some information snippets are provided here.

The following annotations (debug/informational/warning/error messages) were provided:
 -DEBUG- Sole pom output [pom.xml] identifier set to project name
 -DEBUG- Dependency on junit exists, no need to add for property junit.home.
 -INFO- Failed with reason build failed
 -INFO- Failed to extract fallback artifacts from Gump Repository



The following work was performed:
http://vmgump-vm3.apache.org/apache-commons/commons-beanutils2/gump_work/build_apache-commons_commons-beanutils2.html
Work Name: build_apache-commons_commons-beanutils2 (Type: Build)
Work ended in a state of : Failed
Elapsed: 
Command Line: /usr/lib/jvm/java-8-oracle/bin/java -Djava.awt.headless=true -Dbuild.sysclasspath=only
-Dsun.zip.disableMemoryMapping=true -Xbootclasspath/p:/srv/gump/public/workspace/xml-xerces2/build/xercesImpl.jar:/srv/gump/public/workspace/xml-commons/java/external/build/xml-apis.jar
org.apache.tools.ant.Main -Dgump.merge=/srv/gump/public/gump/work/merge.xml -Djunit.home=/srv/gump/public/workspace/junit
-Dcomponent.version=20190313 jar 
[Working Directory: /srv/gump/public/workspace/apache-commons/beanutils]
CLASSPATH: /usr/lib/jvm/java-8-oracle/lib/tools.jar:/srv/gump/public/workspace/apache-commons/beanutils/target/classes:/srv/gump/public/workspace/ant/dist/lib/ant.jar:/srv/gump/public/workspace/ant/dist/lib/ant-launcher.jar:/srv/gump/public/workspace/ant/dist/lib/ant-jmf.jar:/srv/gump/public/workspace/ant/dist/lib/ant-junit.jar:/srv/gump/public/workspace/ant/dist/lib/ant-junit4.jar:/srv/gump/public/workspace/ant/dist/lib/ant-swing.jar:/srv/gump/public/workspace/ant/dist/lib/ant-apache-resolver.jar:/srv/gump/public/workspace/ant/dist/lib/ant-apache-xalan2.jar:/srv/gump/public/workspace/xml-commons/java/build/resolver.jar:/srv/gump/public/workspace/xml-commons/java/external/build/xml-apis-ext.jar:/srv/gump/public/workspace/apache-commons/logging/target/commons-logging-20190313.jar:/srv/gump/public/workspace/apache-commons/logging/target/commons-logging-api-20190313.jar:/srv/gump/public/workspace/commons-collections/target/commons-collections4-4.4-SNAPSHOT.jar:/srv/gump/public/workspace
 /junit/target/junit-4.13-SNAPSHOT.jar
---------------------------------------------
Buildfile: build.xml does not exist!
Build failed
---------------------------------------------

To subscribe to this information via syndicated feeds:
- RSS: http://vmgump-vm3.apache.org/apache-commons/commons-beanutils2/rss.xml
- Atom: http://vmgump-vm3.apache.org/apache-commons/commons-beanutils2/atom.xml

============================== Gump Tracking Only ===
Produced by Apache Gump(TM) version 2.3.
Gump Run 20190313000007, vmgump-vm3.apache.org:vmgump:20190313000007
Gump E-mail Identifier (unique within run) #6.


--
Apache Gump
http://gump.apache.org/ [Instance: vmgump-vm3]

---------------------------------------------------------------------
To unsubscribe, e-mail: general-unsubscribe@gump.apache.org
For additional commands, e-mail: general-help@gump.apache.org


Mime
View raw message