gump-general mailing list archives

Site index · List index
Message view « Date » · « Thread »
Top « Date » · « Thread »
From g...@vmgump-vm3.apache.org
Subject BATCH: All dressed up, with nowhere to go...
Date Wed, 06 Mar 2019 03:31:23 GMT
Dear Gumpmeisters,
            
The following 5 notifys should have been sent

*********************************************************** G U M P
[GUMP@vmgump-vm3]: Project java-hamcrest (in module java-hamcrest) failed
[GUMP@vmgump-vm3]: Module xz-java failed
[GUMP@vmgump-vm3]: Project fontbox (in module pdfbox) failed
[GUMP@vmgump-vm3]: Project dist-ant (in module ant) failed
[GUMP@vmgump-vm3]: Project commons-beanutils2 (in module apache-commons) failed
*********************************************************** G U M P
[GUMP@vmgump-vm3]: Project java-hamcrest (in module java-hamcrest) failed
To whom it may engage...
        
This is an automated request, but not an unsolicited one. For 
more information please visit http://gump.apache.org/nagged.html, 
and/or contact the folk at general@gump.apache.org.

Project java-hamcrest has an issue affecting its community integration.
This issue affects 1 projects,
 and has been outstanding for 512 runs.
The current state of this project is 'Failed', with reason 'Build Failed'.
For reference only, the following projects are affected by this:
    - java-hamcrest :  Provides a library of matcher objects (also known as constra...


Full details are available at:
    http://vmgump-vm3.apache.org/java-hamcrest/java-hamcrest/index.html

That said, some information snippets are provided here.

The following annotations (debug/informational/warning/error messages) were provided:
 -DEBUG- Sole jar output [java-hamcrest-*[0-9T].jar] identifier set to project name
 -DEBUG- (Apache Gump generated) Gradle Init Script in: /srv/gump/public/workspace/java-hamcrest/gump_init_script.gradle
 -INFO- Failed with reason build failed
 -DEBUG- Gradle build in: /srv/gump/public/workspace/java-hamcrest/build.gradle
 -INFO- Failed to extract fallback artifacts from Gump Repository



The following work was performed:
http://vmgump-vm3.apache.org/java-hamcrest/java-hamcrest/gump_work/build_java-hamcrest_java-hamcrest.html
Work Name: build_java-hamcrest_java-hamcrest (Type: Build)
Work ended in a state of : Failed
Elapsed: 6 secs
Command Line: gradle --debug -Djava.awt.headless=true -Dbuild.sysclasspath=only -Dsun.zip.disableMemoryMapping=true
-Dmaven.repo.local=/srv/gump/public/workspace/mvnlocalrepo/java-hamcrest.mvnlocalrepo --refresh-dependencies
--init-script /srv/gump/public/workspace/java-hamcrest/gump_init_script.gradle build 
[Working Directory: /srv/gump/public/workspace/java-hamcrest]
---------------------------------------------
00:20:13.980 [DEBUG] [org.gradle.cache.internal.DefaultFileLockManager] Releasing lock on
proj remapped class cache for gq4awl0mk6zsdllfou3uguod (/home/gump/.gradle/caches/2.14.1/scripts-remapped/build_el7aipplekpufwz1suifpnm7v/gq4awl0mk6zsdllfou3uguod/proj57408229).
00:20:14.031 [DEBUG] [org.gradle.model.internal.registry.DefaultModelRegistry] Project : -
Registering model element 'tasks.clean' (hidden = false)
00:20:14.033 [DEBUG] [org.gradle.model.internal.registry.DefaultModelRegistry] Project : -
Registering model element 'tasks.assemble' (hidden = false)
00:20:14.034 [DEBUG] [org.gradle.model.internal.registry.DefaultModelRegistry] Project : -
Registering model element 'tasks.check' (hidden = false)
00:20:14.035 [DEBUG] [org.gradle.model.internal.registry.DefaultModelRegistry] Project : -
Registering model element 'tasks.build' (hidden = false)
00:20:14.124 [DEBUG] [org.gradle.model.internal.registry.DefaultModelRegistry] Project : -
Transitioning model element 'tasks.assemble' from state Registered to Initialized
00:20:14.126 [DEBUG] [org.gradle.model.internal.registry.DefaultModelRegistry] Project : -
Running model element 'tasks.assemble' rule action tasks.addPlaceholderAction(assemble)
00:20:14.126 [DEBUG] [org.gradle.model.internal.registry.DefaultModelRegistry] Project : -
Mutating tasks.assemble using tasks.addPlaceholderAction(assemble)
00:20:14.126 [DEBUG] [org.gradle.model.internal.registry.DefaultModelRegistry] Project : -
Transitioning model element 'tasks.assemble' to state Discovered.
00:20:14.127 [DEBUG] [org.gradle.model.internal.registry.DefaultModelRegistry] Project : -
Running model element 'tasks.assemble' rule action tasks.addPlaceholderAction(assemble)
00:20:14.127 [DEBUG] [org.gradle.model.internal.registry.DefaultModelRegistry] Project : -
Mutating tasks.assemble using tasks.addPlaceholderAction(assemble)
00:20:14.153 [DEBUG] [org.gradle.model.internal.registry.DefaultModelRegistry] Project : -
Transitioning model element 'tasks.assemble' to state Created.
00:20:14.154 [DEBUG] [org.gradle.model.internal.registry.DefaultModelRegistry] Project : -
Transitioning model element 'tasks.assemble' to state DefaultsApplied.
00:20:14.155 [DEBUG] [org.gradle.model.internal.registry.DefaultModelRegistry] Project : -
Running model element 'tasks.assemble' rule action copyToTaskContainer
00:20:14.156 [DEBUG] [org.gradle.model.internal.registry.DefaultModelRegistry] Project : -
Mutating tasks.assemble using copyToTaskContainer
00:20:14.157 [DEBUG] [org.gradle.model.internal.registry.DefaultModelRegistry] Project : -
Transitioning model element 'tasks.assemble' to state Initialized.
00:20:14.318 [DEBUG] [org.gradle.model.internal.registry.DefaultModelRegistry] Project : -
Registering model element 'componentSpecFactory' (hidden = true)
00:20:14.326 [DEBUG] [org.gradle.model.internal.registry.DefaultModelRegistry] Project : -
Registering model element 'components' (hidden = false)
00:20:14.370 [DEBUG] [org.gradle.model.internal.registry.DefaultModelRegistry] Project : -
Registering model element 'sources' (hidden = false)
00:20:14.809 [DEBUG] [org.gradle.model.internal.registry.DefaultModelRegistry] Project : -
Registering model element 'binaries' (hidden = false)
00:20:14.824 [DEBUG] [org.gradle.model.internal.registry.DefaultModelRegistry] Project : -
Registering model element 'bridgedBinaries' (hidden = true)
00:20:14.831 [DEBUG] [org.gradle.model.internal.registry.DefaultModelRegistry] Project : -
Registering model element 'tasks.buildNeeded' (hidden = false)
00:20:14.832 [DEBUG] [org.gradle.model.internal.registry.DefaultModelRegistry] Project : -
Registering model element 'tasks.buildDependents' (hidden = false)
00:20:14.855 [DEBUG] [org.gradle.model.internal.registry.DefaultModelRegistry] Project : -
Registering model element 'tasks.publish' (hidden = false)
00:20:14.863 [DEBUG] [org.gradle.model.internal.registry.DefaultModelRegistry] Project : -
Registering model element 'projectPublicationRegistry' (hidden = false)
00:20:14.863 [DEBUG] [org.gradle.model.internal.registry.DefaultModelRegistry] Project : -
Registering model element 'publishing' (hidden = false)
00:20:14.864 [DEBUG] [org.gradle.model.internal.registry.DefaultModelRegistry] Project : -
Registering model element 'tasks.publishToMavenLocal' (hidden = false)
00:20:14.876 [DEBUG] [org.gradle.configuration.project.BuildScriptProcessor] Timing: Running
the build script took 0.918 secs
00:20:14.890 [ERROR] [org.gradle.BuildExceptionReporter] 
00:20:14.893 [ERROR] [org.gradle.BuildExceptionReporter] FAILURE: Build failed with an exception.
00:20:14.894 [ERROR] [org.gradle.BuildExceptionReporter] 
00:20:14.904 [ERROR] [org.gradle.BuildExceptionReporter] * Where:
00:20:14.904 [ERROR] [org.gradle.BuildExceptionReporter] Build file '/srv/gump/public/workspace/java-hamcrest/build.gradle'
line: 9
00:20:14.904 [ERROR] [org.gradle.BuildExceptionReporter] 
00:20:14.904 [ERROR] [org.gradle.BuildExceptionReporter] * What went wrong:
00:20:14.904 [ERROR] [org.gradle.BuildExceptionReporter] A problem occurred evaluating root
project 'JavaHamcrest'.
00:20:14.904 [ERROR] [org.gradle.BuildExceptionReporter] > Plugin with id 'java-library'
not found.
00:20:14.904 [ERROR] [org.gradle.BuildExceptionReporter] 
00:20:14.905 [ERROR] [org.gradle.BuildExceptionReporter] * Try:
00:20:14.905 [ERROR] [org.gradle.BuildExceptionReporter] Run with --stacktrace option to get
the stack trace. 
00:20:14.905 [LIFECYCLE] [org.gradle.BuildResultLogger] 
00:20:14.906 [LIFECYCLE] [org.gradle.BuildResultLogger] BUILD FAILED
00:20:14.906 [LIFECYCLE] [org.gradle.BuildResultLogger] 
00:20:14.906 [LIFECYCLE] [org.gradle.BuildResultLogger] Total time: 5.974 secs
00:20:14.908 [DEBUG] [org.gradle.cache.internal.DefaultCacheAccess] Cache artifact cache (/home/gump/.gradle/caches/modules-2)
was closed 0 times.
00:20:14.908 [DEBUG] [org.gradle.api.internal.artifacts.ivyservice.resolveengine.store.ResolutionResultsStoreFactory]
Deleted 0 resolution results binary files in 0.0 secs
00:20:14.909 [DEBUG] [org.gradle.api.internal.artifacts.ivyservice.ivyresolve.memcache.InMemoryCachedRepositoryFactory]
In-memory dependency metadata cache closed. Repos cached: 0, cache instances: 0, modules served
from cache: 0, artifacts: 0
00:20:14.909 [DEBUG] [org.gradle.cache.internal.DefaultCacheAccess] Cache Plugin Resolution
Cache (/home/gump/.gradle/caches/2.14.1/plugin-resolution) was closed 0 times.
00:20:14.909 [DEBUG] [org.gradle.api.internal.tasks.compile.daemon.CompilerDaemonManager]
Stopping 0 compiler daemon(s).
00:20:14.909 [INFO] [org.gradle.api.internal.tasks.compile.daemon.CompilerDaemonManager] Stopped
0 compiler daemon(s).
---------------------------------------------

To subscribe to this information via syndicated feeds:
- RSS: http://vmgump-vm3.apache.org/java-hamcrest/java-hamcrest/rss.xml
- Atom: http://vmgump-vm3.apache.org/java-hamcrest/java-hamcrest/atom.xml

============================== Gump Tracking Only ===
Produced by Apache Gump(TM) version 2.3.
Gump Run 20190306000006, vmgump-vm3.apache.org:vmgump:20190306000006
Gump E-mail Identifier (unique within run) #1.

*********************************************************** G U M P
[GUMP@vmgump-vm3]: Module xz-java failed
To whom it may engage...
        
This is an automated request, but not an unsolicited one. For 
more information please visit http://gump.apache.org/nagged.html, 
and/or contact the folk at general@gump.apache.org.

Module xz-java has an issue affecting its community integration,
 and has been outstanding for 750 runs.
The current state of this module is 'Failed', with reason 'Update Failed'.

Full details are available at:
    http://vmgump-vm3.apache.org/xz-java/index.html

That said, some information snippets are provided here.

The following annotations (debug/informational/warning/error messages) were provided:
 -INFO- Failed with reason update failed



The following work was performed:
http://vmgump-vm3.apache.org/xz-java/gump_work/update_xz-java.html
Work Name: update_xz-java (Type: Update)
Work ended in a state of : Failed
Elapsed: 8 secs
Command Line: git fetch --quiet --no-tags origin +refs/heads/master:refs/remotes/origin/master

[Working Directory: /srv/gump/public/workspace/cvs/xz-java]
---------------------------------------------
fatal: unable to access 'http://git.tukaani.org/xz-java.git/': Could not resolve host: git.tukaani.org
---------------------------------------------

To subscribe to this information via syndicated feeds:
- RSS: http://vmgump-vm3.apache.org/xz-java/rss.xml
- Atom: http://vmgump-vm3.apache.org/xz-java/atom.xml

============================== Gump Tracking Only ===
Produced by Apache Gump(TM) version 2.3.
Gump Run 20190306000006, vmgump-vm3.apache.org:vmgump:20190306000006
Gump E-mail Identifier (unique within run) #2.

*********************************************************** G U M P
[GUMP@vmgump-vm3]: Project fontbox (in module pdfbox) failed
To whom it may engage...
        
This is an automated request, but not an unsolicited one. For 
more information please visit http://gump.apache.org/nagged.html, 
and/or contact the folk at general@gump.apache.org.

Project fontbox has an issue affecting its community integration.
This issue affects 1 projects,
 and has been outstanding for 26 runs.
The current state of this project is 'Failed', with reason 'Build Failed'.
For reference only, the following projects are affected by this:
    - fontbox :  Apache PDFBox is an open source Java PDF library for working...


Full details are available at:
    http://vmgump-vm3.apache.org/pdfbox/fontbox/index.html

That said, some information snippets are provided here.

The following annotations (debug/informational/warning/error messages) were provided:
 -DEBUG- Sole jar output [fontbox-*[0-9T].jar] identifier set to project name
 -DEBUG- (Apache Gump generated) Apache Maven Settings in: /srv/gump/public/workspace/pdfbox/fontbox/gump_mvn_settings.xml
 -INFO- Failed with reason build failed
 -DEBUG- Maven POM in: /srv/gump/public/workspace/pdfbox/fontbox/pom.xml
 -INFO- Failed to extract fallback artifacts from Gump Repository



The following work was performed:
http://vmgump-vm3.apache.org/pdfbox/fontbox/gump_work/build_pdfbox_fontbox.html
Work Name: build_pdfbox_fontbox (Type: Build)
Work ended in a state of : Failed
Elapsed: 4 secs
Command Line: /opt/maven3/bin/mvn --batch-mode --settings /srv/gump/public/workspace/pdfbox/fontbox/gump_mvn_settings.xml
package 
[Working Directory: /srv/gump/public/workspace/pdfbox/fontbox]
M2_HOME: /opt/maven3
---------------------------------------------
[INFO] Scanning for projects...
[INFO]                                                                         
[INFO] ------------------------------------------------------------------------
[INFO] Building Apache FontBox 3.0.0-SNAPSHOT
[INFO] ------------------------------------------------------------------------
[INFO] Downloading: http://localhost:8192/maven2/commons-logging/commons-logging/1.2/commons-logging-1.2.jar
[INFO] Downloaded: http://localhost:8192/maven2/commons-logging/commons-logging/1.2/commons-logging-1.2.jar
(56 KB at 720.9 KB/sec)
[INFO] 
[INFO] --- maven-enforcer-plugin:1.4.1:enforce (default) @ fontbox ---
[WARNING] Rule 0: org.apache.maven.plugins.enforcer.RequireMavenVersion failed with message:
Detected Maven Version: 3.3.9 is not in the allowed range 3.5.
[INFO] ------------------------------------------------------------------------
[INFO] BUILD FAILURE
[INFO] ------------------------------------------------------------------------
[INFO] Total time: 2.596 s
[INFO] Finished at: 2019-03-06T00:50:39+00:00
[INFO] Final Memory: 16M/173M
[INFO] ------------------------------------------------------------------------
[ERROR] Failed to execute goal org.apache.maven.plugins:maven-enforcer-plugin:1.4.1:enforce
(default) on project fontbox: Some Enforcer rules have failed. Look above for specific messages
explaining why the rule failed. -> [Help 1]
[ERROR] 
[ERROR] To see the full stack trace of the errors, re-run Maven with the -e switch.
[ERROR] Re-run Maven using the -X switch to enable full debug logging.
[ERROR] 
[ERROR] For more information about the errors and possible solutions, please read the following
articles:
[ERROR] [Help 1] http://cwiki.apache.org/confluence/display/MAVEN/MojoExecutionException
---------------------------------------------

To subscribe to this information via syndicated feeds:
- RSS: http://vmgump-vm3.apache.org/pdfbox/fontbox/rss.xml
- Atom: http://vmgump-vm3.apache.org/pdfbox/fontbox/atom.xml

============================== Gump Tracking Only ===
Produced by Apache Gump(TM) version 2.3.
Gump Run 20190306000006, vmgump-vm3.apache.org:vmgump:20190306000006
Gump E-mail Identifier (unique within run) #4.

*********************************************************** G U M P
[GUMP@vmgump-vm3]: Project dist-ant (in module ant) failed
To whom it may engage...
        
This is an automated request, but not an unsolicited one. For 
more information please visit http://gump.apache.org/nagged.html, 
and/or contact the folk at general@gump.apache.org.

Project dist-ant has an issue affecting its community integration.
This issue affects 9 projects,
 and has been outstanding for 13 runs.
The current state of this project is 'Failed', with reason 'Build Failed'.
For reference only, the following projects are affected by this:
    - dist-ant :  Java based build tool
    - dist-xalan2 :  Release 2.x of the Xalan-Java XSLT processor
    - forrest-core :  Apache Forrest software is a publishing framework that trans...
    - forrest-test :  Apache Forrest software is a publishing framework that trans...
    - forrest-test-basic :  Apache Forrest software is a publishing framework that trans...
    - forrest-test-deploy-plugins :  Apache Forrest software is a publishing framework that
trans...
    - org.apache.dist-ant :  Java based build tool
    - test-ant :  Java based build tool
    - xml-batik :  Scalable Vector Graphics


Full details are available at:
    http://vmgump-vm3.apache.org/ant/dist-ant/index.html

That said, some information snippets are provided here.

The following annotations (debug/informational/warning/error messages) were provided:
 -INFO- Optional dependency xz failed with reason update failed
 -INFO- Failed with reason build failed
 -INFO- Failed to extract fallback artifacts from Gump Repository



The following work was performed:
http://vmgump-vm3.apache.org/ant/dist-ant/gump_work/build_ant_dist-ant.html
Work Name: build_ant_dist-ant (Type: Build)
Work ended in a state of : Failed
Elapsed: 41 secs
Command Line: /usr/lib/jvm/java-8-oracle/bin/java -Djava.awt.headless=true -Dbuild.sysclasspath=only
-Dsun.zip.disableMemoryMapping=true -Xbootclasspath/p:/srv/gump/public/workspace/xml-xerces2/build/xercesImpl.jar:/srv/gump/public/workspace/xml-commons/java/external/build/xml-apis.jar:/srv/gump/public/workspace/xml-xalan/build/xalan-unbundled.jar
org.apache.tools.ant.Main -Dgump.merge=/srv/gump/public/gump/work/merge.xml -Dchmod.fail=false
-Doptional.jars.whenmanifestonly=create distribution 
[Working Directory: /srv/gump/public/workspace/ant]
CLASSPATH: /usr/lib/jvm/java-8-oracle/lib/tools.jar:/srv/gump/public/workspace/ant/build/classes:/srv/gump/public/workspace/ant/dist/lib/ant.jar:/srv/gump/public/workspace/ant/dist/lib/ant-launcher.jar:/srv/gump/public/workspace/ant/dist/lib/ant-jmf.jar:/srv/gump/public/workspace/ant/dist/lib/ant-junit.jar:/srv/gump/public/workspace/ant/dist/lib/ant-junit4.jar:/srv/gump/public/workspace/ant/dist/lib/ant-swing.jar:/srv/gump/public/workspace/ant/dist/lib/ant-apache-resolver.jar:/srv/gump/public/workspace/ant/dist/lib/ant-apache-xalan2.jar:/srv/gump/public/workspace/xml-commons/java/build/resolver.jar:/srv/gump/public/workspace/xml-commons/java/external/build/xml-apis-ext.jar:/srv/gump/packages/antlr/antlr-3.1.3.jar:/srv/gump/public/workspace/ant-contrib/lib/bcel/jars/bcel-5.1.jar:/srv/gump/public/workspace/apache-commons/logging/target/commons-logging-20190306.jar:/srv/gump/public/workspace/apache-commons/logging/target/commons-logging-api-20190306.jar:/srv/gump/public/workspace/apache
 -commons/net/target/commons-net-3.7-SNAPSHOT.jar:/srv/gump/public/workspace/apache-commons/net/target/commons-net-ftp-3.7-SNAPSHOT.jar:/srv/gump/packages/jaf-1.1ea/activation.jar:/srv/gump/public/workspace/jakarta-bsf/build/lib/bsf.jar:/srv/gump/packages/apache-attic/jakarta-regexp-1.5.jar:/srv/gump/public/workspace/jakarta-servletapi-5/jsr154/dist/lib/servlet-api.jar:/srv/gump/packages/javamail-1.4/mail.jar:/srv/gump/packages/javamail-1.4/lib/mailapi.jar:/srv/gump/packages/jdepend-2.6/lib/jdepend.jar:/srv/gump/packages/jsch/jsch-0.1.45.jar:/srv/gump/public/workspace/junit/target/junit-4.13-SNAPSHOT.jar:/srv/gump/packages/hamcrest/hamcrest-core-1.3.jar:/srv/gump/packages/hamcrest/hamcrest-library-1.3.jar:/srv/gump/public/workspace/logging-log4j-12/target/log4j-1.2.18-SNAPSHOT.jar:/srv/gump/packages/apache-attic/oro-2.0.8.jar:xz-gump-20190305.jar
---------------------------------------------
  [javadoc]                       ^
  [javadoc]   symbol:   class TestIdentifier
  [javadoc]   location: class LegacyXmlResultFormatter
  [javadoc] Standard Doclet version 1.8.0_201
  [javadoc] Building tree for all the packages and classes...
  [javadoc] Building index for all the packages and classes...
  [javadoc] Building index for all classes...
  [javadoc] Generating /srv/gump/public/workspace/ant/build/javadocs/help-doc.html...
  [javadoc] Note: Custom tags that could override future standard tags:  @todo. To avoid potential
overrides, use at least one period character (.) in custom tag names.
  [javadoc] 100 warnings

dist-javadocs:
    [mkdir] Created dir: /srv/gump/public/workspace/ant/apache-ant-1.10.6alpha/manual/api
     [copy] Copying 1378 files to /srv/gump/public/workspace/ant/apache-ant-1.10.6alpha/manual/api

dist-internal:
    [mkdir] Created dir: /srv/gump/public/workspace/ant/apache-ant-1.10.6alpha/etc
     [copy] Copying 1 file to /srv/gump/public/workspace/ant/apache-ant-1.10.6alpha/lib
     [copy] Copying 1 file to /srv/gump/public/workspace/ant/apache-ant-1.10.6alpha/lib
     [copy] Copying 25 files to /srv/gump/public/workspace/ant/apache-ant-1.10.6alpha/lib
     [copy] Copying 1 file to /srv/gump/public/workspace/ant/apache-ant-1.10.6alpha/lib
     [copy] Copying 236 files to /srv/gump/public/workspace/ant/apache-ant-1.10.6alpha/manual
     [copy] Copying 11 files to /srv/gump/public/workspace/ant/apache-ant-1.10.6alpha
     [copy] Copying 16 files to /srv/gump/public/workspace/ant/apache-ant-1.10.6alpha/etc

zip-distribution:
      [zip] Building zip: /srv/gump/public/workspace/ant/distribution/binaries/apache-ant-1.10.6alpha-bin.zip

pkg-distribution:

tar-distribution:
      [tar] Building tar: /srv/gump/public/workspace/ant/distribution/binaries/apache-ant-1.10.6alpha-bin.tar
     [gzip] Building: /srv/gump/public/workspace/ant/distribution/binaries/apache-ant-1.10.6alpha-bin.tar.gz
    [bzip2] Building: /srv/gump/public/workspace/ant/distribution/binaries/apache-ant-1.10.6alpha-bin.tar.bz2

BUILD FAILED
/srv/gump/public/workspace/ant/build.xml:1343: Problem: failed to create task or type xz
Cause: the class org.apache.tools.ant.taskdefs.optional.xz.Xz was not found.
        This looks like one of Ant's optional components.
Action: Check that the appropriate optional JAR exists in
        -ANT_HOME/lib
        -the IDE Ant configuration dialogs

Do not panic, this is a common problem.
The commonest cause is a missing JAR.

This is not a bug; it is a configuration problem


Total time: 41 seconds
---------------------------------------------

To subscribe to this information via syndicated feeds:
- RSS: http://vmgump-vm3.apache.org/ant/dist-ant/rss.xml
- Atom: http://vmgump-vm3.apache.org/ant/dist-ant/atom.xml

============================== Gump Tracking Only ===
Produced by Apache Gump(TM) version 2.3.
Gump Run 20190306000006, vmgump-vm3.apache.org:vmgump:20190306000006
Gump E-mail Identifier (unique within run) #5.

*********************************************************** G U M P
[GUMP@vmgump-vm3]: Project commons-beanutils2 (in module apache-commons) failed
To whom it may engage...
        
This is an automated request, but not an unsolicited one. For 
more information please visit http://gump.apache.org/nagged.html, 
and/or contact the folk at general@gump.apache.org.

Project commons-beanutils2 has an issue affecting its community integration.
This issue affects 1 projects,
 and has been outstanding for 15 runs.
The current state of this project is 'Failed', with reason 'Build Failed'.
For reference only, the following projects are affected by this:
    - commons-beanutils2 :  Bean Utilities


Full details are available at:
    http://vmgump-vm3.apache.org/apache-commons/commons-beanutils2/index.html

That said, some information snippets are provided here.

The following annotations (debug/informational/warning/error messages) were provided:
 -DEBUG- Sole pom output [pom.xml] identifier set to project name
 -DEBUG- Dependency on junit exists, no need to add for property junit.home.
 -INFO- Failed with reason build failed
 -INFO- Failed to extract fallback artifacts from Gump Repository



The following work was performed:
http://vmgump-vm3.apache.org/apache-commons/commons-beanutils2/gump_work/build_apache-commons_commons-beanutils2.html
Work Name: build_apache-commons_commons-beanutils2 (Type: Build)
Work ended in a state of : Failed
Elapsed: 
Command Line: /usr/lib/jvm/java-8-oracle/bin/java -Djava.awt.headless=true -Dbuild.sysclasspath=only
-Dsun.zip.disableMemoryMapping=true -Xbootclasspath/p:/srv/gump/public/workspace/xml-xerces2/build/xercesImpl.jar:/srv/gump/public/workspace/xml-commons/java/external/build/xml-apis.jar
org.apache.tools.ant.Main -Dgump.merge=/srv/gump/public/gump/work/merge.xml -Djunit.home=/srv/gump/public/workspace/junit
-Dcomponent.version=20190306 jar 
[Working Directory: /srv/gump/public/workspace/apache-commons/beanutils]
CLASSPATH: /usr/lib/jvm/java-8-oracle/lib/tools.jar:/srv/gump/public/workspace/apache-commons/beanutils/target/classes:/srv/gump/public/workspace/ant/dist/lib/ant.jar:/srv/gump/public/workspace/ant/dist/lib/ant-launcher.jar:/srv/gump/public/workspace/ant/dist/lib/ant-jmf.jar:/srv/gump/public/workspace/ant/dist/lib/ant-junit.jar:/srv/gump/public/workspace/ant/dist/lib/ant-junit4.jar:/srv/gump/public/workspace/ant/dist/lib/ant-swing.jar:/srv/gump/public/workspace/ant/dist/lib/ant-apache-resolver.jar:/srv/gump/public/workspace/ant/dist/lib/ant-apache-xalan2.jar:/srv/gump/public/workspace/xml-commons/java/build/resolver.jar:/srv/gump/public/workspace/xml-commons/java/external/build/xml-apis-ext.jar:/srv/gump/public/workspace/apache-commons/logging/target/commons-logging-20190306.jar:/srv/gump/public/workspace/apache-commons/logging/target/commons-logging-api-20190306.jar:/srv/gump/public/workspace/commons-collections/target/commons-collections4-4.4-SNAPSHOT.jar:/srv/gump/public/workspace
 /junit/target/junit-4.13-SNAPSHOT.jar
---------------------------------------------
Buildfile: build.xml does not exist!
Build failed
---------------------------------------------

To subscribe to this information via syndicated feeds:
- RSS: http://vmgump-vm3.apache.org/apache-commons/commons-beanutils2/rss.xml
- Atom: http://vmgump-vm3.apache.org/apache-commons/commons-beanutils2/atom.xml

============================== Gump Tracking Only ===
Produced by Apache Gump(TM) version 2.3.
Gump Run 20190306000006, vmgump-vm3.apache.org:vmgump:20190306000006
Gump E-mail Identifier (unique within run) #6.


--
Apache Gump
http://gump.apache.org/ [Instance: vmgump-vm3]

---------------------------------------------------------------------
To unsubscribe, e-mail: general-unsubscribe@gump.apache.org
For additional commands, e-mail: general-help@gump.apache.org


Mime
View raw message