gump-general mailing list archives

Site index · List index
Message view « Date » · « Thread »
Top « Date » · « Thread »
From g...@vmgump-vm3.apache.org
Subject BATCH: All dressed up, with nowhere to go...
Date Wed, 27 Feb 2019 02:15:13 GMT
Dear Gumpmeisters,
            
The following 20 notifys should have been sent

*********************************************************** G U M P
[GUMP@vmgump-vm3]: Project logging-log4j-12 (in module logging-log4j-12) failed
[GUMP@vmgump-vm3]: Project commons-lang (in module commons-lang-2.x) failed
[GUMP@vmgump-vm3]: Project java-hamcrest (in module java-hamcrest) failed
[GUMP@vmgump-vm3]: Project commons-io (in module commons-io) failed
[GUMP@vmgump-vm3]: Project google-guava-parent (in module google-guava) failed
[GUMP@vmgump-vm3]: Project commons-math3-pom (in module commons-math-3.x) failed
[GUMP@vmgump-vm3]: Project pdfbox-parent (in module pdfbox) failed
[GUMP@vmgump-vm3]: Project google-guava (in module google-guava) failed
[GUMP@vmgump-vm3]: Project commons-net (in module apache-commons) failed
[GUMP@vmgump-vm3]: Project commons-daemon (in module apache-commons) failed
[GUMP@vmgump-vm3]: Project easymock-parent (in module easymock) failed
[GUMP@vmgump-vm3]: Project commons-compress (in module commons-compress) failed
[GUMP@vmgump-vm3]: Project commons-jxpath (in module apache-commons) failed
[GUMP@vmgump-vm3]: Project objenesis-parent (in module objenesis) failed
[GUMP@vmgump-vm3]: Project commons-validator (in module apache-commons) failed
[GUMP@vmgump-vm3]: Project rat (in module rat) failed
[GUMP@vmgump-vm3]: Project commons-collections4 (in module commons-collections) failed
[GUMP@vmgump-vm3]: Project commons-lang3 (in module commons-lang-trunk) failed
[GUMP@vmgump-vm3]: Project commons-bcel (in module apache-commons) failed
[GUMP@vmgump-vm3]: Project commons-exec (in module apache-commons) failed
*********************************************************** G U M P
[GUMP@vmgump-vm3]: Project logging-log4j-12 (in module logging-log4j-12) failed
To whom it may engage...
        
This is an automated request, but not an unsolicited one. For 
more information please visit http://gump.apache.org/nagged.html, 
and/or contact the folk at general@gump.apache.org.

Project logging-log4j-12 has an issue affecting its community integration.
This issue affects 19 projects,
 and has been outstanding for 12 runs.
The current state of this project is 'Failed', with reason 'Build Failed'.
For reference only, the following projects are affected by this:
    - checkstyle :  Java style checker
    - commons-beanutils :  Bean Utilities
    - commons-beanutils2 :  Bean Utilities
    - commons-digester :  XML to Java Object Configuration
    - commons-logging :  Logging Library Package
    - commons-logging-step-1 :  Logging Library Package
    - forrest-core :  Apache Forrest software is a publishing framework that trans...
    - forrest-test :  Apache Forrest software is a publishing framework that trans...
    - forrest-test-basic :  Apache Forrest software is a publishing framework that trans...
    - forrest-test-deploy-plugins :  Apache Forrest software is a publishing framework that trans...
    - jakarta-bsf :  Bean Scripting Framework
    - logging-log4j-12 :  Fast and flexible logging package for Java
    - logging-log4j-12-tests :  Fast and flexible logging package for Java
    - tomcat-tc7.0.x-validate :  Tomcat 7.x, a web server implementing Java Servlet 3.0,
    ...
    - tomcat-tc8.5.x-validate :  Tomcat 8.x, a web server implementing the Java Servlet 3.1,
...
    - tomcat-trunk-validate :  Tomcat 9.x, a web server implementing the Java Servlet 4.0,
...
    - xml-batik :  Scalable Vector Graphics
    - xmlgraphics-commons :  Apache XML Graphics Commons - Common Components for Batik an...
    - xmlgraphics-commons-test :  Apache XML Graphics Commons - Common Components for Batik an...


Full details are available at:
    http://vmgump-vm3.apache.org/logging-log4j-12/logging-log4j-12/index.html

That said, some information snippets are provided here.

The following annotations (debug/informational/warning/error messages) were provided:
 -DEBUG- (Apache Gump generated) Apache Maven Settings in: /srv/gump/public/workspace/logging-log4j-12/gump_mvn_settings.xml
 -INFO- Failed with reason build failed
 -DEBUG- Maven POM in: /srv/gump/public/workspace/logging-log4j-12/pom.xml
 -DEBUG- Extracted fallback artifacts from Gump Repository



The following work was performed:
http://vmgump-vm3.apache.org/logging-log4j-12/logging-log4j-12/gump_work/build_logging-log4j-12_logging-log4j-12.html
Work Name: build_logging-log4j-12_logging-log4j-12 (Type: Build)
Work ended in a state of : Failed
Elapsed: 3 mins 1 sec
Command Line: /opt/maven2/bin/mvn --batch-mode -DskipTests=true -Dmaven.javadoc.failOnError=false --settings /srv/gump/public/workspace/logging-log4j-12/gump_mvn_settings.xml package 
[Working Directory: /srv/gump/public/workspace/logging-log4j-12]
M2_HOME: /opt/maven2
---------------------------------------------
[INFO] Scanning for projects...
Downloading: http://localhost:8192/maven2/org/apache/felix/maven-bundle-plugin/2.1.0/maven-bundle-plugin-2.1.0.pom
[WARNING] Unable to get resource 'org.apache.felix:maven-bundle-plugin:pom:2.1.0' from repository central (http://repo1.maven.org/maven2): Error transferring file: Unexpected end of file from server
Downloading: http://localhost:8192/maven/2/org/apache/felix/maven-bundle-plugin/2.1.0/maven-bundle-plugin-2.1.0.pom
[WARNING] Unable to get resource 'org.apache.felix:maven-bundle-plugin:pom:2.1.0' from repository maven2-repository.dev.java.net (http://download.java.net/maven/2/): Error transferring file: Unexpected end of file from server
Downloading: http://localhost:8192/maven2/org/apache/felix/maven-bundle-plugin/2.1.0/maven-bundle-plugin-2.1.0.pom
[WARNING] Unable to get resource 'org.apache.felix:maven-bundle-plugin:pom:2.1.0' from repository central (http://repo1.maven.org/maven2): Error transferring file: Unexpected end of file from server
[INFO] ------------------------------------------------------------------------
[ERROR] BUILD ERROR
[INFO] ------------------------------------------------------------------------
[INFO] Error building POM (may not be this project's POM).


Project ID: org.apache.felix:maven-bundle-plugin

Reason: POM 'org.apache.felix:maven-bundle-plugin' not found in repository: Unable to download the artifact from any repository

  org.apache.felix:maven-bundle-plugin:pom:2.1.0

from the specified remote repositories:
  gump-maven2-repository.dev.java.net (http://localhost:8192/maven/2),
  gump-central (http://localhost:8192/maven2)

 for project org.apache.felix:maven-bundle-plugin


[INFO] ------------------------------------------------------------------------
[INFO] For more information, run Maven with the -e switch
[INFO] ------------------------------------------------------------------------
[INFO] Total time: 3 minutes 
[INFO] Finished at: Wed Feb 27 00:14:53 UTC 2019
[INFO] Final Memory: 3M/75M
[INFO] ------------------------------------------------------------------------
---------------------------------------------

To subscribe to this information via syndicated feeds:
- RSS: http://vmgump-vm3.apache.org/logging-log4j-12/logging-log4j-12/rss.xml
- Atom: http://vmgump-vm3.apache.org/logging-log4j-12/logging-log4j-12/atom.xml

============================== Gump Tracking Only ===
Produced by Apache Gump(TM) version 2.3.
Gump Run 20190227000007, vmgump-vm3.apache.org:vmgump:20190227000007
Gump E-mail Identifier (unique within run) #1.

*********************************************************** G U M P
[GUMP@vmgump-vm3]: Project commons-lang (in module commons-lang-2.x) failed
To whom it may engage...
        
This is an automated request, but not an unsolicited one. For 
more information please visit http://gump.apache.org/nagged.html, 
and/or contact the folk at general@gump.apache.org.

Project commons-lang has an issue affecting its community integration.
This issue affects 2 projects,
 and has been outstanding for 12 runs.
The current state of this project is 'Failed', with reason 'Build Failed'.
For reference only, the following projects are affected by this:
    - commons-lang :  utilities for the classes that are in java.lang's hierarchy
    - forrest-rat :  Apache Forrest software is a publishing framework that trans...


Full details are available at:
    http://vmgump-vm3.apache.org/commons-lang-2.x/commons-lang/index.html

That said, some information snippets are provided here.

The following annotations (debug/informational/warning/error messages) were provided:
 -DEBUG- (Apache Gump generated) Apache Maven Settings in: /srv/gump/public/workspace/commons-lang-2.x/gump_mvn_settings.xml
 -INFO- Failed with reason build failed
 -DEBUG- Maven POM in: /srv/gump/public/workspace/commons-lang-2.x/pom.xml
 -DEBUG- Extracted fallback artifacts from Gump Repository



The following work was performed:
http://vmgump-vm3.apache.org/commons-lang-2.x/commons-lang/gump_work/build_commons-lang-2.x_commons-lang.html
Work Name: build_commons-lang-2.x_commons-lang (Type: Build)
Work ended in a state of : Failed
Elapsed: 60 secs
Command Line: /opt/maven2/bin/mvn --batch-mode -DskipTests=true --settings /srv/gump/public/workspace/commons-lang-2.x/gump_mvn_settings.xml package 
[Working Directory: /srv/gump/public/workspace/commons-lang-2.x]
M2_HOME: /opt/maven2
---------------------------------------------
	at org.apache.maven.cli.compat.CompatibleMain.main(CompatibleMain.java:60)
	at sun.reflect.NativeMethodAccessorImpl.invoke0(Native Method)
	at sun.reflect.NativeMethodAccessorImpl.invoke(NativeMethodAccessorImpl.java:62)
	at sun.reflect.DelegatingMethodAccessorImpl.invoke(DelegatingMethodAccessorImpl.java:43)
	at java.lang.reflect.Method.invoke(Method.java:498)
	at org.codehaus.classworlds.Launcher.launchEnhanced(Launcher.java:315)
	at org.codehaus.classworlds.Launcher.launch(Launcher.java:255)
	at org.codehaus.classworlds.Launcher.mainWithExitCode(Launcher.java:430)
	at org.codehaus.classworlds.Launcher.main(Launcher.java:375)
Caused by: org.apache.maven.project.ProjectBuildingException: Cannot find parent: org.apache.commons:commons-parent for project: commons-lang:commons-lang:jar:2.7-SNAPSHOT for project commons-lang:commons-lang:jar:2.7-SNAPSHOT
	at org.apache.maven.project.DefaultMavenProjectBuilder.assembleLineage(DefaultMavenProjectBuilder.java:1396)
	at org.apache.maven.project.DefaultMavenProjectBuilder.buildInternal(DefaultMavenProjectBuilder.java:823)
	at org.apache.maven.project.DefaultMavenProjectBuilder.buildFromSourceFileInternal(DefaultMavenProjectBuilder.java:508)
	at org.apache.maven.project.DefaultMavenProjectBuilder.build(DefaultMavenProjectBuilder.java:200)
	at org.apache.maven.DefaultMaven.getProject(DefaultMaven.java:604)
	at org.apache.maven.DefaultMaven.collectProjects(DefaultMaven.java:487)
	at org.apache.maven.DefaultMaven.getProjects(DefaultMaven.java:391)
	... 12 more
Caused by: org.apache.maven.project.ProjectBuildingException: POM 'org.apache.commons:commons-parent' not found in repository: Unable to download the artifact from any repository

  org.apache.commons:commons-parent:pom:17

from the specified remote repositories:
  gump-central (http://localhost:8192/maven2)

 for project org.apache.commons:commons-parent
	at org.apache.maven.project.DefaultMavenProjectBuilder.findModelFromRepository(DefaultMavenProjectBuilder.java:605)
	at org.apache.maven.project.DefaultMavenProjectBuilder.assembleLineage(DefaultMavenProjectBuilder.java:1392)
	... 18 more
Caused by: org.apache.maven.artifact.resolver.ArtifactNotFoundException: Unable to download the artifact from any repository

  org.apache.commons:commons-parent:pom:17

from the specified remote repositories:
  gump-central (http://localhost:8192/maven2)


	at org.apache.maven.artifact.resolver.DefaultArtifactResolver.resolve(DefaultArtifactResolver.java:228)
	at org.apache.maven.artifact.resolver.DefaultArtifactResolver.resolve(DefaultArtifactResolver.java:90)
	at org.apache.maven.project.DefaultMavenProjectBuilder.findModelFromRepository(DefaultMavenProjectBuilder.java:558)
	... 19 more
Caused by: org.apache.maven.wagon.ResourceDoesNotExistException: Unable to download the artifact from any repository
	at org.apache.maven.artifact.manager.DefaultWagonManager.getArtifact(DefaultWagonManager.java:404)
	at org.apache.maven.artifact.resolver.DefaultArtifactResolver.resolve(DefaultArtifactResolver.java:216)
	... 21 more
[INFO] ------------------------------------------------------------------------
[INFO] Total time: 1 minute 
[INFO] Finished at: Wed Feb 27 00:15:55 UTC 2019
[INFO] Final Memory: 3M/75M
[INFO] ------------------------------------------------------------------------
---------------------------------------------

To subscribe to this information via syndicated feeds:
- RSS: http://vmgump-vm3.apache.org/commons-lang-2.x/commons-lang/rss.xml
- Atom: http://vmgump-vm3.apache.org/commons-lang-2.x/commons-lang/atom.xml

============================== Gump Tracking Only ===
Produced by Apache Gump(TM) version 2.3.
Gump Run 20190227000007, vmgump-vm3.apache.org:vmgump:20190227000007
Gump E-mail Identifier (unique within run) #2.

*********************************************************** G U M P
[GUMP@vmgump-vm3]: Project java-hamcrest (in module java-hamcrest) failed
To whom it may engage...
        
This is an automated request, but not an unsolicited one. For 
more information please visit http://gump.apache.org/nagged.html, 
and/or contact the folk at general@gump.apache.org.

Project java-hamcrest has an issue affecting its community integration.
This issue affects 1 projects,
 and has been outstanding for 484 runs.
The current state of this project is 'Failed', with reason 'Build Failed'.
For reference only, the following projects are affected by this:
    - java-hamcrest :  Provides a library of matcher objects (also known as constra...


Full details are available at:
    http://vmgump-vm3.apache.org/java-hamcrest/java-hamcrest/index.html

That said, some information snippets are provided here.

The following annotations (debug/informational/warning/error messages) were provided:
 -DEBUG- Sole jar output [java-hamcrest-*[0-9T].jar] identifier set to project name
 -DEBUG- (Apache Gump generated) Gradle Init Script in: /srv/gump/public/workspace/java-hamcrest/gump_init_script.gradle
 -INFO- Failed with reason build failed
 -DEBUG- Gradle build in: /srv/gump/public/workspace/java-hamcrest/build.gradle
 -INFO- Failed to extract fallback artifacts from Gump Repository



The following work was performed:
http://vmgump-vm3.apache.org/java-hamcrest/java-hamcrest/gump_work/build_java-hamcrest_java-hamcrest.html
Work Name: build_java-hamcrest_java-hamcrest (Type: Build)
Work ended in a state of : Failed
Elapsed: 5 secs
Command Line: gradle --debug -Djava.awt.headless=true -Dbuild.sysclasspath=only -Dsun.zip.disableMemoryMapping=true -Dmaven.repo.local=/srv/gump/public/workspace/mvnlocalrepo/java-hamcrest.mvnlocalrepo --refresh-dependencies --init-script /srv/gump/public/workspace/java-hamcrest/gump_init_script.gradle build 
[Working Directory: /srv/gump/public/workspace/java-hamcrest]
---------------------------------------------
01:03:50.762 [DEBUG] [org.gradle.cache.internal.DefaultFileLockManager] Releasing lock on proj remapped class cache for gq4awl0mk6zsdllfou3uguod (/home/gump/.gradle/caches/2.14.1/scripts-remapped/build_el7aipplekpufwz1suifpnm7v/gq4awl0mk6zsdllfou3uguod/proj57408229).
01:03:50.791 [DEBUG] [org.gradle.model.internal.registry.DefaultModelRegistry] Project : - Registering model element 'tasks.clean' (hidden = false)
01:03:50.793 [DEBUG] [org.gradle.model.internal.registry.DefaultModelRegistry] Project : - Registering model element 'tasks.assemble' (hidden = false)
01:03:50.794 [DEBUG] [org.gradle.model.internal.registry.DefaultModelRegistry] Project : - Registering model element 'tasks.check' (hidden = false)
01:03:50.795 [DEBUG] [org.gradle.model.internal.registry.DefaultModelRegistry] Project : - Registering model element 'tasks.build' (hidden = false)
01:03:50.878 [DEBUG] [org.gradle.model.internal.registry.DefaultModelRegistry] Project : - Transitioning model element 'tasks.assemble' from state Registered to Initialized
01:03:50.879 [DEBUG] [org.gradle.model.internal.registry.DefaultModelRegistry] Project : - Running model element 'tasks.assemble' rule action tasks.addPlaceholderAction(assemble)
01:03:50.880 [DEBUG] [org.gradle.model.internal.registry.DefaultModelRegistry] Project : - Mutating tasks.assemble using tasks.addPlaceholderAction(assemble)
01:03:50.880 [DEBUG] [org.gradle.model.internal.registry.DefaultModelRegistry] Project : - Transitioning model element 'tasks.assemble' to state Discovered.
01:03:50.880 [DEBUG] [org.gradle.model.internal.registry.DefaultModelRegistry] Project : - Running model element 'tasks.assemble' rule action tasks.addPlaceholderAction(assemble)
01:03:50.880 [DEBUG] [org.gradle.model.internal.registry.DefaultModelRegistry] Project : - Mutating tasks.assemble using tasks.addPlaceholderAction(assemble)
01:03:50.905 [DEBUG] [org.gradle.model.internal.registry.DefaultModelRegistry] Project : - Transitioning model element 'tasks.assemble' to state Created.
01:03:50.905 [DEBUG] [org.gradle.model.internal.registry.DefaultModelRegistry] Project : - Transitioning model element 'tasks.assemble' to state DefaultsApplied.
01:03:50.906 [DEBUG] [org.gradle.model.internal.registry.DefaultModelRegistry] Project : - Running model element 'tasks.assemble' rule action copyToTaskContainer
01:03:50.907 [DEBUG] [org.gradle.model.internal.registry.DefaultModelRegistry] Project : - Mutating tasks.assemble using copyToTaskContainer
01:03:50.908 [DEBUG] [org.gradle.model.internal.registry.DefaultModelRegistry] Project : - Transitioning model element 'tasks.assemble' to state Initialized.
01:03:51.107 [DEBUG] [org.gradle.model.internal.registry.DefaultModelRegistry] Project : - Registering model element 'componentSpecFactory' (hidden = true)
01:03:51.120 [DEBUG] [org.gradle.model.internal.registry.DefaultModelRegistry] Project : - Registering model element 'components' (hidden = false)
01:03:51.140 [DEBUG] [org.gradle.model.internal.registry.DefaultModelRegistry] Project : - Registering model element 'sources' (hidden = false)
01:03:51.449 [DEBUG] [org.gradle.model.internal.registry.DefaultModelRegistry] Project : - Registering model element 'binaries' (hidden = false)
01:03:51.464 [DEBUG] [org.gradle.model.internal.registry.DefaultModelRegistry] Project : - Registering model element 'bridgedBinaries' (hidden = true)
01:03:51.472 [DEBUG] [org.gradle.model.internal.registry.DefaultModelRegistry] Project : - Registering model element 'tasks.buildNeeded' (hidden = false)
01:03:51.473 [DEBUG] [org.gradle.model.internal.registry.DefaultModelRegistry] Project : - Registering model element 'tasks.buildDependents' (hidden = false)
01:03:51.493 [DEBUG] [org.gradle.model.internal.registry.DefaultModelRegistry] Project : - Registering model element 'tasks.publish' (hidden = false)
01:03:51.502 [DEBUG] [org.gradle.model.internal.registry.DefaultModelRegistry] Project : - Registering model element 'projectPublicationRegistry' (hidden = false)
01:03:51.503 [DEBUG] [org.gradle.model.internal.registry.DefaultModelRegistry] Project : - Registering model element 'publishing' (hidden = false)
01:03:51.503 [DEBUG] [org.gradle.model.internal.registry.DefaultModelRegistry] Project : - Registering model element 'tasks.publishToMavenLocal' (hidden = false)
01:03:51.514 [DEBUG] [org.gradle.configuration.project.BuildScriptProcessor] Timing: Running the build script took 0.781 secs
01:03:51.528 [ERROR] [org.gradle.BuildExceptionReporter] 
01:03:51.531 [ERROR] [org.gradle.BuildExceptionReporter] FAILURE: Build failed with an exception.
01:03:51.532 [ERROR] [org.gradle.BuildExceptionReporter] 
01:03:51.543 [ERROR] [org.gradle.BuildExceptionReporter] * Where:
01:03:51.544 [ERROR] [org.gradle.BuildExceptionReporter] Build file '/srv/gump/public/workspace/java-hamcrest/build.gradle' line: 9
01:03:51.544 [ERROR] [org.gradle.BuildExceptionReporter] 
01:03:51.544 [ERROR] [org.gradle.BuildExceptionReporter] * What went wrong:
01:03:51.544 [ERROR] [org.gradle.BuildExceptionReporter] A problem occurred evaluating root project 'JavaHamcrest'.
01:03:51.544 [ERROR] [org.gradle.BuildExceptionReporter] > Plugin with id 'java-library' not found.
01:03:51.544 [ERROR] [org.gradle.BuildExceptionReporter] 
01:03:51.545 [ERROR] [org.gradle.BuildExceptionReporter] * Try:
01:03:51.545 [ERROR] [org.gradle.BuildExceptionReporter] Run with --stacktrace option to get the stack trace. 
01:03:51.545 [LIFECYCLE] [org.gradle.BuildResultLogger] 
01:03:51.545 [LIFECYCLE] [org.gradle.BuildResultLogger] BUILD FAILED
01:03:51.546 [LIFECYCLE] [org.gradle.BuildResultLogger] 
01:03:51.546 [LIFECYCLE] [org.gradle.BuildResultLogger] Total time: 5.194 secs
01:03:51.548 [DEBUG] [org.gradle.cache.internal.DefaultCacheAccess] Cache artifact cache (/home/gump/.gradle/caches/modules-2) was closed 0 times.
01:03:51.548 [DEBUG] [org.gradle.api.internal.artifacts.ivyservice.ivyresolve.memcache.InMemoryCachedRepositoryFactory] In-memory dependency metadata cache closed. Repos cached: 0, cache instances: 0, modules served from cache: 0, artifacts: 0
01:03:51.548 [DEBUG] [org.gradle.api.internal.artifacts.ivyservice.resolveengine.store.ResolutionResultsStoreFactory] Deleted 0 resolution results binary files in 0.0 secs
01:03:51.549 [DEBUG] [org.gradle.cache.internal.DefaultCacheAccess] Cache Plugin Resolution Cache (/home/gump/.gradle/caches/2.14.1/plugin-resolution) was closed 0 times.
01:03:51.549 [DEBUG] [org.gradle.api.internal.tasks.compile.daemon.CompilerDaemonManager] Stopping 0 compiler daemon(s).
01:03:51.549 [INFO] [org.gradle.api.internal.tasks.compile.daemon.CompilerDaemonManager] Stopped 0 compiler daemon(s).
---------------------------------------------

To subscribe to this information via syndicated feeds:
- RSS: http://vmgump-vm3.apache.org/java-hamcrest/java-hamcrest/rss.xml
- Atom: http://vmgump-vm3.apache.org/java-hamcrest/java-hamcrest/atom.xml

============================== Gump Tracking Only ===
Produced by Apache Gump(TM) version 2.3.
Gump Run 20190227000007, vmgump-vm3.apache.org:vmgump:20190227000007
Gump E-mail Identifier (unique within run) #4.

*********************************************************** G U M P
[GUMP@vmgump-vm3]: Project commons-io (in module commons-io) failed
To whom it may engage...
        
This is an automated request, but not an unsolicited one. For 
more information please visit http://gump.apache.org/nagged.html, 
and/or contact the folk at general@gump.apache.org.

Project commons-io has an issue affecting its community integration.
This issue affects 1 projects,
 and has been outstanding for 12 runs.
The current state of this project is 'Failed', with reason 'Build Failed'.
For reference only, the following projects are affected by this:
    - commons-io :  Commons I/O Utility Package


Full details are available at:
    http://vmgump-vm3.apache.org/commons-io/commons-io/index.html

That said, some information snippets are provided here.

The following annotations (debug/informational/warning/error messages) were provided:
 -DEBUG- Sole jar output [commons-io-*[0-9T].jar] identifier set to project name
 -INFO- Optional dependency commons-lang failed with reason build failed
 -INFO- Optional dependency junit failed with reason build failed
 -DEBUG- (Apache Gump generated) Apache Maven Settings in: /srv/gump/public/workspace/commons-io/gump_mvn_settings.xml
 -INFO- Failed with reason build failed
 -DEBUG- Maven POM in: /srv/gump/public/workspace/commons-io/pom.xml
 -DEBUG- Extracted fallback artifacts from Gump Repository



The following work was performed:
http://vmgump-vm3.apache.org/commons-io/commons-io/gump_work/build_commons-io_commons-io.html
Work Name: build_commons-io_commons-io (Type: Build)
Work ended in a state of : Failed
Elapsed: 2 mins 1 sec
Command Line: /opt/maven3/bin/mvn --batch-mode -DskipTests=true --settings /srv/gump/public/workspace/commons-io/gump_mvn_settings.xml package 
[Working Directory: /srv/gump/public/workspace/commons-io]
M2_HOME: /opt/maven3
---------------------------------------------
[INFO] Scanning for projects...
[INFO] Downloading: http://localhost:8192/maven2/org/apache/commons/commons-parent/47/commons-parent-47.pom
Feb 27, 2019 1:21:01 AM org.apache.maven.wagon.providers.http.httpclient.impl.execchain.RetryExec execute
INFO: I/O exception (org.apache.maven.wagon.providers.http.httpclient.NoHttpResponseException) caught when processing request to {}->http://localhost:8192: The target server failed to respond
Feb 27, 2019 1:21:01 AM org.apache.maven.wagon.providers.http.httpclient.impl.execchain.RetryExec execute
INFO: Retrying request to {}->http://localhost:8192
Feb 27, 2019 1:21:31 AM org.apache.maven.wagon.providers.http.httpclient.impl.execchain.RetryExec execute
INFO: I/O exception (org.apache.maven.wagon.providers.http.httpclient.NoHttpResponseException) caught when processing request to {}->http://localhost:8192: The target server failed to respond
Feb 27, 2019 1:21:31 AM org.apache.maven.wagon.providers.http.httpclient.impl.execchain.RetryExec execute
INFO: Retrying request to {}->http://localhost:8192
Feb 27, 2019 1:22:01 AM org.apache.maven.wagon.providers.http.httpclient.impl.execchain.RetryExec execute
INFO: I/O exception (org.apache.maven.wagon.providers.http.httpclient.NoHttpResponseException) caught when processing request to {}->http://localhost:8192: The target server failed to respond
Feb 27, 2019 1:22:01 AM org.apache.maven.wagon.providers.http.httpclient.impl.execchain.RetryExec execute
INFO: Retrying request to {}->http://localhost:8192
[ERROR] [ERROR] Some problems were encountered while processing the POMs:
[FATAL] Non-resolvable parent POM for commons-io:commons-io:2.7-SNAPSHOT: Could not transfer artifact org.apache.commons:commons-parent:pom:47 from/to gump-central (http://localhost:8192/maven2): localhost:8192 failed to respond and 'parent.relativePath' points at wrong local POM @ line 19, column 11
 @ 
[ERROR] The build could not read 1 project -> [Help 1]
[ERROR]   
[ERROR]   The project commons-io:commons-io:2.7-SNAPSHOT (/srv/gump/public/workspace/commons-io/pom.xml) has 1 error
[ERROR]     Non-resolvable parent POM for commons-io:commons-io:2.7-SNAPSHOT: Could not transfer artifact org.apache.commons:commons-parent:pom:47 from/to gump-central (http://localhost:8192/maven2): localhost:8192 failed to respond and 'parent.relativePath' points at wrong local POM @ line 19, column 11 -> [Help 2]
[ERROR] 
[ERROR] To see the full stack trace of the errors, re-run Maven with the -e switch.
[ERROR] Re-run Maven using the -X switch to enable full debug logging.
[ERROR] 
[ERROR] For more information about the errors and possible solutions, please read the following articles:
[ERROR] [Help 1] http://cwiki.apache.org/confluence/display/MAVEN/ProjectBuildingException
[ERROR] [Help 2] http://cwiki.apache.org/confluence/display/MAVEN/UnresolvableModelException
---------------------------------------------

To subscribe to this information via syndicated feeds:
- RSS: http://vmgump-vm3.apache.org/commons-io/commons-io/rss.xml
- Atom: http://vmgump-vm3.apache.org/commons-io/commons-io/atom.xml

============================== Gump Tracking Only ===
Produced by Apache Gump(TM) version 2.3.
Gump Run 20190227000007, vmgump-vm3.apache.org:vmgump:20190227000007
Gump E-mail Identifier (unique within run) #7.

*********************************************************** G U M P
[GUMP@vmgump-vm3]: Project google-guava-parent (in module google-guava) failed
To whom it may engage...
        
This is an automated request, but not an unsolicited one. For 
more information please visit http://gump.apache.org/nagged.html, 
and/or contact the folk at general@gump.apache.org.

Project google-guava-parent has an issue affecting its community integration.
This issue affects 1 projects,
 and has been outstanding for 12 runs.
The current state of this project is 'Failed', with reason 'Build Failed'.
For reference only, the following projects are affected by this:
    - google-guava-parent :  Guava is a suite of core and expanded libraries that include...


Full details are available at:
    http://vmgump-vm3.apache.org/google-guava/google-guava-parent/index.html

That said, some information snippets are provided here.

The following annotations (debug/informational/warning/error messages) were provided:
 -INFO- Optional dependency junit failed with reason build failed
 -DEBUG- (Apache Gump generated) Apache Maven Settings in: /srv/gump/public/workspace/google-guava/gump_mvn_settings.xml
 -INFO- Failed with reason build failed
 -DEBUG- Maven POM in: /srv/gump/public/workspace/google-guava/pom.xml
 -INFO- Failed to extract fallback artifacts from Gump Repository



The following work was performed:
http://vmgump-vm3.apache.org/google-guava/google-guava-parent/gump_work/build_google-guava_google-guava-parent.html
Work Name: build_google-guava_google-guava-parent (Type: Build)
Work ended in a state of : Failed
Elapsed: 2 mins 1 sec
Command Line: /opt/maven3/bin/mvn --batch-mode -Dpackaging=pom -DgroupId=com.google.guava -Dfile=pom.xml -DartifactId=guava-parent -Dversion=HEAD-jre-SNAPSHOT --settings /srv/gump/public/workspace/google-guava/gump_mvn_settings.xml install:install-file 
[Working Directory: /srv/gump/public/workspace/google-guava]
M2_HOME: /opt/maven3
---------------------------------------------
[INFO] Scanning for projects...
[INFO] Downloading: http://localhost:8192/maven2/org/sonatype/oss/oss-parent/9/oss-parent-9.pom
Feb 27, 2019 1:23:04 AM org.apache.maven.wagon.providers.http.httpclient.impl.execchain.RetryExec execute
INFO: I/O exception (org.apache.maven.wagon.providers.http.httpclient.NoHttpResponseException) caught when processing request to {}->http://localhost:8192: The target server failed to respond
Feb 27, 2019 1:23:04 AM org.apache.maven.wagon.providers.http.httpclient.impl.execchain.RetryExec execute
INFO: Retrying request to {}->http://localhost:8192
Feb 27, 2019 1:23:34 AM org.apache.maven.wagon.providers.http.httpclient.impl.execchain.RetryExec execute
INFO: I/O exception (org.apache.maven.wagon.providers.http.httpclient.NoHttpResponseException) caught when processing request to {}->http://localhost:8192: The target server failed to respond
Feb 27, 2019 1:23:34 AM org.apache.maven.wagon.providers.http.httpclient.impl.execchain.RetryExec execute
INFO: Retrying request to {}->http://localhost:8192
Feb 27, 2019 1:24:04 AM org.apache.maven.wagon.providers.http.httpclient.impl.execchain.RetryExec execute
INFO: I/O exception (org.apache.maven.wagon.providers.http.httpclient.NoHttpResponseException) caught when processing request to {}->http://localhost:8192: The target server failed to respond
Feb 27, 2019 1:24:04 AM org.apache.maven.wagon.providers.http.httpclient.impl.execchain.RetryExec execute
INFO: Retrying request to {}->http://localhost:8192
[ERROR] [ERROR] Some problems were encountered while processing the POMs:
[FATAL] Non-resolvable parent POM for com.google.guava:guava-parent:HEAD-jre-SNAPSHOT: Could not transfer artifact org.sonatype.oss:oss-parent:pom:9 from/to gump-central (http://localhost:8192/maven2): localhost:8192 failed to respond and 'parent.relativePath' points at wrong local POM @ line 7, column 11
 @ 
[ERROR] The build could not read 1 project -> [Help 1]
[ERROR]   
[ERROR]   The project com.google.guava:guava-parent:HEAD-jre-SNAPSHOT (/srv/gump/public/workspace/google-guava/pom.xml) has 1 error
[ERROR]     Non-resolvable parent POM for com.google.guava:guava-parent:HEAD-jre-SNAPSHOT: Could not transfer artifact org.sonatype.oss:oss-parent:pom:9 from/to gump-central (http://localhost:8192/maven2): localhost:8192 failed to respond and 'parent.relativePath' points at wrong local POM @ line 7, column 11 -> [Help 2]
[ERROR] 
[ERROR] To see the full stack trace of the errors, re-run Maven with the -e switch.
[ERROR] Re-run Maven using the -X switch to enable full debug logging.
[ERROR] 
[ERROR] For more information about the errors and possible solutions, please read the following articles:
[ERROR] [Help 1] http://cwiki.apache.org/confluence/display/MAVEN/ProjectBuildingException
[ERROR] [Help 2] http://cwiki.apache.org/confluence/display/MAVEN/UnresolvableModelException
---------------------------------------------

To subscribe to this information via syndicated feeds:
- RSS: http://vmgump-vm3.apache.org/google-guava/google-guava-parent/rss.xml
- Atom: http://vmgump-vm3.apache.org/google-guava/google-guava-parent/atom.xml

============================== Gump Tracking Only ===
Produced by Apache Gump(TM) version 2.3.
Gump Run 20190227000007, vmgump-vm3.apache.org:vmgump:20190227000007
Gump E-mail Identifier (unique within run) #8.

*********************************************************** G U M P
[GUMP@vmgump-vm3]: Project commons-math3-pom (in module commons-math-3.x) failed
To whom it may engage...
        
This is an automated request, but not an unsolicited one. For 
more information please visit http://gump.apache.org/nagged.html, 
and/or contact the folk at general@gump.apache.org.

Project commons-math3-pom has an issue affecting its community integration.
This issue affects 2 projects,
 and has been outstanding for 12 runs.
The current state of this project is 'Failed', with reason 'Build Failed'.
For reference only, the following projects are affected by this:
    - commons-math3 :  library of lightweight, self-contained mathematics and stati...
    - commons-math3-pom :  Apache Commons Math 3.x


Full details are available at:
    http://vmgump-vm3.apache.org/commons-math-3.x/commons-math3-pom/index.html

That said, some information snippets are provided here.

The following annotations (debug/informational/warning/error messages) were provided:
 -INFO- Optional dependency junit failed with reason build failed
 -DEBUG- (Apache Gump generated) Apache Maven Settings in: /srv/gump/public/workspace/commons-math-3.x/gump_mvn_settings.xml
 -INFO- Failed with reason build failed
 -DEBUG- Maven POM in: /srv/gump/public/workspace/commons-math-3.x/pom.xml
 -DEBUG- Extracted fallback artifacts from Gump Repository



The following work was performed:
http://vmgump-vm3.apache.org/commons-math-3.x/commons-math3-pom/gump_work/build_commons-math-3.x_commons-math3-pom.html
Work Name: build_commons-math-3.x_commons-math3-pom (Type: Build)
Work ended in a state of : Failed
Elapsed: 2 mins 1 sec
Command Line: /opt/maven3/bin/mvn --batch-mode -Dpackaging=pom -DgroupId=org.apache.commons -Dfile=pom.xml -DartifactId=commons-math3 -Dversion=3.7-SNAPSHOT --settings /srv/gump/public/workspace/commons-math-3.x/gump_mvn_settings.xml install:install-file 
[Working Directory: /srv/gump/public/workspace/commons-math-3.x]
M2_HOME: /opt/maven3
---------------------------------------------
[INFO] Scanning for projects...
[INFO] Downloading: http://localhost:8192/maven2/org/apache/commons/commons-parent/39/commons-parent-39.pom
Feb 27, 2019 1:25:07 AM org.apache.maven.wagon.providers.http.httpclient.impl.execchain.RetryExec execute
INFO: I/O exception (org.apache.maven.wagon.providers.http.httpclient.NoHttpResponseException) caught when processing request to {}->http://localhost:8192: The target server failed to respond
Feb 27, 2019 1:25:07 AM org.apache.maven.wagon.providers.http.httpclient.impl.execchain.RetryExec execute
INFO: Retrying request to {}->http://localhost:8192
Feb 27, 2019 1:25:37 AM org.apache.maven.wagon.providers.http.httpclient.impl.execchain.RetryExec execute
INFO: I/O exception (org.apache.maven.wagon.providers.http.httpclient.NoHttpResponseException) caught when processing request to {}->http://localhost:8192: The target server failed to respond
Feb 27, 2019 1:25:37 AM org.apache.maven.wagon.providers.http.httpclient.impl.execchain.RetryExec execute
INFO: Retrying request to {}->http://localhost:8192
Feb 27, 2019 1:26:07 AM org.apache.maven.wagon.providers.http.httpclient.impl.execchain.RetryExec execute
INFO: I/O exception (org.apache.maven.wagon.providers.http.httpclient.NoHttpResponseException) caught when processing request to {}->http://localhost:8192: The target server failed to respond
Feb 27, 2019 1:26:07 AM org.apache.maven.wagon.providers.http.httpclient.impl.execchain.RetryExec execute
INFO: Retrying request to {}->http://localhost:8192
[ERROR] [ERROR] Some problems were encountered while processing the POMs:
[FATAL] Non-resolvable parent POM for org.apache.commons:commons-math3:3.7-SNAPSHOT: Could not transfer artifact org.apache.commons:commons-parent:pom:39 from/to gump-central (http://localhost:8192/maven2): localhost:8192 failed to respond and 'parent.relativePath' points at wrong local POM @ line 19, column 11
 @ 
[ERROR] The build could not read 1 project -> [Help 1]
[ERROR]   
[ERROR]   The project org.apache.commons:commons-math3:3.7-SNAPSHOT (/srv/gump/public/workspace/commons-math-3.x/pom.xml) has 1 error
[ERROR]     Non-resolvable parent POM for org.apache.commons:commons-math3:3.7-SNAPSHOT: Could not transfer artifact org.apache.commons:commons-parent:pom:39 from/to gump-central (http://localhost:8192/maven2): localhost:8192 failed to respond and 'parent.relativePath' points at wrong local POM @ line 19, column 11 -> [Help 2]
[ERROR] 
[ERROR] To see the full stack trace of the errors, re-run Maven with the -e switch.
[ERROR] Re-run Maven using the -X switch to enable full debug logging.
[ERROR] 
[ERROR] For more information about the errors and possible solutions, please read the following articles:
[ERROR] [Help 1] http://cwiki.apache.org/confluence/display/MAVEN/ProjectBuildingException
[ERROR] [Help 2] http://cwiki.apache.org/confluence/display/MAVEN/UnresolvableModelException
---------------------------------------------

To subscribe to this information via syndicated feeds:
- RSS: http://vmgump-vm3.apache.org/commons-math-3.x/commons-math3-pom/rss.xml
- Atom: http://vmgump-vm3.apache.org/commons-math-3.x/commons-math3-pom/atom.xml

============================== Gump Tracking Only ===
Produced by Apache Gump(TM) version 2.3.
Gump Run 20190227000007, vmgump-vm3.apache.org:vmgump:20190227000007
Gump E-mail Identifier (unique within run) #9.

*********************************************************** G U M P
[GUMP@vmgump-vm3]: Project pdfbox-parent (in module pdfbox) failed
To whom it may engage...
        
This is an automated request, but not an unsolicited one. For 
more information please visit http://gump.apache.org/nagged.html, 
and/or contact the folk at general@gump.apache.org.

Project pdfbox-parent has an issue affecting its community integration.
This issue affects 2 projects,
 and has been outstanding for 12 runs.
The current state of this project is 'Failed', with reason 'Build Failed'.
For reference only, the following projects are affected by this:
    - fontbox :  Apache PDFBox is an open source Java PDF library for working...
    - pdfbox-parent :  Apache PDFBox is an open source Java PDF library for working...


Full details are available at:
    http://vmgump-vm3.apache.org/pdfbox/pdfbox-parent/index.html

That said, some information snippets are provided here.

The following annotations (debug/informational/warning/error messages) were provided:
 -INFO- Optional dependency junit failed with reason build failed
 -DEBUG- (Apache Gump generated) Apache Maven Settings in: /srv/gump/public/workspace/pdfbox/parent/gump_mvn_settings.xml
 -INFO- Failed with reason build failed
 -DEBUG- Maven POM in: /srv/gump/public/workspace/pdfbox/parent/pom.xml



The following work was performed:
http://vmgump-vm3.apache.org/pdfbox/pdfbox-parent/gump_work/build_pdfbox_pdfbox-parent.html
Work Name: build_pdfbox_pdfbox-parent (Type: Build)
Work ended in a state of : Failed
Elapsed: 2 mins 1 sec
Command Line: /opt/maven3/bin/mvn --batch-mode -Dpackaging=pom -DgroupId=org.apache.pdfbox -Dfile=pom.xml -DartifactId=pdfbox-parent -Dversion=3.0.0-SNAPSHOT --settings /srv/gump/public/workspace/pdfbox/parent/gump_mvn_settings.xml install:install-file 
[Working Directory: /srv/gump/public/workspace/pdfbox/parent]
M2_HOME: /opt/maven3
---------------------------------------------
[INFO] Scanning for projects...
[INFO] Downloading: http://localhost:8192/maven2/org/apache/apache/21/apache-21.pom
Feb 27, 2019 1:27:10 AM org.apache.maven.wagon.providers.http.httpclient.impl.execchain.RetryExec execute
INFO: I/O exception (org.apache.maven.wagon.providers.http.httpclient.NoHttpResponseException) caught when processing request to {}->http://localhost:8192: The target server failed to respond
Feb 27, 2019 1:27:10 AM org.apache.maven.wagon.providers.http.httpclient.impl.execchain.RetryExec execute
INFO: Retrying request to {}->http://localhost:8192
Feb 27, 2019 1:27:40 AM org.apache.maven.wagon.providers.http.httpclient.impl.execchain.RetryExec execute
INFO: I/O exception (org.apache.maven.wagon.providers.http.httpclient.NoHttpResponseException) caught when processing request to {}->http://localhost:8192: The target server failed to respond
Feb 27, 2019 1:27:40 AM org.apache.maven.wagon.providers.http.httpclient.impl.execchain.RetryExec execute
INFO: Retrying request to {}->http://localhost:8192
Feb 27, 2019 1:28:10 AM org.apache.maven.wagon.providers.http.httpclient.impl.execchain.RetryExec execute
INFO: I/O exception (org.apache.maven.wagon.providers.http.httpclient.NoHttpResponseException) caught when processing request to {}->http://localhost:8192: The target server failed to respond
Feb 27, 2019 1:28:10 AM org.apache.maven.wagon.providers.http.httpclient.impl.execchain.RetryExec execute
INFO: Retrying request to {}->http://localhost:8192
[ERROR] [ERROR] Some problems were encountered while processing the POMs:
[FATAL] Non-resolvable parent POM for org.apache.pdfbox:pdfbox-parent:3.0.0-SNAPSHOT: Could not transfer artifact org.apache:apache:pom:21 from/to gump-central (http://localhost:8192/maven2): localhost:8192 failed to respond and 'parent.relativePath' points at no local POM @ line 23, column 13
 @ 
[ERROR] The build could not read 1 project -> [Help 1]
[ERROR]   
[ERROR]   The project org.apache.pdfbox:pdfbox-parent:3.0.0-SNAPSHOT (/srv/gump/public/workspace/pdfbox/parent/pom.xml) has 1 error
[ERROR]     Non-resolvable parent POM for org.apache.pdfbox:pdfbox-parent:3.0.0-SNAPSHOT: Could not transfer artifact org.apache:apache:pom:21 from/to gump-central (http://localhost:8192/maven2): localhost:8192 failed to respond and 'parent.relativePath' points at no local POM @ line 23, column 13 -> [Help 2]
[ERROR] 
[ERROR] To see the full stack trace of the errors, re-run Maven with the -e switch.
[ERROR] Re-run Maven using the -X switch to enable full debug logging.
[ERROR] 
[ERROR] For more information about the errors and possible solutions, please read the following articles:
[ERROR] [Help 1] http://cwiki.apache.org/confluence/display/MAVEN/ProjectBuildingException
[ERROR] [Help 2] http://cwiki.apache.org/confluence/display/MAVEN/UnresolvableModelException
---------------------------------------------

To subscribe to this information via syndicated feeds:
- RSS: http://vmgump-vm3.apache.org/pdfbox/pdfbox-parent/rss.xml
- Atom: http://vmgump-vm3.apache.org/pdfbox/pdfbox-parent/atom.xml

============================== Gump Tracking Only ===
Produced by Apache Gump(TM) version 2.3.
Gump Run 20190227000007, vmgump-vm3.apache.org:vmgump:20190227000007
Gump E-mail Identifier (unique within run) #10.

*********************************************************** G U M P
[GUMP@vmgump-vm3]: Project google-guava (in module google-guava) failed
To whom it may engage...
        
This is an automated request, but not an unsolicited one. For 
more information please visit http://gump.apache.org/nagged.html, 
and/or contact the folk at general@gump.apache.org.

Project google-guava has an issue affecting its community integration.
This issue affects 1 projects,
 and has been outstanding for 12 runs.
The current state of this project is 'Failed', with reason 'Build Failed'.
For reference only, the following projects are affected by this:
    - google-guava :  Guava is a suite of core and expanded libraries that include...


Full details are available at:
    http://vmgump-vm3.apache.org/google-guava/google-guava/index.html

That said, some information snippets are provided here.

The following annotations (debug/informational/warning/error messages) were provided:
 -INFO- Optional dependency google-guava-parent failed with reason build failed
 -DEBUG- (Apache Gump generated) Apache Maven Settings in: /srv/gump/public/workspace/google-guava/guava/gump_mvn_settings.xml
 -INFO- Failed with reason build failed
 -DEBUG- Maven POM in: /srv/gump/public/workspace/google-guava/guava/pom.xml
 -INFO- Failed to extract fallback artifacts from Gump Repository



The following work was performed:
http://vmgump-vm3.apache.org/google-guava/google-guava/gump_work/build_google-guava_google-guava.html
Work Name: build_google-guava_google-guava (Type: Build)
Work ended in a state of : Failed
Elapsed: 2 mins 2 secs
Command Line: /opt/maven3/bin/mvn --batch-mode --settings /srv/gump/public/workspace/google-guava/guava/gump_mvn_settings.xml package 
[Working Directory: /srv/gump/public/workspace/google-guava/guava]
M2_HOME: /opt/maven3
---------------------------------------------
[INFO] Scanning for projects...
[INFO] Downloading: http://localhost:8192/maven2/org/sonatype/oss/oss-parent/9/oss-parent-9.pom
Feb 27, 2019 1:34:34 AM org.apache.maven.wagon.providers.http.httpclient.impl.execchain.RetryExec execute
INFO: I/O exception (org.apache.maven.wagon.providers.http.httpclient.NoHttpResponseException) caught when processing request to {}->http://localhost:8192: The target server failed to respond
Feb 27, 2019 1:34:34 AM org.apache.maven.wagon.providers.http.httpclient.impl.execchain.RetryExec execute
INFO: Retrying request to {}->http://localhost:8192
Feb 27, 2019 1:35:04 AM org.apache.maven.wagon.providers.http.httpclient.impl.execchain.RetryExec execute
INFO: I/O exception (org.apache.maven.wagon.providers.http.httpclient.NoHttpResponseException) caught when processing request to {}->http://localhost:8192: The target server failed to respond
Feb 27, 2019 1:35:04 AM org.apache.maven.wagon.providers.http.httpclient.impl.execchain.RetryExec execute
INFO: Retrying request to {}->http://localhost:8192
Feb 27, 2019 1:35:34 AM org.apache.maven.wagon.providers.http.httpclient.impl.execchain.RetryExec execute
INFO: I/O exception (org.apache.maven.wagon.providers.http.httpclient.NoHttpResponseException) caught when processing request to {}->http://localhost:8192: The target server failed to respond
Feb 27, 2019 1:35:34 AM org.apache.maven.wagon.providers.http.httpclient.impl.execchain.RetryExec execute
INFO: Retrying request to {}->http://localhost:8192
[ERROR] [ERROR] Some problems were encountered while processing the POMs:
[FATAL] Non-resolvable parent POM for com.google.guava:guava-parent:HEAD-jre-SNAPSHOT: Could not transfer artifact org.sonatype.oss:oss-parent:pom:9 from/to gump-central (http://localhost:8192/maven2): localhost:8192 failed to respond and 'parent.relativePath' points at wrong local POM @ com.google.guava:guava-parent:HEAD-jre-SNAPSHOT, /srv/gump/public/workspace/google-guava/pom.xml, line 7, column 11
 @ 
[ERROR] The build could not read 1 project -> [Help 1]
[ERROR]   
[ERROR]   The project com.google.guava:guava:[unknown-version] (/srv/gump/public/workspace/google-guava/guava/pom.xml) has 1 error
[ERROR]     Non-resolvable parent POM for com.google.guava:guava-parent:HEAD-jre-SNAPSHOT: Could not transfer artifact org.sonatype.oss:oss-parent:pom:9 from/to gump-central (http://localhost:8192/maven2): localhost:8192 failed to respond and 'parent.relativePath' points at wrong local POM @ com.google.guava:guava-parent:HEAD-jre-SNAPSHOT, /srv/gump/public/workspace/google-guava/pom.xml, line 7, column 11 -> [Help 2]
[ERROR] 
[ERROR] To see the full stack trace of the errors, re-run Maven with the -e switch.
[ERROR] Re-run Maven using the -X switch to enable full debug logging.
[ERROR] 
[ERROR] For more information about the errors and possible solutions, please read the following articles:
[ERROR] [Help 1] http://cwiki.apache.org/confluence/display/MAVEN/ProjectBuildingException
[ERROR] [Help 2] http://cwiki.apache.org/confluence/display/MAVEN/UnresolvableModelException
---------------------------------------------

To subscribe to this information via syndicated feeds:
- RSS: http://vmgump-vm3.apache.org/google-guava/google-guava/rss.xml
- Atom: http://vmgump-vm3.apache.org/google-guava/google-guava/atom.xml

============================== Gump Tracking Only ===
Produced by Apache Gump(TM) version 2.3.
Gump Run 20190227000007, vmgump-vm3.apache.org:vmgump:20190227000007
Gump E-mail Identifier (unique within run) #12.

*********************************************************** G U M P
[GUMP@vmgump-vm3]: Project commons-net (in module apache-commons) failed
To whom it may engage...
        
This is an automated request, but not an unsolicited one. For 
more information please visit http://gump.apache.org/nagged.html, 
and/or contact the folk at general@gump.apache.org.

Project commons-net has an issue affecting its community integration.
This issue affects 1 projects,
 and has been outstanding for 12 runs.
The current state of this project is 'Failed', with reason 'Build Failed'.
For reference only, the following projects are affected by this:
    - commons-net :  Commons Net


Full details are available at:
    http://vmgump-vm3.apache.org/apache-commons/commons-net/index.html

That said, some information snippets are provided here.

The following annotations (debug/informational/warning/error messages) were provided:
 -INFO- Optional dependency junit failed with reason build failed
 -DEBUG- (Apache Gump generated) Apache Maven Settings in: /srv/gump/public/workspace/apache-commons/net/gump_mvn_settings.xml
 -INFO- Failed with reason build failed
 -DEBUG- Maven POM in: /srv/gump/public/workspace/apache-commons/net/pom.xml
 -DEBUG- Extracted fallback artifacts from Gump Repository



The following work was performed:
http://vmgump-vm3.apache.org/apache-commons/commons-net/gump_work/build_apache-commons_commons-net.html
Work Name: build_apache-commons_commons-net (Type: Build)
Work ended in a state of : Failed
Elapsed: 2 mins 2 secs
Command Line: /opt/maven3/bin/mvn --batch-mode -DskipTests=true --settings /srv/gump/public/workspace/apache-commons/net/gump_mvn_settings.xml package 
[Working Directory: /srv/gump/public/workspace/apache-commons/net]
M2_HOME: /opt/maven3
---------------------------------------------
[INFO] Scanning for projects...
[INFO] Downloading: http://localhost:8192/maven2/org/apache/commons/commons-parent/43/commons-parent-43.pom
Feb 27, 2019 1:36:36 AM org.apache.maven.wagon.providers.http.httpclient.impl.execchain.RetryExec execute
INFO: I/O exception (org.apache.maven.wagon.providers.http.httpclient.NoHttpResponseException) caught when processing request to {}->http://localhost:8192: The target server failed to respond
Feb 27, 2019 1:36:36 AM org.apache.maven.wagon.providers.http.httpclient.impl.execchain.RetryExec execute
INFO: Retrying request to {}->http://localhost:8192
Feb 27, 2019 1:37:06 AM org.apache.maven.wagon.providers.http.httpclient.impl.execchain.RetryExec execute
INFO: I/O exception (org.apache.maven.wagon.providers.http.httpclient.NoHttpResponseException) caught when processing request to {}->http://localhost:8192: The target server failed to respond
Feb 27, 2019 1:37:06 AM org.apache.maven.wagon.providers.http.httpclient.impl.execchain.RetryExec execute
INFO: Retrying request to {}->http://localhost:8192
Feb 27, 2019 1:37:36 AM org.apache.maven.wagon.providers.http.httpclient.impl.execchain.RetryExec execute
INFO: I/O exception (org.apache.maven.wagon.providers.http.httpclient.NoHttpResponseException) caught when processing request to {}->http://localhost:8192: The target server failed to respond
Feb 27, 2019 1:37:36 AM org.apache.maven.wagon.providers.http.httpclient.impl.execchain.RetryExec execute
INFO: Retrying request to {}->http://localhost:8192
[ERROR] [ERROR] Some problems were encountered while processing the POMs:
[WARNING] 'parent.relativePath' of POM commons-net:commons-net:3.7-SNAPSHOT (/srv/gump/public/workspace/apache-commons/net/pom.xml) points at org.apache.commons:commons-proper-aggregator instead of org.apache.commons:commons-parent, please verify your project structure @ line 22, column 13
[FATAL] Non-resolvable parent POM for commons-net:commons-net:3.7-SNAPSHOT: Could not transfer artifact org.apache.commons:commons-parent:pom:43 from/to gump-central (http://localhost:8192/maven2): localhost:8192 failed to respond and 'parent.relativePath' points at wrong local POM @ line 22, column 13
 @ 
[ERROR] The build could not read 1 project -> [Help 1]
[ERROR]   
[ERROR]   The project commons-net:commons-net:3.7-SNAPSHOT (/srv/gump/public/workspace/apache-commons/net/pom.xml) has 1 error
[ERROR]     Non-resolvable parent POM for commons-net:commons-net:3.7-SNAPSHOT: Could not transfer artifact org.apache.commons:commons-parent:pom:43 from/to gump-central (http://localhost:8192/maven2): localhost:8192 failed to respond and 'parent.relativePath' points at wrong local POM @ line 22, column 13 -> [Help 2]
[ERROR] 
[ERROR] To see the full stack trace of the errors, re-run Maven with the -e switch.
[ERROR] Re-run Maven using the -X switch to enable full debug logging.
[ERROR] 
[ERROR] For more information about the errors and possible solutions, please read the following articles:
[ERROR] [Help 1] http://cwiki.apache.org/confluence/display/MAVEN/ProjectBuildingException
[ERROR] [Help 2] http://cwiki.apache.org/confluence/display/MAVEN/UnresolvableModelException
---------------------------------------------

To subscribe to this information via syndicated feeds:
- RSS: http://vmgump-vm3.apache.org/apache-commons/commons-net/rss.xml
- Atom: http://vmgump-vm3.apache.org/apache-commons/commons-net/atom.xml

============================== Gump Tracking Only ===
Produced by Apache Gump(TM) version 2.3.
Gump Run 20190227000007, vmgump-vm3.apache.org:vmgump:20190227000007
Gump E-mail Identifier (unique within run) #13.

*********************************************************** G U M P
[GUMP@vmgump-vm3]: Project commons-daemon (in module apache-commons) failed
To whom it may engage...
        
This is an automated request, but not an unsolicited one. For 
more information please visit http://gump.apache.org/nagged.html, 
and/or contact the folk at general@gump.apache.org.

Project commons-daemon has an issue affecting its community integration.
This issue affects 1 projects,
 and has been outstanding for 12 runs.
The current state of this project is 'Failed', with reason 'Build Failed'.
For reference only, the following projects are affected by this:
    - commons-daemon :  Commons Daemon


Full details are available at:
    http://vmgump-vm3.apache.org/apache-commons/commons-daemon/index.html

That said, some information snippets are provided here.

The following annotations (debug/informational/warning/error messages) were provided:
 -INFO- Optional dependency ant prerequisite failed with reason build failed
 -DEBUG- (Apache Gump generated) Apache Maven Settings in: /srv/gump/public/workspace/apache-commons/daemon/gump_mvn_settings.xml
 -INFO- Failed with reason build failed
 -DEBUG- Maven POM in: /srv/gump/public/workspace/apache-commons/daemon/pom.xml
 -DEBUG- Extracted fallback artifacts from Gump Repository



The following work was performed:
http://vmgump-vm3.apache.org/apache-commons/commons-daemon/gump_work/build_apache-commons_commons-daemon.html
Work Name: build_apache-commons_commons-daemon (Type: Build)
Work ended in a state of : Failed
Elapsed: 2 mins 2 secs
Command Line: /opt/maven3/bin/mvn --batch-mode --settings /srv/gump/public/workspace/apache-commons/daemon/gump_mvn_settings.xml package 
[Working Directory: /srv/gump/public/workspace/apache-commons/daemon]
M2_HOME: /opt/maven3
---------------------------------------------
[INFO] Scanning for projects...
[INFO] Downloading: http://localhost:8192/maven2/org/apache/commons/commons-parent/43/commons-parent-43.pom
Feb 27, 2019 1:49:14 AM org.apache.maven.wagon.providers.http.httpclient.impl.execchain.RetryExec execute
INFO: I/O exception (org.apache.maven.wagon.providers.http.httpclient.NoHttpResponseException) caught when processing request to {}->http://localhost:8192: The target server failed to respond
Feb 27, 2019 1:49:14 AM org.apache.maven.wagon.providers.http.httpclient.impl.execchain.RetryExec execute
INFO: Retrying request to {}->http://localhost:8192
Feb 27, 2019 1:49:44 AM org.apache.maven.wagon.providers.http.httpclient.impl.execchain.RetryExec execute
INFO: I/O exception (org.apache.maven.wagon.providers.http.httpclient.NoHttpResponseException) caught when processing request to {}->http://localhost:8192: The target server failed to respond
Feb 27, 2019 1:49:44 AM org.apache.maven.wagon.providers.http.httpclient.impl.execchain.RetryExec execute
INFO: Retrying request to {}->http://localhost:8192
Feb 27, 2019 1:50:14 AM org.apache.maven.wagon.providers.http.httpclient.impl.execchain.RetryExec execute
INFO: I/O exception (org.apache.maven.wagon.providers.http.httpclient.NoHttpResponseException) caught when processing request to {}->http://localhost:8192: The target server failed to respond
Feb 27, 2019 1:50:14 AM org.apache.maven.wagon.providers.http.httpclient.impl.execchain.RetryExec execute
INFO: Retrying request to {}->http://localhost:8192
[ERROR] [ERROR] Some problems were encountered while processing the POMs:
[WARNING] 'parent.relativePath' of POM commons-daemon:commons-daemon:1.1.1-SNAPSHOT (/srv/gump/public/workspace/apache-commons/daemon/pom.xml) points at org.apache.commons:commons-proper-aggregator instead of org.apache.commons:commons-parent, please verify your project structure @ line 22, column 11
[FATAL] Non-resolvable parent POM for commons-daemon:commons-daemon:1.1.1-SNAPSHOT: Could not transfer artifact org.apache.commons:commons-parent:pom:43 from/to gump-central (http://localhost:8192/maven2): localhost:8192 failed to respond and 'parent.relativePath' points at wrong local POM @ line 22, column 11
 @ 
[ERROR] The build could not read 1 project -> [Help 1]
[ERROR]   
[ERROR]   The project commons-daemon:commons-daemon:1.1.1-SNAPSHOT (/srv/gump/public/workspace/apache-commons/daemon/pom.xml) has 1 error
[ERROR]     Non-resolvable parent POM for commons-daemon:commons-daemon:1.1.1-SNAPSHOT: Could not transfer artifact org.apache.commons:commons-parent:pom:43 from/to gump-central (http://localhost:8192/maven2): localhost:8192 failed to respond and 'parent.relativePath' points at wrong local POM @ line 22, column 11 -> [Help 2]
[ERROR] 
[ERROR] To see the full stack trace of the errors, re-run Maven with the -e switch.
[ERROR] Re-run Maven using the -X switch to enable full debug logging.
[ERROR] 
[ERROR] For more information about the errors and possible solutions, please read the following articles:
[ERROR] [Help 1] http://cwiki.apache.org/confluence/display/MAVEN/ProjectBuildingException
[ERROR] [Help 2] http://cwiki.apache.org/confluence/display/MAVEN/UnresolvableModelException
---------------------------------------------

To subscribe to this information via syndicated feeds:
- RSS: http://vmgump-vm3.apache.org/apache-commons/commons-daemon/rss.xml
- Atom: http://vmgump-vm3.apache.org/apache-commons/commons-daemon/atom.xml

============================== Gump Tracking Only ===
Produced by Apache Gump(TM) version 2.3.
Gump Run 20190227000007, vmgump-vm3.apache.org:vmgump:20190227000007
Gump E-mail Identifier (unique within run) #15.

*********************************************************** G U M P
[GUMP@vmgump-vm3]: Project easymock-parent (in module easymock) failed
To whom it may engage...
        
This is an automated request, but not an unsolicited one. For 
more information please visit http://gump.apache.org/nagged.html, 
and/or contact the folk at general@gump.apache.org.

Project easymock-parent has an issue affecting its community integration.
This issue affects 2 projects,
 and has been outstanding for 12 runs.
The current state of this project is 'Failed', with reason 'Build Failed'.
For reference only, the following projects are affected by this:
    - easymock :  EasyMock is a Java library that provides an easy way to use ...
    - easymock-parent :  EasyMock is a Java library that provides an easy way to use ...


Full details are available at:
    http://vmgump-vm3.apache.org/easymock/easymock-parent/index.html

That said, some information snippets are provided here.

The following annotations (debug/informational/warning/error messages) were provided:
 -INFO- Optional dependency commons-codec prerequisite failed with reason build failed
 -INFO- Optional dependency junit failed with reason build failed
 -DEBUG- (Apache Gump generated) Apache Maven Settings in: /srv/gump/public/workspace/easymock/gump_mvn_settings.xml
 -INFO- Failed with reason build failed
 -DEBUG- Maven POM in: /srv/gump/public/workspace/easymock/pom.xml
 -INFO- Failed to extract fallback artifacts from Gump Repository



The following work was performed:
http://vmgump-vm3.apache.org/easymock/easymock-parent/gump_work/build_easymock_easymock-parent.html
Work Name: build_easymock_easymock-parent (Type: Build)
Work ended in a state of : Failed
Elapsed: 2 mins 2 secs
Command Line: /opt/maven3/bin/mvn --batch-mode -Dpackaging=pom -DgroupId=org.easymock -Dfile=pom.xml -DartifactId=easymock-parent -Dversion=4.1-SNAPSHOT --settings /srv/gump/public/workspace/easymock/gump_mvn_settings.xml install:install-file 
[Working Directory: /srv/gump/public/workspace/easymock]
M2_HOME: /opt/maven3
---------------------------------------------
[INFO] Scanning for projects...
[INFO] Downloading: http://localhost:8192/maven2/org/apache/maven/wagon/wagon-ssh-external/1.0-beta-6/wagon-ssh-external-1.0-beta-6.pom
Feb 27, 2019 1:53:18 AM org.apache.maven.wagon.providers.http.httpclient.impl.execchain.RetryExec execute
INFO: I/O exception (org.apache.maven.wagon.providers.http.httpclient.NoHttpResponseException) caught when processing request to {}->http://localhost:8192: The target server failed to respond
Feb 27, 2019 1:53:18 AM org.apache.maven.wagon.providers.http.httpclient.impl.execchain.RetryExec execute
INFO: Retrying request to {}->http://localhost:8192
Feb 27, 2019 1:53:48 AM org.apache.maven.wagon.providers.http.httpclient.impl.execchain.RetryExec execute
INFO: I/O exception (org.apache.maven.wagon.providers.http.httpclient.NoHttpResponseException) caught when processing request to {}->http://localhost:8192: The target server failed to respond
Feb 27, 2019 1:53:48 AM org.apache.maven.wagon.providers.http.httpclient.impl.execchain.RetryExec execute
INFO: Retrying request to {}->http://localhost:8192
Feb 27, 2019 1:54:18 AM org.apache.maven.wagon.providers.http.httpclient.impl.execchain.RetryExec execute
INFO: I/O exception (org.apache.maven.wagon.providers.http.httpclient.NoHttpResponseException) caught when processing request to {}->http://localhost:8192: The target server failed to respond
Feb 27, 2019 1:54:18 AM org.apache.maven.wagon.providers.http.httpclient.impl.execchain.RetryExec execute
INFO: Retrying request to {}->http://localhost:8192
[ERROR] [ERROR] Some problems were encountered while processing the POMs:
[ERROR] Unresolveable build extension: Plugin org.apache.maven.wagon:wagon-ssh-external:1.0-beta-6 or one of its dependencies could not be resolved: Failed to read artifact descriptor for org.apache.maven.wagon:wagon-ssh-external:jar:1.0-beta-6 @ 
 @ 
[ERROR] The build could not read 1 project -> [Help 1]
[ERROR]   
[ERROR]   The project org.easymock:easymock-parent:4.1-SNAPSHOT (/srv/gump/public/workspace/easymock/pom.xml) has 1 error
[ERROR]     Unresolveable build extension: Plugin org.apache.maven.wagon:wagon-ssh-external:1.0-beta-6 or one of its dependencies could not be resolved: Failed to read artifact descriptor for org.apache.maven.wagon:wagon-ssh-external:jar:1.0-beta-6: Could not transfer artifact org.apache.maven.wagon:wagon-ssh-external:pom:1.0-beta-6 from/to gump-central (http://localhost:8192/maven2): localhost:8192 failed to respond -> [Help 2]
[ERROR] 
[ERROR] To see the full stack trace of the errors, re-run Maven with the -e switch.
[ERROR] Re-run Maven using the -X switch to enable full debug logging.
[ERROR] 
[ERROR] For more information about the errors and possible solutions, please read the following articles:
[ERROR] [Help 1] http://cwiki.apache.org/confluence/display/MAVEN/ProjectBuildingException
[ERROR] [Help 2] http://cwiki.apache.org/confluence/display/MAVEN/PluginManagerException
---------------------------------------------

To subscribe to this information via syndicated feeds:
- RSS: http://vmgump-vm3.apache.org/easymock/easymock-parent/rss.xml
- Atom: http://vmgump-vm3.apache.org/easymock/easymock-parent/atom.xml

============================== Gump Tracking Only ===
Produced by Apache Gump(TM) version 2.3.
Gump Run 20190227000007, vmgump-vm3.apache.org:vmgump:20190227000007
Gump E-mail Identifier (unique within run) #16.

*********************************************************** G U M P
[GUMP@vmgump-vm3]: Project commons-compress (in module commons-compress) failed
To whom it may engage...
        
This is an automated request, but not an unsolicited one. For 
more information please visit http://gump.apache.org/nagged.html, 
and/or contact the folk at general@gump.apache.org.

Project commons-compress has an issue affecting its community integration.
This issue affects 2 projects,
 and has been outstanding for 12 runs.
The current state of this project is 'Failed', with reason 'Build Failed'.
For reference only, the following projects are affected by this:
    - commons-compress :  Commons Compression Package
    - commons-compress-test :  Apache Commons Compress


Full details are available at:
    http://vmgump-vm3.apache.org/commons-compress/commons-compress/index.html

That said, some information snippets are provided here.

The following annotations (debug/informational/warning/error messages) were provided:
 -DEBUG- Sole jar output [commons-compress-*[0-9T].jar] identifier set to project name
 -INFO- Optional dependency xz prerequisite failed with reason build failed
 -INFO- Optional dependency brotli-dec-java prerequisite failed with reason build failed
 -INFO- Optional dependency junit failed with reason build failed
 -DEBUG- (Apache Gump generated) Apache Maven Settings in: /srv/gump/public/workspace/commons-compress/gump_mvn_settings.xml
 -INFO- Failed with reason build failed
 -DEBUG- Maven POM in: /srv/gump/public/workspace/commons-compress/pom.xml
 -DEBUG- Extracted fallback artifacts from Gump Repository



The following work was performed:
http://vmgump-vm3.apache.org/commons-compress/commons-compress/gump_work/build_commons-compress_commons-compress.html
Work Name: build_commons-compress_commons-compress (Type: Build)
Work ended in a state of : Failed
Elapsed: 2 mins 1 sec
Command Line: /opt/maven3/bin/mvn --batch-mode -DskipTests=true --settings /srv/gump/public/workspace/commons-compress/gump_mvn_settings.xml package 
[Working Directory: /srv/gump/public/workspace/commons-compress]
M2_HOME: /opt/maven3
---------------------------------------------
[INFO] Scanning for projects...
[INFO] Downloading: http://localhost:8192/maven2/org/apache/commons/commons-parent/47/commons-parent-47.pom
Feb 27, 2019 1:55:22 AM org.apache.maven.wagon.providers.http.httpclient.impl.execchain.RetryExec execute
INFO: I/O exception (org.apache.maven.wagon.providers.http.httpclient.NoHttpResponseException) caught when processing request to {}->http://localhost:8192: The target server failed to respond
Feb 27, 2019 1:55:22 AM org.apache.maven.wagon.providers.http.httpclient.impl.execchain.RetryExec execute
INFO: Retrying request to {}->http://localhost:8192
Feb 27, 2019 1:55:52 AM org.apache.maven.wagon.providers.http.httpclient.impl.execchain.RetryExec execute
INFO: I/O exception (org.apache.maven.wagon.providers.http.httpclient.NoHttpResponseException) caught when processing request to {}->http://localhost:8192: The target server failed to respond
Feb 27, 2019 1:55:52 AM org.apache.maven.wagon.providers.http.httpclient.impl.execchain.RetryExec execute
INFO: Retrying request to {}->http://localhost:8192
Feb 27, 2019 1:56:22 AM org.apache.maven.wagon.providers.http.httpclient.impl.execchain.RetryExec execute
INFO: I/O exception (org.apache.maven.wagon.providers.http.httpclient.NoHttpResponseException) caught when processing request to {}->http://localhost:8192: The target server failed to respond
Feb 27, 2019 1:56:22 AM org.apache.maven.wagon.providers.http.httpclient.impl.execchain.RetryExec execute
INFO: Retrying request to {}->http://localhost:8192
[ERROR] [ERROR] Some problems were encountered while processing the POMs:
[FATAL] Non-resolvable parent POM for org.apache.commons:commons-compress:1.19-SNAPSHOT: Could not transfer artifact org.apache.commons:commons-parent:pom:47 from/to gump-central (http://localhost:8192/maven2): localhost:8192 failed to respond and 'parent.relativePath' points at wrong local POM @ line 20, column 11
 @ 
[ERROR] The build could not read 1 project -> [Help 1]
[ERROR]   
[ERROR]   The project org.apache.commons:commons-compress:1.19-SNAPSHOT (/srv/gump/public/workspace/commons-compress/pom.xml) has 1 error
[ERROR]     Non-resolvable parent POM for org.apache.commons:commons-compress:1.19-SNAPSHOT: Could not transfer artifact org.apache.commons:commons-parent:pom:47 from/to gump-central (http://localhost:8192/maven2): localhost:8192 failed to respond and 'parent.relativePath' points at wrong local POM @ line 20, column 11 -> [Help 2]
[ERROR] 
[ERROR] To see the full stack trace of the errors, re-run Maven with the -e switch.
[ERROR] Re-run Maven using the -X switch to enable full debug logging.
[ERROR] 
[ERROR] For more information about the errors and possible solutions, please read the following articles:
[ERROR] [Help 1] http://cwiki.apache.org/confluence/display/MAVEN/ProjectBuildingException
[ERROR] [Help 2] http://cwiki.apache.org/confluence/display/MAVEN/UnresolvableModelException
---------------------------------------------

To subscribe to this information via syndicated feeds:
- RSS: http://vmgump-vm3.apache.org/commons-compress/commons-compress/rss.xml
- Atom: http://vmgump-vm3.apache.org/commons-compress/commons-compress/atom.xml

============================== Gump Tracking Only ===
Produced by Apache Gump(TM) version 2.3.
Gump Run 20190227000007, vmgump-vm3.apache.org:vmgump:20190227000007
Gump E-mail Identifier (unique within run) #17.

*********************************************************** G U M P
[GUMP@vmgump-vm3]: Project commons-jxpath (in module apache-commons) failed
To whom it may engage...
        
This is an automated request, but not an unsolicited one. For 
more information please visit http://gump.apache.org/nagged.html, 
and/or contact the folk at general@gump.apache.org.

Project commons-jxpath has an issue affecting its community integration.
This issue affects 1 projects,
 and has been outstanding for 12 runs.
The current state of this project is 'Failed', with reason 'Build Failed'.
For reference only, the following projects are affected by this:
    - commons-jxpath :  XPath traversal of JavaBeans


Full details are available at:
    http://vmgump-vm3.apache.org/apache-commons/commons-jxpath/index.html

That said, some information snippets are provided here.

The following annotations (debug/informational/warning/error messages) were provided:
 -DEBUG- Sole jar output [commons-jxpath-*[0-9T].jar] identifier set to project name
 -INFO- Optional dependency commons-beanutils prerequisite failed with reason build failed
 -INFO- Optional dependency ant prerequisite failed with reason build failed
 -INFO- Optional dependency junit failed with reason build failed
 -DEBUG- (Apache Gump generated) Apache Maven Settings in: /srv/gump/public/workspace/apache-commons/jxpath/gump_mvn_settings.xml
 -INFO- Failed with reason build failed
 -DEBUG- Maven POM in: /srv/gump/public/workspace/apache-commons/jxpath/pom.xml
 -DEBUG- Extracted fallback artifacts from Gump Repository



The following work was performed:
http://vmgump-vm3.apache.org/apache-commons/commons-jxpath/gump_work/build_apache-commons_commons-jxpath.html
Work Name: build_apache-commons_commons-jxpath (Type: Build)
Work ended in a state of : Failed
Elapsed: 2 mins 1 sec
Command Line: /opt/maven3/bin/mvn --batch-mode -DskipTests=true --settings /srv/gump/public/workspace/apache-commons/jxpath/gump_mvn_settings.xml package 
[Working Directory: /srv/gump/public/workspace/apache-commons/jxpath]
M2_HOME: /opt/maven3
---------------------------------------------
[INFO] Scanning for projects...
[INFO] Downloading: http://localhost:8192/maven2/org/apache/commons/commons-parent/39/commons-parent-39.pom
Feb 27, 2019 1:57:42 AM org.apache.maven.wagon.providers.http.httpclient.impl.execchain.RetryExec execute
INFO: I/O exception (org.apache.maven.wagon.providers.http.httpclient.NoHttpResponseException) caught when processing request to {}->http://localhost:8192: The target server failed to respond
Feb 27, 2019 1:57:42 AM org.apache.maven.wagon.providers.http.httpclient.impl.execchain.RetryExec execute
INFO: Retrying request to {}->http://localhost:8192
Feb 27, 2019 1:58:12 AM org.apache.maven.wagon.providers.http.httpclient.impl.execchain.RetryExec execute
INFO: I/O exception (org.apache.maven.wagon.providers.http.httpclient.NoHttpResponseException) caught when processing request to {}->http://localhost:8192: The target server failed to respond
Feb 27, 2019 1:58:12 AM org.apache.maven.wagon.providers.http.httpclient.impl.execchain.RetryExec execute
INFO: Retrying request to {}->http://localhost:8192
Feb 27, 2019 1:58:42 AM org.apache.maven.wagon.providers.http.httpclient.impl.execchain.RetryExec execute
INFO: I/O exception (org.apache.maven.wagon.providers.http.httpclient.NoHttpResponseException) caught when processing request to {}->http://localhost:8192: The target server failed to respond
Feb 27, 2019 1:58:42 AM org.apache.maven.wagon.providers.http.httpclient.impl.execchain.RetryExec execute
INFO: Retrying request to {}->http://localhost:8192
[ERROR] [ERROR] Some problems were encountered while processing the POMs:
[WARNING] 'parent.relativePath' of POM commons-jxpath:commons-jxpath:1.4-SNAPSHOT (/srv/gump/public/workspace/apache-commons/jxpath/pom.xml) points at org.apache.commons:commons-proper-aggregator instead of org.apache.commons:commons-parent, please verify your project structure @ line 21, column 11
[FATAL] Non-resolvable parent POM for commons-jxpath:commons-jxpath:1.4-SNAPSHOT: Could not transfer artifact org.apache.commons:commons-parent:pom:39 from/to gump-central (http://localhost:8192/maven2): localhost:8192 failed to respond and 'parent.relativePath' points at wrong local POM @ line 21, column 11
 @ 
[ERROR] The build could not read 1 project -> [Help 1]
[ERROR]   
[ERROR]   The project commons-jxpath:commons-jxpath:1.4-SNAPSHOT (/srv/gump/public/workspace/apache-commons/jxpath/pom.xml) has 1 error
[ERROR]     Non-resolvable parent POM for commons-jxpath:commons-jxpath:1.4-SNAPSHOT: Could not transfer artifact org.apache.commons:commons-parent:pom:39 from/to gump-central (http://localhost:8192/maven2): localhost:8192 failed to respond and 'parent.relativePath' points at wrong local POM @ line 21, column 11 -> [Help 2]
[ERROR] 
[ERROR] To see the full stack trace of the errors, re-run Maven with the -e switch.
[ERROR] Re-run Maven using the -X switch to enable full debug logging.
[ERROR] 
[ERROR] For more information about the errors and possible solutions, please read the following articles:
[ERROR] [Help 1] http://cwiki.apache.org/confluence/display/MAVEN/ProjectBuildingException
[ERROR] [Help 2] http://cwiki.apache.org/confluence/display/MAVEN/UnresolvableModelException
---------------------------------------------

To subscribe to this information via syndicated feeds:
- RSS: http://vmgump-vm3.apache.org/apache-commons/commons-jxpath/rss.xml
- Atom: http://vmgump-vm3.apache.org/apache-commons/commons-jxpath/atom.xml

============================== Gump Tracking Only ===
Produced by Apache Gump(TM) version 2.3.
Gump Run 20190227000007, vmgump-vm3.apache.org:vmgump:20190227000007
Gump E-mail Identifier (unique within run) #18.

*********************************************************** G U M P
[GUMP@vmgump-vm3]: Project objenesis-parent (in module objenesis) failed
To whom it may engage...
        
This is an automated request, but not an unsolicited one. For 
more information please visit http://gump.apache.org/nagged.html, 
and/or contact the folk at general@gump.apache.org.

Project objenesis-parent has an issue affecting its community integration.
This issue affects 2 projects,
 and has been outstanding for 12 runs.
The current state of this project is 'Failed', with reason 'Build Failed'.
For reference only, the following projects are affected by this:
    - objenesis :  Objenesis is a small Java library that serves one purpose: T...
    - objenesis-parent :  Objenesis is a small Java library that serves one purpose: T...


Full details are available at:
    http://vmgump-vm3.apache.org/objenesis/objenesis-parent/index.html

That said, some information snippets are provided here.

The following annotations (debug/informational/warning/error messages) were provided:
 -INFO- Optional dependency commons-cli prerequisite failed with reason build failed
 -INFO- Optional dependency junit failed with reason build failed
 -DEBUG- (Apache Gump generated) Apache Maven Settings in: /srv/gump/public/workspace/objenesis/gump_mvn_settings.xml
 -INFO- Failed with reason build failed
 -DEBUG- Maven POM in: /srv/gump/public/workspace/objenesis/pom.xml
 -DEBUG- Extracted fallback artifacts from Gump Repository



The following work was performed:
http://vmgump-vm3.apache.org/objenesis/objenesis-parent/gump_work/build_objenesis_objenesis-parent.html
Work Name: build_objenesis_objenesis-parent (Type: Build)
Work ended in a state of : Failed
Elapsed: 2 mins 1 sec
Command Line: /opt/maven3/bin/mvn --batch-mode -Dpackaging=pom -DgroupId=org.objenesis -Dfile=pom.xml -DartifactId=objenesis-parent -Dversion=3.1-SNAPSHOT --settings /srv/gump/public/workspace/objenesis/gump_mvn_settings.xml install:install-file 
[Working Directory: /srv/gump/public/workspace/objenesis]
M2_HOME: /opt/maven3
---------------------------------------------
[INFO] Scanning for projects...
[INFO] Downloading: http://localhost:8192/maven2/org/apache/maven/wagon/wagon-ssh-external/2.10/wagon-ssh-external-2.10.pom
Feb 27, 2019 2:00:04 AM org.apache.maven.wagon.providers.http.httpclient.impl.execchain.RetryExec execute
INFO: I/O exception (org.apache.maven.wagon.providers.http.httpclient.NoHttpResponseException) caught when processing request to {}->http://localhost:8192: The target server failed to respond
Feb 27, 2019 2:00:04 AM org.apache.maven.wagon.providers.http.httpclient.impl.execchain.RetryExec execute
INFO: Retrying request to {}->http://localhost:8192
Feb 27, 2019 2:00:34 AM org.apache.maven.wagon.providers.http.httpclient.impl.execchain.RetryExec execute
INFO: I/O exception (org.apache.maven.wagon.providers.http.httpclient.NoHttpResponseException) caught when processing request to {}->http://localhost:8192: The target server failed to respond
Feb 27, 2019 2:00:34 AM org.apache.maven.wagon.providers.http.httpclient.impl.execchain.RetryExec execute
INFO: Retrying request to {}->http://localhost:8192
Feb 27, 2019 2:01:04 AM org.apache.maven.wagon.providers.http.httpclient.impl.execchain.RetryExec execute
INFO: I/O exception (org.apache.maven.wagon.providers.http.httpclient.NoHttpResponseException) caught when processing request to {}->http://localhost:8192: The target server failed to respond
Feb 27, 2019 2:01:04 AM org.apache.maven.wagon.providers.http.httpclient.impl.execchain.RetryExec execute
INFO: Retrying request to {}->http://localhost:8192
[ERROR] [ERROR] Some problems were encountered while processing the POMs:
[ERROR] Unresolveable build extension: Plugin org.apache.maven.wagon:wagon-ssh-external:2.10 or one of its dependencies could not be resolved: Failed to read artifact descriptor for org.apache.maven.wagon:wagon-ssh-external:jar:2.10 @ 
 @ 
[ERROR] The build could not read 1 project -> [Help 1]
[ERROR]   
[ERROR]   The project org.objenesis:objenesis-parent:3.1-SNAPSHOT (/srv/gump/public/workspace/objenesis/pom.xml) has 1 error
[ERROR]     Unresolveable build extension: Plugin org.apache.maven.wagon:wagon-ssh-external:2.10 or one of its dependencies could not be resolved: Failed to read artifact descriptor for org.apache.maven.wagon:wagon-ssh-external:jar:2.10: Could not transfer artifact org.apache.maven.wagon:wagon-ssh-external:pom:2.10 from/to gump-central (http://localhost:8192/maven2): localhost:8192 failed to respond -> [Help 2]
[ERROR] 
[ERROR] To see the full stack trace of the errors, re-run Maven with the -e switch.
[ERROR] Re-run Maven using the -X switch to enable full debug logging.
[ERROR] 
[ERROR] For more information about the errors and possible solutions, please read the following articles:
[ERROR] [Help 1] http://cwiki.apache.org/confluence/display/MAVEN/ProjectBuildingException
[ERROR] [Help 2] http://cwiki.apache.org/confluence/display/MAVEN/PluginManagerException
---------------------------------------------

To subscribe to this information via syndicated feeds:
- RSS: http://vmgump-vm3.apache.org/objenesis/objenesis-parent/rss.xml
- Atom: http://vmgump-vm3.apache.org/objenesis/objenesis-parent/atom.xml

============================== Gump Tracking Only ===
Produced by Apache Gump(TM) version 2.3.
Gump Run 20190227000007, vmgump-vm3.apache.org:vmgump:20190227000007
Gump E-mail Identifier (unique within run) #19.

*********************************************************** G U M P
[GUMP@vmgump-vm3]: Project commons-validator (in module apache-commons) failed
To whom it may engage...
        
This is an automated request, but not an unsolicited one. For 
more information please visit http://gump.apache.org/nagged.html, 
and/or contact the folk at general@gump.apache.org.

Project commons-validator has an issue affecting its community integration.
This issue affects 1 projects,
 and has been outstanding for 12 runs.
The current state of this project is 'Failed', with reason 'Build Failed'.
For reference only, the following projects are affected by this:
    - commons-validator :  Validation Framework


Full details are available at:
    http://vmgump-vm3.apache.org/apache-commons/commons-validator/index.html

That said, some information snippets are provided here.

The following annotations (debug/informational/warning/error messages) were provided:
 -DEBUG- Sole jar output [commons-validator-*[0-9T].jar] identifier set to project name
 -INFO- Optional dependency commons-digester prerequisite failed with reason build failed
 -INFO- Optional dependency commons-beanutils prerequisite failed with reason build failed
 -INFO- Optional dependency commons-logging prerequisite failed with reason build failed
 -INFO- Optional dependency junit failed with reason build failed
 -DEBUG- (Apache Gump generated) Apache Maven Settings in: /srv/gump/public/workspace/apache-commons/validator/gump_mvn_settings.xml
 -INFO- Failed with reason build failed
 -DEBUG- Maven POM in: /srv/gump/public/workspace/apache-commons/validator/pom.xml
 -DEBUG- Extracted fallback artifacts from Gump Repository



The following work was performed:
http://vmgump-vm3.apache.org/apache-commons/commons-validator/gump_work/build_apache-commons_commons-validator.html
Work Name: build_apache-commons_commons-validator (Type: Build)
Work ended in a state of : Failed
Elapsed: 2 mins 1 sec
Command Line: /opt/maven3/bin/mvn --batch-mode -DskipTests=true --settings /srv/gump/public/workspace/apache-commons/validator/gump_mvn_settings.xml package 
[Working Directory: /srv/gump/public/workspace/apache-commons/validator]
M2_HOME: /opt/maven3
---------------------------------------------
[INFO] Scanning for projects...
[INFO] Downloading: http://localhost:8192/maven2/org/apache/commons/commons-parent/43/commons-parent-43.pom
Feb 27, 2019 2:02:06 AM org.apache.maven.wagon.providers.http.httpclient.impl.execchain.RetryExec execute
INFO: I/O exception (org.apache.maven.wagon.providers.http.httpclient.NoHttpResponseException) caught when processing request to {}->http://localhost:8192: The target server failed to respond
Feb 27, 2019 2:02:06 AM org.apache.maven.wagon.providers.http.httpclient.impl.execchain.RetryExec execute
INFO: Retrying request to {}->http://localhost:8192
Feb 27, 2019 2:02:36 AM org.apache.maven.wagon.providers.http.httpclient.impl.execchain.RetryExec execute
INFO: I/O exception (org.apache.maven.wagon.providers.http.httpclient.NoHttpResponseException) caught when processing request to {}->http://localhost:8192: The target server failed to respond
Feb 27, 2019 2:02:36 AM org.apache.maven.wagon.providers.http.httpclient.impl.execchain.RetryExec execute
INFO: Retrying request to {}->http://localhost:8192
Feb 27, 2019 2:03:06 AM org.apache.maven.wagon.providers.http.httpclient.impl.execchain.RetryExec execute
INFO: I/O exception (org.apache.maven.wagon.providers.http.httpclient.NoHttpResponseException) caught when processing request to {}->http://localhost:8192: The target server failed to respond
Feb 27, 2019 2:03:06 AM org.apache.maven.wagon.providers.http.httpclient.impl.execchain.RetryExec execute
INFO: Retrying request to {}->http://localhost:8192
[ERROR] [ERROR] Some problems were encountered while processing the POMs:
[WARNING] 'parent.relativePath' of POM commons-validator:commons-validator:1.7-SNAPSHOT (/srv/gump/public/workspace/apache-commons/validator/pom.xml) points at org.apache.commons:commons-proper-aggregator instead of org.apache.commons:commons-parent, please verify your project structure @ line 20, column 11
[FATAL] Non-resolvable parent POM for commons-validator:commons-validator:1.7-SNAPSHOT: Could not transfer artifact org.apache.commons:commons-parent:pom:43 from/to gump-central (http://localhost:8192/maven2): localhost:8192 failed to respond and 'parent.relativePath' points at wrong local POM @ line 20, column 11
 @ 
[ERROR] The build could not read 1 project -> [Help 1]
[ERROR]   
[ERROR]   The project commons-validator:commons-validator:1.7-SNAPSHOT (/srv/gump/public/workspace/apache-commons/validator/pom.xml) has 1 error
[ERROR]     Non-resolvable parent POM for commons-validator:commons-validator:1.7-SNAPSHOT: Could not transfer artifact org.apache.commons:commons-parent:pom:43 from/to gump-central (http://localhost:8192/maven2): localhost:8192 failed to respond and 'parent.relativePath' points at wrong local POM @ line 20, column 11 -> [Help 2]
[ERROR] 
[ERROR] To see the full stack trace of the errors, re-run Maven with the -e switch.
[ERROR] Re-run Maven using the -X switch to enable full debug logging.
[ERROR] 
[ERROR] For more information about the errors and possible solutions, please read the following articles:
[ERROR] [Help 1] http://cwiki.apache.org/confluence/display/MAVEN/ProjectBuildingException
[ERROR] [Help 2] http://cwiki.apache.org/confluence/display/MAVEN/UnresolvableModelException
---------------------------------------------

To subscribe to this information via syndicated feeds:
- RSS: http://vmgump-vm3.apache.org/apache-commons/commons-validator/rss.xml
- Atom: http://vmgump-vm3.apache.org/apache-commons/commons-validator/atom.xml

============================== Gump Tracking Only ===
Produced by Apache Gump(TM) version 2.3.
Gump Run 20190227000007, vmgump-vm3.apache.org:vmgump:20190227000007
Gump E-mail Identifier (unique within run) #20.

*********************************************************** G U M P
[GUMP@vmgump-vm3]: Project rat (in module rat) failed
To whom it may engage...
        
This is an automated request, but not an unsolicited one. For 
more information please visit http://gump.apache.org/nagged.html, 
and/or contact the folk at general@gump.apache.org.

Project rat has an issue affecting its community integration.
This issue affects 1 projects,
 and has been outstanding for 12 runs.
The current state of this project is 'Failed', with reason 'Build Failed'.
For reference only, the following projects are affected by this:
    - rat :  Release Audit Tool


Full details are available at:
    http://vmgump-vm3.apache.org/rat/rat/index.html

That said, some information snippets are provided here.

The following annotations (debug/informational/warning/error messages) were provided:
 -INFO- Optional dependency commons-beanutils prerequisite failed with reason build failed
 -INFO- Optional dependency commons-cli prerequisite failed with reason build failed
 -INFO- Optional dependency antunit prerequisite failed with reason build failed
 -INFO- Optional dependency ant-testutil prerequisite failed with reason build failed
 -INFO- Optional dependency ant prerequisite failed with reason build failed
 -INFO- Optional dependency junit failed with reason build failed
 -INFO- Optional dependency commons-io failed with reason build failed
 -INFO- Optional dependency commons-compress failed with reason build failed
 -DEBUG- (Apache Gump generated) Apache Maven Settings in: /srv/gump/public/workspace/rat/gump_mvn_settings.xml
 -INFO- Failed with reason build failed
 -DEBUG- Maven POM in: /srv/gump/public/workspace/rat/pom.xml
 -DEBUG- Extracted fallback artifacts from Gump Repository



The following work was performed:
http://vmgump-vm3.apache.org/rat/rat/gump_work/build_rat_rat.html
Work Name: build_rat_rat (Type: Build)
Work ended in a state of : Failed
Elapsed: 2 mins 1 sec
Command Line: /opt/maven3/bin/mvn --batch-mode -DskipTests=true -DjavaVersion=1.8 --settings /srv/gump/public/workspace/rat/gump_mvn_settings.xml package 
[Working Directory: /srv/gump/public/workspace/rat]
M2_HOME: /opt/maven3
---------------------------------------------
[INFO] Scanning for projects...
[INFO] Downloading: http://localhost:8192/maven2/org/apache/apache/18/apache-18.pom
Feb 27, 2019 2:04:18 AM org.apache.maven.wagon.providers.http.httpclient.impl.execchain.RetryExec execute
INFO: I/O exception (org.apache.maven.wagon.providers.http.httpclient.NoHttpResponseException) caught when processing request to {}->http://localhost:8192: The target server failed to respond
Feb 27, 2019 2:04:18 AM org.apache.maven.wagon.providers.http.httpclient.impl.execchain.RetryExec execute
INFO: Retrying request to {}->http://localhost:8192
Feb 27, 2019 2:04:48 AM org.apache.maven.wagon.providers.http.httpclient.impl.execchain.RetryExec execute
INFO: I/O exception (org.apache.maven.wagon.providers.http.httpclient.NoHttpResponseException) caught when processing request to {}->http://localhost:8192: The target server failed to respond
Feb 27, 2019 2:04:48 AM org.apache.maven.wagon.providers.http.httpclient.impl.execchain.RetryExec execute
INFO: Retrying request to {}->http://localhost:8192
Feb 27, 2019 2:05:18 AM org.apache.maven.wagon.providers.http.httpclient.impl.execchain.RetryExec execute
INFO: I/O exception (org.apache.maven.wagon.providers.http.httpclient.NoHttpResponseException) caught when processing request to {}->http://localhost:8192: The target server failed to respond
Feb 27, 2019 2:05:18 AM org.apache.maven.wagon.providers.http.httpclient.impl.execchain.RetryExec execute
INFO: Retrying request to {}->http://localhost:8192
[ERROR] [ERROR] Some problems were encountered while processing the POMs:
[FATAL] Non-resolvable parent POM for org.apache.rat:apache-rat-project:0.14-SNAPSHOT: Could not transfer artifact org.apache:apache:pom:18 from/to gump-central (http://localhost:8192/maven2): localhost:8192 failed to respond and 'parent.relativePath' points at wrong local POM @ line 20, column 11
 @ 
[ERROR] The build could not read 1 project -> [Help 1]
[ERROR]   
[ERROR]   The project org.apache.rat:apache-rat-project:0.14-SNAPSHOT (/srv/gump/public/workspace/rat/pom.xml) has 1 error
[ERROR]     Non-resolvable parent POM for org.apache.rat:apache-rat-project:0.14-SNAPSHOT: Could not transfer artifact org.apache:apache:pom:18 from/to gump-central (http://localhost:8192/maven2): localhost:8192 failed to respond and 'parent.relativePath' points at wrong local POM @ line 20, column 11 -> [Help 2]
[ERROR] 
[ERROR] To see the full stack trace of the errors, re-run Maven with the -e switch.
[ERROR] Re-run Maven using the -X switch to enable full debug logging.
[ERROR] 
[ERROR] For more information about the errors and possible solutions, please read the following articles:
[ERROR] [Help 1] http://cwiki.apache.org/confluence/display/MAVEN/ProjectBuildingException
[ERROR] [Help 2] http://cwiki.apache.org/confluence/display/MAVEN/UnresolvableModelException
---------------------------------------------

To subscribe to this information via syndicated feeds:
- RSS: http://vmgump-vm3.apache.org/rat/rat/rss.xml
- Atom: http://vmgump-vm3.apache.org/rat/rat/atom.xml

============================== Gump Tracking Only ===
Produced by Apache Gump(TM) version 2.3.
Gump Run 20190227000007, vmgump-vm3.apache.org:vmgump:20190227000007
Gump E-mail Identifier (unique within run) #21.

*********************************************************** G U M P
[GUMP@vmgump-vm3]: Project commons-collections4 (in module commons-collections) failed
To whom it may engage...
        
This is an automated request, but not an unsolicited one. For 
more information please visit http://gump.apache.org/nagged.html, 
and/or contact the folk at general@gump.apache.org.

Project commons-collections4 has an issue affecting its community integration.
This issue affects 1 projects,
 and has been outstanding for 12 runs.
The current state of this project is 'Failed', with reason 'Build Failed'.
For reference only, the following projects are affected by this:
    - commons-collections4 :  Commons collections Package


Full details are available at:
    http://vmgump-vm3.apache.org/commons-collections/commons-collections4/index.html

That said, some information snippets are provided here.

The following annotations (debug/informational/warning/error messages) were provided:
 -DEBUG- Sole jar output [commons-collections4-*[0-9T].jar] identifier set to project name
 -INFO- Optional dependency easymock prerequisite failed with reason build failed
 -DEBUG- (Apache Gump generated) Apache Maven Settings in: /srv/gump/public/workspace/commons-collections/gump_mvn_settings.xml
 -INFO- Failed with reason build failed
 -DEBUG- Maven POM in: /srv/gump/public/workspace/commons-collections/pom.xml
 -DEBUG- Extracted fallback artifacts from Gump Repository



The following work was performed:
http://vmgump-vm3.apache.org/commons-collections/commons-collections4/gump_work/build_commons-collections_commons-collections4.html
Work Name: build_commons-collections_commons-collections4 (Type: Build)
Work ended in a state of : Failed
Elapsed: 2 mins 1 sec
Command Line: /opt/maven3/bin/mvn --batch-mode --settings /srv/gump/public/workspace/commons-collections/gump_mvn_settings.xml package 
[Working Directory: /srv/gump/public/workspace/commons-collections]
M2_HOME: /opt/maven3
---------------------------------------------
[INFO] Scanning for projects...
[INFO] Downloading: http://localhost:8192/maven2/org/apache/commons/commons-parent/47/commons-parent-47.pom
Feb 27, 2019 2:06:22 AM org.apache.maven.wagon.providers.http.httpclient.impl.execchain.RetryExec execute
INFO: I/O exception (org.apache.maven.wagon.providers.http.httpclient.NoHttpResponseException) caught when processing request to {}->http://localhost:8192: The target server failed to respond
Feb 27, 2019 2:06:22 AM org.apache.maven.wagon.providers.http.httpclient.impl.execchain.RetryExec execute
INFO: Retrying request to {}->http://localhost:8192
Feb 27, 2019 2:06:52 AM org.apache.maven.wagon.providers.http.httpclient.impl.execchain.RetryExec execute
INFO: I/O exception (org.apache.maven.wagon.providers.http.httpclient.NoHttpResponseException) caught when processing request to {}->http://localhost:8192: The target server failed to respond
Feb 27, 2019 2:06:52 AM org.apache.maven.wagon.providers.http.httpclient.impl.execchain.RetryExec execute
INFO: Retrying request to {}->http://localhost:8192
Feb 27, 2019 2:07:22 AM org.apache.maven.wagon.providers.http.httpclient.impl.execchain.RetryExec execute
INFO: I/O exception (org.apache.maven.wagon.providers.http.httpclient.NoHttpResponseException) caught when processing request to {}->http://localhost:8192: The target server failed to respond
Feb 27, 2019 2:07:22 AM org.apache.maven.wagon.providers.http.httpclient.impl.execchain.RetryExec execute
INFO: Retrying request to {}->http://localhost:8192
[ERROR] [ERROR] Some problems were encountered while processing the POMs:
[FATAL] Non-resolvable parent POM for org.apache.commons:commons-collections4:4.4-SNAPSHOT: Could not transfer artifact org.apache.commons:commons-parent:pom:47 from/to gump-central (http://localhost:8192/maven2): localhost:8192 failed to respond and 'parent.relativePath' points at wrong local POM @ line 19, column 11
 @ 
[ERROR] The build could not read 1 project -> [Help 1]
[ERROR]   
[ERROR]   The project org.apache.commons:commons-collections4:4.4-SNAPSHOT (/srv/gump/public/workspace/commons-collections/pom.xml) has 1 error
[ERROR]     Non-resolvable parent POM for org.apache.commons:commons-collections4:4.4-SNAPSHOT: Could not transfer artifact org.apache.commons:commons-parent:pom:47 from/to gump-central (http://localhost:8192/maven2): localhost:8192 failed to respond and 'parent.relativePath' points at wrong local POM @ line 19, column 11 -> [Help 2]
[ERROR] 
[ERROR] To see the full stack trace of the errors, re-run Maven with the -e switch.
[ERROR] Re-run Maven using the -X switch to enable full debug logging.
[ERROR] 
[ERROR] For more information about the errors and possible solutions, please read the following articles:
[ERROR] [Help 1] http://cwiki.apache.org/confluence/display/MAVEN/ProjectBuildingException
[ERROR] [Help 2] http://cwiki.apache.org/confluence/display/MAVEN/UnresolvableModelException
---------------------------------------------

To subscribe to this information via syndicated feeds:
- RSS: http://vmgump-vm3.apache.org/commons-collections/commons-collections4/rss.xml
- Atom: http://vmgump-vm3.apache.org/commons-collections/commons-collections4/atom.xml

============================== Gump Tracking Only ===
Produced by Apache Gump(TM) version 2.3.
Gump Run 20190227000007, vmgump-vm3.apache.org:vmgump:20190227000007
Gump E-mail Identifier (unique within run) #22.

*********************************************************** G U M P
[GUMP@vmgump-vm3]: Project commons-lang3 (in module commons-lang-trunk) failed
To whom it may engage...
        
This is an automated request, but not an unsolicited one. For 
more information please visit http://gump.apache.org/nagged.html, 
and/or contact the folk at general@gump.apache.org.

Project commons-lang3 has an issue affecting its community integration.
This issue affects 1 projects,
 and has been outstanding for 12 runs.
The current state of this project is 'Failed', with reason 'Build Failed'.
For reference only, the following projects are affected by this:
    - commons-lang3 :  utilities for the classes that are in java.lang's hierarchy


Full details are available at:
    http://vmgump-vm3.apache.org/commons-lang-trunk/commons-lang3/index.html

That said, some information snippets are provided here.

The following annotations (debug/informational/warning/error messages) were provided:
 -DEBUG- Sole jar output [commons-lang3-*[0-9T].jar] identifier set to project name
 -DEBUG- Sole pom output [pom.xml] identifier set to project name
 -INFO- Optional dependency org.apache.ant prerequisite failed with reason build failed
 -INFO- Optional dependency junit failed with reason build failed
 -INFO- Optional dependency commons-io failed with reason build failed
 -INFO- Optional dependency easymock prerequisite failed with reason build failed
 -DEBUG- (Apache Gump generated) Apache Maven Settings in: /srv/gump/public/workspace/commons-lang-trunk/gump_mvn_settings.xml
 -INFO- Failed with reason build failed
 -DEBUG- Maven POM in: /srv/gump/public/workspace/commons-lang-trunk/pom.xml
 -DEBUG- Extracted fallback artifacts from Gump Repository



The following work was performed:
http://vmgump-vm3.apache.org/commons-lang-trunk/commons-lang3/gump_work/build_commons-lang-trunk_commons-lang3.html
Work Name: build_commons-lang-trunk_commons-lang3 (Type: Build)
Work ended in a state of : Failed
Elapsed: 2 mins 1 sec
Command Line: /opt/maven3/bin/mvn --batch-mode -DskipTests=true --settings /srv/gump/public/workspace/commons-lang-trunk/gump_mvn_settings.xml package 
[Working Directory: /srv/gump/public/workspace/commons-lang-trunk]
M2_HOME: /opt/maven3
---------------------------------------------
[INFO] Scanning for projects...
[INFO] Downloading: http://localhost:8192/maven2/org/apache/commons/commons-parent/47/commons-parent-47.pom
Feb 27, 2019 2:08:26 AM org.apache.maven.wagon.providers.http.httpclient.impl.execchain.RetryExec execute
INFO: I/O exception (org.apache.maven.wagon.providers.http.httpclient.NoHttpResponseException) caught when processing request to {}->http://localhost:8192: The target server failed to respond
Feb 27, 2019 2:08:26 AM org.apache.maven.wagon.providers.http.httpclient.impl.execchain.RetryExec execute
INFO: Retrying request to {}->http://localhost:8192
Feb 27, 2019 2:08:56 AM org.apache.maven.wagon.providers.http.httpclient.impl.execchain.RetryExec execute
INFO: I/O exception (org.apache.maven.wagon.providers.http.httpclient.NoHttpResponseException) caught when processing request to {}->http://localhost:8192: The target server failed to respond
Feb 27, 2019 2:08:56 AM org.apache.maven.wagon.providers.http.httpclient.impl.execchain.RetryExec execute
INFO: Retrying request to {}->http://localhost:8192
Feb 27, 2019 2:09:26 AM org.apache.maven.wagon.providers.http.httpclient.impl.execchain.RetryExec execute
INFO: I/O exception (org.apache.maven.wagon.providers.http.httpclient.NoHttpResponseException) caught when processing request to {}->http://localhost:8192: The target server failed to respond
Feb 27, 2019 2:09:26 AM org.apache.maven.wagon.providers.http.httpclient.impl.execchain.RetryExec execute
INFO: Retrying request to {}->http://localhost:8192
[ERROR] [ERROR] Some problems were encountered while processing the POMs:
[FATAL] Non-resolvable parent POM for org.apache.commons:commons-lang3:3.9-SNAPSHOT: Could not transfer artifact org.apache.commons:commons-parent:pom:47 from/to gump-central (http://localhost:8192/maven2): localhost:8192 failed to respond and 'parent.relativePath' points at wrong local POM @ line 22, column 11
 @ 
[ERROR] The build could not read 1 project -> [Help 1]
[ERROR]   
[ERROR]   The project org.apache.commons:commons-lang3:3.9-SNAPSHOT (/srv/gump/public/workspace/commons-lang-trunk/pom.xml) has 1 error
[ERROR]     Non-resolvable parent POM for org.apache.commons:commons-lang3:3.9-SNAPSHOT: Could not transfer artifact org.apache.commons:commons-parent:pom:47 from/to gump-central (http://localhost:8192/maven2): localhost:8192 failed to respond and 'parent.relativePath' points at wrong local POM @ line 22, column 11 -> [Help 2]
[ERROR] 
[ERROR] To see the full stack trace of the errors, re-run Maven with the -e switch.
[ERROR] Re-run Maven using the -X switch to enable full debug logging.
[ERROR] 
[ERROR] For more information about the errors and possible solutions, please read the following articles:
[ERROR] [Help 1] http://cwiki.apache.org/confluence/display/MAVEN/ProjectBuildingException
[ERROR] [Help 2] http://cwiki.apache.org/confluence/display/MAVEN/UnresolvableModelException
---------------------------------------------

To subscribe to this information via syndicated feeds:
- RSS: http://vmgump-vm3.apache.org/commons-lang-trunk/commons-lang3/rss.xml
- Atom: http://vmgump-vm3.apache.org/commons-lang-trunk/commons-lang3/atom.xml

============================== Gump Tracking Only ===
Produced by Apache Gump(TM) version 2.3.
Gump Run 20190227000007, vmgump-vm3.apache.org:vmgump:20190227000007
Gump E-mail Identifier (unique within run) #23.

*********************************************************** G U M P
[GUMP@vmgump-vm3]: Project commons-bcel (in module apache-commons) failed
To whom it may engage...
        
This is an automated request, but not an unsolicited one. For 
more information please visit http://gump.apache.org/nagged.html, 
and/or contact the folk at general@gump.apache.org.

Project commons-bcel has an issue affecting its community integration.
This issue affects 1 projects,
 and has been outstanding for 12 runs.
The current state of this project is 'Failed', with reason 'Build Failed'.
For reference only, the following projects are affected by this:
    - commons-bcel :  Byte Code Engineering Library


Full details are available at:
    http://vmgump-vm3.apache.org/apache-commons/commons-bcel/index.html

That said, some information snippets are provided here.

The following annotations (debug/informational/warning/error messages) were provided:
 -DEBUG- Sole jar output [bcel-[0-9]*[0-9T].jar] identifier set to project name
 -INFO- Optional dependency commons-logging prerequisite failed with reason build failed
 -INFO- Optional dependency commons-lang failed with reason build failed
 -INFO- Optional dependency commons-cli prerequisite failed with reason build failed
 -INFO- Optional dependency ant prerequisite failed with reason build failed
 -INFO- Optional dependency junit failed with reason build failed
 -INFO- Optional dependency commons-io failed with reason build failed
 -INFO- Optional dependency easymock prerequisite failed with reason build failed
 -INFO- Optional dependency commons-lang3 failed with reason build failed
 -DEBUG- (Apache Gump generated) Apache Maven Settings in: /srv/gump/public/workspace/apache-commons/bcel/gump_mvn_settings.xml
 -INFO- Failed with reason build failed
 -DEBUG- Maven POM in: /srv/gump/public/workspace/apache-commons/bcel/pom.xml
 -DEBUG- Extracted fallback artifacts from Gump Repository



The following work was performed:
http://vmgump-vm3.apache.org/apache-commons/commons-bcel/gump_work/build_apache-commons_commons-bcel.html
Work Name: build_apache-commons_commons-bcel (Type: Build)
Work ended in a state of : Failed
Elapsed: 2 mins 2 secs
Command Line: /opt/maven3/bin/mvn --batch-mode --settings /srv/gump/public/workspace/apache-commons/bcel/gump_mvn_settings.xml package 
[Working Directory: /srv/gump/public/workspace/apache-commons/bcel]
M2_HOME: /opt/maven3
---------------------------------------------
[INFO] Scanning for projects...
[INFO] Downloading: http://localhost:8192/maven2/org/apache/commons/commons-parent/47/commons-parent-47.pom
Feb 27, 2019 2:10:28 AM org.apache.maven.wagon.providers.http.httpclient.impl.execchain.RetryExec execute
INFO: I/O exception (org.apache.maven.wagon.providers.http.httpclient.NoHttpResponseException) caught when processing request to {}->http://localhost:8192: The target server failed to respond
Feb 27, 2019 2:10:28 AM org.apache.maven.wagon.providers.http.httpclient.impl.execchain.RetryExec execute
INFO: Retrying request to {}->http://localhost:8192
Feb 27, 2019 2:10:58 AM org.apache.maven.wagon.providers.http.httpclient.impl.execchain.RetryExec execute
INFO: I/O exception (org.apache.maven.wagon.providers.http.httpclient.NoHttpResponseException) caught when processing request to {}->http://localhost:8192: The target server failed to respond
Feb 27, 2019 2:10:58 AM org.apache.maven.wagon.providers.http.httpclient.impl.execchain.RetryExec execute
INFO: Retrying request to {}->http://localhost:8192
Feb 27, 2019 2:11:28 AM org.apache.maven.wagon.providers.http.httpclient.impl.execchain.RetryExec execute
INFO: I/O exception (org.apache.maven.wagon.providers.http.httpclient.NoHttpResponseException) caught when processing request to {}->http://localhost:8192: The target server failed to respond
Feb 27, 2019 2:11:28 AM org.apache.maven.wagon.providers.http.httpclient.impl.execchain.RetryExec execute
INFO: Retrying request to {}->http://localhost:8192
[ERROR] [ERROR] Some problems were encountered while processing the POMs:
[WARNING] 'parent.relativePath' of POM org.apache.bcel:bcel:6.4-SNAPSHOT (/srv/gump/public/workspace/apache-commons/bcel/pom.xml) points at org.apache.commons:commons-proper-aggregator instead of org.apache.commons:commons-parent, please verify your project structure @ line 27, column 11
[FATAL] Non-resolvable parent POM for org.apache.bcel:bcel:6.4-SNAPSHOT: Could not transfer artifact org.apache.commons:commons-parent:pom:47 from/to gump-central (http://localhost:8192/maven2): localhost:8192 failed to respond and 'parent.relativePath' points at wrong local POM @ line 27, column 11
 @ 
[ERROR] The build could not read 1 project -> [Help 1]
[ERROR]   
[ERROR]   The project org.apache.bcel:bcel:6.4-SNAPSHOT (/srv/gump/public/workspace/apache-commons/bcel/pom.xml) has 1 error
[ERROR]     Non-resolvable parent POM for org.apache.bcel:bcel:6.4-SNAPSHOT: Could not transfer artifact org.apache.commons:commons-parent:pom:47 from/to gump-central (http://localhost:8192/maven2): localhost:8192 failed to respond and 'parent.relativePath' points at wrong local POM @ line 27, column 11 -> [Help 2]
[ERROR] 
[ERROR] To see the full stack trace of the errors, re-run Maven with the -e switch.
[ERROR] Re-run Maven using the -X switch to enable full debug logging.
[ERROR] 
[ERROR] For more information about the errors and possible solutions, please read the following articles:
[ERROR] [Help 1] http://cwiki.apache.org/confluence/display/MAVEN/ProjectBuildingException
[ERROR] [Help 2] http://cwiki.apache.org/confluence/display/MAVEN/UnresolvableModelException
---------------------------------------------

To subscribe to this information via syndicated feeds:
- RSS: http://vmgump-vm3.apache.org/apache-commons/commons-bcel/rss.xml
- Atom: http://vmgump-vm3.apache.org/apache-commons/commons-bcel/atom.xml

============================== Gump Tracking Only ===
Produced by Apache Gump(TM) version 2.3.
Gump Run 20190227000007, vmgump-vm3.apache.org:vmgump:20190227000007
Gump E-mail Identifier (unique within run) #24.

*********************************************************** G U M P
[GUMP@vmgump-vm3]: Project commons-exec (in module apache-commons) failed
To whom it may engage...
        
This is an automated request, but not an unsolicited one. For 
more information please visit http://gump.apache.org/nagged.html, 
and/or contact the folk at general@gump.apache.org.

Project commons-exec has an issue affecting its community integration.
This issue affects 1 projects,
 and has been outstanding for 12 runs.
The current state of this project is 'Failed', with reason 'Build Failed'.
For reference only, the following projects are affected by this:
    - commons-exec :  Commons Exec Package


Full details are available at:
    http://vmgump-vm3.apache.org/apache-commons/commons-exec/index.html

That said, some information snippets are provided here.

The following annotations (debug/informational/warning/error messages) were provided:
 -DEBUG- Sole jar output [commons-exec-*[0-9T].jar] identifier set to project name
 -INFO- Optional dependency commons-lang failed with reason build failed
 -INFO- Optional dependency commons-cli prerequisite failed with reason build failed
 -INFO- Optional dependency junit failed with reason build failed
 -DEBUG- (Apache Gump generated) Apache Maven Settings in: /srv/gump/public/workspace/apache-commons/exec/gump_mvn_settings.xml
 -INFO- Failed with reason build failed
 -DEBUG- Maven POM in: /srv/gump/public/workspace/apache-commons/exec/pom.xml
 -DEBUG- Extracted fallback artifacts from Gump Repository



The following work was performed:
http://vmgump-vm3.apache.org/apache-commons/commons-exec/gump_work/build_apache-commons_commons-exec.html
Work Name: build_apache-commons_commons-exec (Type: Build)
Work ended in a state of : Failed
Elapsed: 2 mins 1 sec
Command Line: /opt/maven3/bin/mvn --batch-mode -DskipTests=true --settings /srv/gump/public/workspace/apache-commons/exec/gump_mvn_settings.xml package 
[Working Directory: /srv/gump/public/workspace/apache-commons/exec]
M2_HOME: /opt/maven3
---------------------------------------------
[INFO] Scanning for projects...
[INFO] Downloading: http://localhost:8192/maven2/org/apache/commons/commons-parent/38/commons-parent-38.pom
Feb 27, 2019 2:12:30 AM org.apache.maven.wagon.providers.http.httpclient.impl.execchain.RetryExec execute
INFO: I/O exception (org.apache.maven.wagon.providers.http.httpclient.NoHttpResponseException) caught when processing request to {}->http://localhost:8192: The target server failed to respond
Feb 27, 2019 2:12:30 AM org.apache.maven.wagon.providers.http.httpclient.impl.execchain.RetryExec execute
INFO: Retrying request to {}->http://localhost:8192
Feb 27, 2019 2:13:00 AM org.apache.maven.wagon.providers.http.httpclient.impl.execchain.RetryExec execute
INFO: I/O exception (org.apache.maven.wagon.providers.http.httpclient.NoHttpResponseException) caught when processing request to {}->http://localhost:8192: The target server failed to respond
Feb 27, 2019 2:13:00 AM org.apache.maven.wagon.providers.http.httpclient.impl.execchain.RetryExec execute
INFO: Retrying request to {}->http://localhost:8192
Feb 27, 2019 2:13:30 AM org.apache.maven.wagon.providers.http.httpclient.impl.execchain.RetryExec execute
INFO: I/O exception (org.apache.maven.wagon.providers.http.httpclient.NoHttpResponseException) caught when processing request to {}->http://localhost:8192: The target server failed to respond
Feb 27, 2019 2:13:30 AM org.apache.maven.wagon.providers.http.httpclient.impl.execchain.RetryExec execute
INFO: Retrying request to {}->http://localhost:8192
[ERROR] [ERROR] Some problems were encountered while processing the POMs:
[WARNING] 'parent.relativePath' of POM org.apache.commons:commons-exec:1.4.0-SNAPSHOT (/srv/gump/public/workspace/apache-commons/exec/pom.xml) points at org.apache.commons:commons-proper-aggregator instead of org.apache.commons:commons-parent, please verify your project structure @ line 19, column 13
[FATAL] Non-resolvable parent POM for org.apache.commons:commons-exec:1.4.0-SNAPSHOT: Could not transfer artifact org.apache.commons:commons-parent:pom:38 from/to gump-central (http://localhost:8192/maven2): localhost:8192 failed to respond and 'parent.relativePath' points at wrong local POM @ line 19, column 13
 @ 
[ERROR] The build could not read 1 project -> [Help 1]
[ERROR]   
[ERROR]   The project org.apache.commons:commons-exec:1.4.0-SNAPSHOT (/srv/gump/public/workspace/apache-commons/exec/pom.xml) has 1 error
[ERROR]     Non-resolvable parent POM for org.apache.commons:commons-exec:1.4.0-SNAPSHOT: Could not transfer artifact org.apache.commons:commons-parent:pom:38 from/to gump-central (http://localhost:8192/maven2): localhost:8192 failed to respond and 'parent.relativePath' points at wrong local POM @ line 19, column 13 -> [Help 2]
[ERROR] 
[ERROR] To see the full stack trace of the errors, re-run Maven with the -e switch.
[ERROR] Re-run Maven using the -X switch to enable full debug logging.
[ERROR] 
[ERROR] For more information about the errors and possible solutions, please read the following articles:
[ERROR] [Help 1] http://cwiki.apache.org/confluence/display/MAVEN/ProjectBuildingException
[ERROR] [Help 2] http://cwiki.apache.org/confluence/display/MAVEN/UnresolvableModelException
---------------------------------------------

To subscribe to this information via syndicated feeds:
- RSS: http://vmgump-vm3.apache.org/apache-commons/commons-exec/rss.xml
- Atom: http://vmgump-vm3.apache.org/apache-commons/commons-exec/atom.xml

============================== Gump Tracking Only ===
Produced by Apache Gump(TM) version 2.3.
Gump Run 20190227000007, vmgump-vm3.apache.org:vmgump:20190227000007
Gump E-mail Identifier (unique within run) #25.


--
Apache Gump
http://gump.apache.org/ [Instance: vmgump-vm3]

---------------------------------------------------------------------
To unsubscribe, e-mail: general-unsubscribe@gump.apache.org
For additional commands, e-mail: general-help@gump.apache.org


Mime
View raw message