gump-general mailing list archives

Site index · List index
Message view « Date » · « Thread »
Top « Date » · « Thread »
From g...@vmgump-vm3.apache.org
Subject BATCH: All dressed up, with nowhere to go...
Date Wed, 13 Feb 2019 15:16:34 GMT
Dear Gumpmeisters,
            
The following 1 notifys should have been sent

*********************************************************** G U M P
[GUMP@vmgump-vm3]: Project openssl-make (in module openssl-master) failed
*********************************************************** G U M P
[GUMP@vmgump-vm3]: Project openssl-make (in module openssl-master) failed
To whom it may engage...
        
This is an automated request, but not an unsolicited one. For 
more information please visit http://gump.apache.org/nagged.html, 
and/or contact the folk at general@gump.apache.org.

Project openssl-make has an issue affecting its community integration.
This issue affects 15 projects.
The current state of this project is 'Failed', with reason 'Build Failed'.
For reference only, the following projects are affected by this:
    - apache-httpd-configure :  Apache HTTP Server
    - apache-httpd-make :  Apache HTTP Server
    - apache-httpd-make-install :  Apache HTTP Server
    - openssl-make :  OpenSSL Encryption Library
    - openssl-make-install :  OpenSSL Encryption Library
    - openssl-make-test :  OpenSSL Encryption Library
    - tomcat-jk-native :  Connectors to various web servers
    - tomcat-jk-native-buildconf :  Connectors to various web servers
    - tomcat-jk-native-configure :  Connectors to various web servers
    - tomcat-native-trunk-configure :  Tomcat native library using Apache Portable Runtime
    - tomcat-native-trunk-make :  Tomcat native library using Apache Portable Runtime
    - tomcat-native-trunk-make-install :  Tomcat native library using Apache Portable Runtime
    - tomcat-trunk-test-apr :  Tomcat 9.x, a web server implementing the Java Servlet 4.0,
...
    - tomcat-trunk-test-nio :  Tomcat 9.x, a web server implementing the Java Servlet 4.0,
...
    - tomcat-trunk-test-nio2 :  Tomcat 9.x, a web server implementing the Java Servlet 4.0,
...


Full details are available at:
    http://vmgump-vm3.apache.org/openssl-master/openssl-make/index.html

That said, some information snippets are provided here.

The following annotations (debug/informational/warning/error messages) were provided:
 -INFO- Failed with reason build failed



The following work was performed:
http://vmgump-vm3.apache.org/openssl-master/openssl-make/gump_work/build_openssl-master_openssl-make.html
Work Name: build_openssl-master_openssl-make (Type: Build)
Work ended in a state of : Failed
Elapsed: 4 mins 17 secs
Command Line: make 
[Working Directory: /srv/gump/public/workspace/openssl-master]
---------------------------------------------
gcc  -Iinclude -Iapps/include  -pthread -m64 -Wa,--noexecstack -Wall -O3 -DNDEBUG  -MMD -MF
test/dtlstest-bin-dtlstest.d.tmp -MT test/dtlstest-bin-dtlstest.o -c -o test/dtlstest-bin-dtlstest.o
test/dtlstest.c
gcc  -I. -Iinclude -Iinclude -Iapps/include  -pthread -m64 -Wa,--noexecstack -Wall -O3 -DNDEBUG
 -MMD -MF test/dtlstest-bin-ssltestlib.d.tmp -MT test/dtlstest-bin-ssltestlib.o -c -o test/dtlstest-bin-ssltestlib.o
test/ssltestlib.c
rm -f test/dtlstest
${LDCMD:-gcc} -pthread -m64 -Wa,--noexecstack -Wall -O3 -L.   \
		-o test/dtlstest test/dtlstest-bin-dtlstest.o test/dtlstest-bin-ssltestlib.o \
		 -lssl test/libtestutil.a -lcrypto -ldl -pthread 
gcc  -Iinclude -Iapps/include  -pthread -m64 -Wa,--noexecstack -Wall -O3 -DNDEBUG  -MMD -MF
test/dtlsv1listentest-bin-dtlsv1listentest.d.tmp -MT test/dtlsv1listentest-bin-dtlsv1listentest.o
-c -o test/dtlsv1listentest-bin-dtlsv1listentest.o test/dtlsv1listentest.c
rm -f test/dtlsv1listentest
${LDCMD:-gcc} -pthread -m64 -Wa,--noexecstack -Wall -O3 -L.   \
		-o test/dtlsv1listentest test/dtlsv1listentest-bin-dtlsv1listentest.o \
		 -lssl test/libtestutil.a -lcrypto -ldl -pthread 
gcc  -Iinclude -Iapps/include  -pthread -m64 -Wa,--noexecstack -Wall -O3 -DNDEBUG  -MMD -MF
test/ecdsatest-bin-ecdsatest.d.tmp -MT test/ecdsatest-bin-ecdsatest.o -c -o test/ecdsatest-bin-ecdsatest.o
test/ecdsatest.c
rm -f test/ecdsatest
${LDCMD:-gcc} -pthread -m64 -Wa,--noexecstack -Wall -O3 -L.   \
		-o test/ecdsatest test/ecdsatest-bin-ecdsatest.o \
		 test/libtestutil.a -lcrypto -ldl -pthread 
gcc  -Iinclude -Iapps/include  -pthread -m64 -Wa,--noexecstack -Wall -O3 -DNDEBUG  -MMD -MF
test/ecstresstest-bin-ecstresstest.d.tmp -MT test/ecstresstest-bin-ecstresstest.o -c -o test/ecstresstest-bin-ecstresstest.o
test/ecstresstest.c
rm -f test/ecstresstest
${LDCMD:-gcc} -pthread -m64 -Wa,--noexecstack -Wall -O3 -L.   \
		-o test/ecstresstest test/ecstresstest-bin-ecstresstest.o \
		 test/libtestutil.a -lcrypto -ldl -pthread 
gcc  -Iinclude -Iapps/include  -pthread -m64 -Wa,--noexecstack -Wall -O3 -DNDEBUG  -MMD -MF
test/ectest-bin-ectest.d.tmp -MT test/ectest-bin-ectest.o -c -o test/ectest-bin-ectest.o test/ectest.c
rm -f test/ectest
${LDCMD:-gcc} -pthread -m64 -Wa,--noexecstack -Wall -O3 -L.   \
		-o test/ectest test/ectest-bin-ectest.o \
		 test/libtestutil.a -lcrypto -ldl -pthread 
gcc  -Iinclude -Iapps/include  -pthread -m64 -Wa,--noexecstack -Wall -O3 -DNDEBUG  -MMD -MF
test/enginetest-bin-enginetest.d.tmp -MT test/enginetest-bin-enginetest.o -c -o test/enginetest-bin-enginetest.o
test/enginetest.c
rm -f test/enginetest
${LDCMD:-gcc} -pthread -m64 -Wa,--noexecstack -Wall -O3 -L.   \
		-o test/enginetest test/enginetest-bin-enginetest.o \
		 test/libtestutil.a -lcrypto -ldl -pthread 
gcc  -Iinclude -Iapps/include  -pthread -m64 -Wa,--noexecstack -Wall -O3 -DNDEBUG  -MMD -MF
test/errtest-bin-errtest.d.tmp -MT test/errtest-bin-errtest.o -c -o test/errtest-bin-errtest.o
test/errtest.c
rm -f test/errtest
${LDCMD:-gcc} -pthread -m64 -Wa,--noexecstack -Wall -O3 -L.   \
		-o test/errtest test/errtest-bin-errtest.o \
		 test/libtestutil.a -lcrypto -ldl -pthread 
gcc  -Iinclude -Iapps/include -Icrypto/include  -pthread -m64 -Wa,--noexecstack -Wall -O3
-DNDEBUG  -MMD -MF test/evp_extra_test-bin-evp_extra_test.d.tmp -MT test/evp_extra_test-bin-evp_extra_test.o
-c -o test/evp_extra_test-bin-evp_extra_test.o test/evp_extra_test.c
rm -f test/evp_extra_test
${LDCMD:-gcc} -pthread -m64 -Wa,--noexecstack -Wall -O3 -L.   \
		-o test/evp_extra_test test/evp_extra_test-bin-evp_extra_test.o \
		 test/libtestutil.a -lcrypto -ldl -pthread 
gcc  -Iinclude  -pthread -m64 -Wa,--noexecstack -Wall -O3 -DNDEBUG  -MMD -MF test/evp_kdf_test-bin-evp_kdf_test.d.tmp
-MT test/evp_kdf_test-bin-evp_kdf_test.o -c -o test/evp_kdf_test-bin-evp_kdf_test.o test/evp_kdf_test.c
In file included from test/evp_kdf_test.c:18:0:
test/testutil.h:18:17: fatal error: opt.h: No such file or directory
 #include "opt.h"
                 ^
compilation terminated.
make[1]: *** [test/evp_kdf_test-bin-evp_kdf_test.o] Error 1
make[1]: Leaving directory `/srv/gump/public/workspace/openssl-master'
make: *** [all] Error 2
---------------------------------------------

To subscribe to this information via syndicated feeds:
- RSS: http://vmgump-vm3.apache.org/openssl-master/openssl-make/rss.xml
- Atom: http://vmgump-vm3.apache.org/openssl-master/openssl-make/atom.xml

============================== Gump Tracking Only ===
Produced by Apache Gump(TM) version 2.3.
Gump Run 20190213120007, vmgump-vm3.apache.org:vmgump:20190213120007
Gump E-mail Identifier (unique within run) #1.


--
Apache Gump
http://gump.apache.org/ [Instance: vmgump-vm3]

---------------------------------------------------------------------
To unsubscribe, e-mail: general-unsubscribe@gump.apache.org
For additional commands, e-mail: general-help@gump.apache.org


Mime
View raw message