gump-general mailing list archives

Site index · List index
Message view « Date » · « Thread »
Top « Date » · « Thread »
From g...@vmgump-vm3.apache.org
Subject BATCH: All dressed up, with nowhere to go...
Date Tue, 29 Jan 2019 04:45:54 GMT
Dear Gumpmeisters,
            
The following 3 notifys should have been sent

*********************************************************** G U M P
[GUMP@vmgump-vm3]: Project java-hamcrest (in module java-hamcrest) failed
[GUMP@vmgump-vm3]: Project commons-io (in module commons-io) failed
[GUMP@vmgump-vm3]: Project test-ant (in module ant) failed
*********************************************************** G U M P
[GUMP@vmgump-vm3]: Project java-hamcrest (in module java-hamcrest) failed
To whom it may engage...
        
This is an automated request, but not an unsolicited one. For 
more information please visit http://gump.apache.org/nagged.html, 
and/or contact the folk at general@gump.apache.org.

Project java-hamcrest has an issue affecting its community integration.
This issue affects 1 projects,
 and has been outstanding for 368 runs.
The current state of this project is 'Failed', with reason 'Build Failed'.
For reference only, the following projects are affected by this:
    - java-hamcrest :  Provides a library of matcher objects (also known as constra...


Full details are available at:
    http://vmgump-vm3.apache.org/java-hamcrest/java-hamcrest/index.html

That said, some information snippets are provided here.

The following annotations (debug/informational/warning/error messages) were provided:
 -DEBUG- Sole jar output [java-hamcrest-*[0-9T].jar] identifier set to project name
 -DEBUG- (Apache Gump generated) Gradle Init Script in: /srv/gump/public/workspace/java-hamcrest/gump_init_script.gradle
 -INFO- Failed with reason build failed
 -DEBUG- Gradle build in: /srv/gump/public/workspace/java-hamcrest/build.gradle
 -INFO- Failed to extract fallback artifacts from Gump Repository



The following work was performed:
http://vmgump-vm3.apache.org/java-hamcrest/java-hamcrest/gump_work/build_java-hamcrest_java-hamcrest.html
Work Name: build_java-hamcrest_java-hamcrest (Type: Build)
Work ended in a state of : Failed
Elapsed: 4 secs
Command Line: gradle --debug -Djava.awt.headless=true -Dbuild.sysclasspath=only -Dsun.zip.disableMemoryMapping=true
-Dmaven.repo.local=/srv/gump/public/workspace/mvnlocalrepo/java-hamcrest.mvnlocalrepo --refresh-dependencies
--init-script /srv/gump/public/workspace/java-hamcrest/gump_init_script.gradle build 
[Working Directory: /srv/gump/public/workspace/java-hamcrest]
---------------------------------------------
00:20:43.555 [DEBUG] [org.gradle.cache.internal.DefaultFileLockManager] Lock acquired.
00:20:43.555 [DEBUG] [org.gradle.cache.internal.DefaultPersistentDirectoryCache] Invalidating
init remapped class cache for 59erzc54rfs4dkd2piu32yjok (/home/gump/.gradle/caches/2.14.1/scripts-remapped/gump_init_script_12yx9mtnnuqfgx94h66zzd6bx/59erzc54rfs4dkd2piu32yjok/init57408229)
as it was not closed cleanly.
00:20:43.557 [DEBUG] [org.gradle.cache.internal.DefaultFileLockManager] Releasing lock on
init remapped class cache for 59erzc54rfs4dkd2piu32yjok (/home/gump/.gradle/caches/2.14.1/scripts-remapped/gump_init_script_12yx9mtnnuqfgx94h66zzd6bx/59erzc54rfs4dkd2piu32yjok/init57408229).
00:20:43.559 [DEBUG] [org.gradle.cache.internal.DefaultFileLockManager] Waiting to acquire
exclusive lock on init remapped class cache for 59erzc54rfs4dkd2piu32yjok (/home/gump/.gradle/caches/2.14.1/scripts-remapped/gump_init_script_12yx9mtnnuqfgx94h66zzd6bx/59erzc54rfs4dkd2piu32yjok/init57408229).
00:20:43.559 [DEBUG] [org.gradle.cache.internal.DefaultFileLockManager] Lock acquired.
00:20:43.560 [DEBUG] [org.gradle.cache.internal.DefaultPersistentDirectoryCache] Invalidating
init remapped class cache for 59erzc54rfs4dkd2piu32yjok (/home/gump/.gradle/caches/2.14.1/scripts-remapped/gump_init_script_12yx9mtnnuqfgx94h66zzd6bx/59erzc54rfs4dkd2piu32yjok/init57408229)
as it was not closed cleanly.
00:20:43.561 [DEBUG] [org.gradle.cache.internal.DefaultFileLockManager] Waiting to acquire
shared lock on init generic class cache for initialization script '/srv/gump/public/workspace/java-hamcrest/gump_init_script.gradle'
(/home/gump/.gradle/caches/2.14.1/scripts/59erzc54rfs4dkd2piu32yjok/init/init57408229).
00:20:43.564 [DEBUG] [org.gradle.cache.internal.DefaultFileLockManager] Lock acquired.
00:20:43.564 [DEBUG] [org.gradle.cache.internal.DefaultPersistentDirectoryCache] Invalidating
init generic class cache for initialization script '/srv/gump/public/workspace/java-hamcrest/gump_init_script.gradle'
(/home/gump/.gradle/caches/2.14.1/scripts/59erzc54rfs4dkd2piu32yjok/init/init57408229) as
it was not closed cleanly.
00:20:43.564 [DEBUG] [org.gradle.cache.internal.DefaultFileLockManager] Releasing lock on
init generic class cache for initialization script '/srv/gump/public/workspace/java-hamcrest/gump_init_script.gradle'
(/home/gump/.gradle/caches/2.14.1/scripts/59erzc54rfs4dkd2piu32yjok/init/init57408229).
00:20:43.565 [DEBUG] [org.gradle.cache.internal.DefaultFileLockManager] Waiting to acquire
exclusive lock on init generic class cache for initialization script '/srv/gump/public/workspace/java-hamcrest/gump_init_script.gradle'
(/home/gump/.gradle/caches/2.14.1/scripts/59erzc54rfs4dkd2piu32yjok/init/init57408229).
00:20:43.565 [DEBUG] [org.gradle.cache.internal.DefaultFileLockManager] Lock acquired.
00:20:43.565 [DEBUG] [org.gradle.cache.internal.DefaultPersistentDirectoryCache] Invalidating
init generic class cache for initialization script '/srv/gump/public/workspace/java-hamcrest/gump_init_script.gradle'
(/home/gump/.gradle/caches/2.14.1/scripts/59erzc54rfs4dkd2piu32yjok/init/init57408229) as
it was not closed cleanly.
00:20:43.565 [INFO] [org.gradle.groovy.scripts.internal.DefaultScriptCompilationHandler] Compiling
initialization script '/srv/gump/public/workspace/java-hamcrest/gump_init_script.gradle' using
BuildScriptTransformer.
00:20:44.027 [DEBUG] [org.gradle.groovy.scripts.internal.DefaultScriptCompilationHandler]
Timing: Writing script to cache at /home/gump/.gradle/caches/2.14.1/scripts/59erzc54rfs4dkd2piu32yjok/init/init57408229/classes
took: 0.462 secs
00:20:44.028 [DEBUG] [org.gradle.cache.internal.DefaultFileLockManager] Releasing lock on
init generic class cache for initialization script '/srv/gump/public/workspace/java-hamcrest/gump_init_script.gradle'
(/home/gump/.gradle/caches/2.14.1/scripts/59erzc54rfs4dkd2piu32yjok/init/init57408229).
00:20:44.028 [DEBUG] [org.gradle.cache.internal.DefaultFileLockManager] Waiting to acquire
shared lock on init generic class cache for initialization script '/srv/gump/public/workspace/java-hamcrest/gump_init_script.gradle'
(/home/gump/.gradle/caches/2.14.1/scripts/59erzc54rfs4dkd2piu32yjok/init/init57408229).
00:20:44.028 [DEBUG] [org.gradle.cache.internal.DefaultFileLockManager] Lock acquired.
00:20:44.029 [DEBUG] [org.gradle.cache.internal.DefaultFileLockManager] Releasing lock on
init generic class cache for initialization script '/srv/gump/public/workspace/java-hamcrest/gump_init_script.gradle'
(/home/gump/.gradle/caches/2.14.1/scripts/59erzc54rfs4dkd2piu32yjok/init/init57408229).
00:20:44.059 [DEBUG] [org.gradle.cache.internal.DefaultFileLockManager] Releasing lock on
init remapped class cache for 59erzc54rfs4dkd2piu32yjok (/home/gump/.gradle/caches/2.14.1/scripts-remapped/gump_init_script_12yx9mtnnuqfgx94h66zzd6bx/59erzc54rfs4dkd2piu32yjok/init57408229).
00:20:44.060 [DEBUG] [org.gradle.cache.internal.DefaultFileLockManager] Waiting to acquire
shared lock on init remapped class cache for 59erzc54rfs4dkd2piu32yjok (/home/gump/.gradle/caches/2.14.1/scripts-remapped/gump_init_script_12yx9mtnnuqfgx94h66zzd6bx/59erzc54rfs4dkd2piu32yjok/init57408229).
00:20:44.063 [DEBUG] [org.gradle.cache.internal.DefaultFileLockManager] Lock acquired.
00:20:44.064 [DEBUG] [org.gradle.cache.internal.DefaultFileLockManager] Releasing lock on
init remapped class cache for 59erzc54rfs4dkd2piu32yjok (/home/gump/.gradle/caches/2.14.1/scripts-remapped/gump_init_script_12yx9mtnnuqfgx94h66zzd6bx/59erzc54rfs4dkd2piu32yjok/init57408229).
00:20:44.393 [DEBUG] [org.gradle.initialization.buildsrc.BuildSourceBuilder] Starting to build
the build sources.
00:20:44.393 [DEBUG] [org.gradle.initialization.buildsrc.BuildSourceBuilder] Gradle source
dir does not exist. We leave.
00:20:44.394 [DEBUG] [org.gradle.initialization.DefaultGradlePropertiesLoader] Found env project
properties: []
00:20:44.394 [DEBUG] [org.gradle.initialization.DefaultGradlePropertiesLoader] Found system
project properties: []
00:20:44.411 [DEBUG] [org.gradle.cache.internal.DefaultFileLockManager] Waiting to acquire
shared lock on cp_settings remapped class cache for 64g8nj5ap81xt4wz300ry8jej (/home/gump/.gradle/caches/2.14.1/scripts-remapped/settings_3zs6mr5f4qq49n5mpvcvec71o/64g8nj5ap81xt4wz300ry8jej/cp_settings57408229).
00:20:44.413 [DEBUG] [org.gradle.cache.internal.DefaultFileLockManager] Lock acquired.
00:20:44.415 [DEBUG] [org.gradle.cache.internal.DefaultFileLockManager] Releasing lock on
cp_settings remapped class cache for 64g8nj5ap81xt4wz300ry8jej (/home/gump/.gradle/caches/2.14.1/scripts-remapped/settings_3zs6mr5f4qq49n5mpvcvec71o/64g8nj5ap81xt4wz300ry8jej/cp_settings57408229).
00:20:44.419 [DEBUG] [org.gradle.cache.internal.DefaultFileLockManager] Waiting to acquire
shared lock on settings remapped class cache for 64g8nj5ap81xt4wz300ry8jej (/home/gump/.gradle/caches/2.14.1/scripts-remapped/settings_3zs6mr5f4qq49n5mpvcvec71o/64g8nj5ap81xt4wz300ry8jej/settings57408229).
00:20:44.424 [DEBUG] [org.gradle.cache.internal.DefaultFileLockManager] Lock acquired.
00:20:44.427 [DEBUG] [org.gradle.cache.internal.DefaultFileLockManager] Releasing lock on
settings remapped class cache for 64g8nj5ap81xt4wz300ry8jej (/home/gump/.gradle/caches/2.14.1/scripts-remapped/settings_3zs6mr5f4qq49n5mpvcvec71o/64g8nj5ap81xt4wz300ry8jej/settings57408229).
00:20:44.491 [ERROR] [org.gradle.BuildExceptionReporter] 
00:20:44.491 [ERROR] [org.gradle.BuildExceptionReporter] FAILURE: Build failed with an exception.
00:20:44.492 [ERROR] [org.gradle.BuildExceptionReporter] 
00:20:44.492 [ERROR] [org.gradle.BuildExceptionReporter] * Where:
00:20:44.492 [ERROR] [org.gradle.BuildExceptionReporter] Settings file '/srv/gump/public/workspace/java-hamcrest/settings.gradle'
line: 1
00:20:44.494 [ERROR] [org.gradle.BuildExceptionReporter] 
00:20:44.496 [ERROR] [org.gradle.BuildExceptionReporter] * What went wrong:
00:20:44.497 [ERROR] [org.gradle.BuildExceptionReporter] A problem occurred evaluating settings
'java-hamcrest'.
00:20:44.497 [ERROR] [org.gradle.BuildExceptionReporter] > Could not find method enableFeaturePreview()
for arguments [STABLE_PUBLISHING] on settings 'java-hamcrest' of type org.gradle.initialization.DefaultSettings.
00:20:44.497 [ERROR] [org.gradle.BuildExceptionReporter] 
00:20:44.497 [ERROR] [org.gradle.BuildExceptionReporter] * Try:
00:20:44.497 [ERROR] [org.gradle.BuildExceptionReporter] Run with --stacktrace option to get
the stack trace. 
00:20:44.498 [LIFECYCLE] [org.gradle.BuildResultLogger] 
00:20:44.500 [LIFECYCLE] [org.gradle.BuildResultLogger] BUILD FAILED
00:20:44.500 [LIFECYCLE] [org.gradle.BuildResultLogger] 
00:20:44.501 [LIFECYCLE] [org.gradle.BuildResultLogger] Total time: 4.619 secs
00:20:44.505 [DEBUG] [org.gradle.cache.internal.DefaultCacheAccess] Cache Plugin Resolution
Cache (/home/gump/.gradle/caches/2.14.1/plugin-resolution) was closed 0 times.
---------------------------------------------

To subscribe to this information via syndicated feeds:
- RSS: http://vmgump-vm3.apache.org/java-hamcrest/java-hamcrest/rss.xml
- Atom: http://vmgump-vm3.apache.org/java-hamcrest/java-hamcrest/atom.xml

============================== Gump Tracking Only ===
Produced by Apache Gump(TM) version 2.3.
Gump Run 20190129000007, vmgump-vm3.apache.org:vmgump:20190129000007
Gump E-mail Identifier (unique within run) #1.

*********************************************************** G U M P
[GUMP@vmgump-vm3]: Project commons-io (in module commons-io) failed
To whom it may engage...
        
This is an automated request, but not an unsolicited one. For 
more information please visit http://gump.apache.org/nagged.html, 
and/or contact the folk at general@gump.apache.org.

Project commons-io has an issue affecting its community integration.
This issue affects 9 projects,
 and has been outstanding for 171 runs.
The current state of this project is 'Failed', with reason 'Build Failed'.
For reference only, the following projects are affected by this:
    - commons-io :  Commons I/O Utility Package
    - forrest-core :  Apache Forrest software is a publishing framework that trans...
    - forrest-rat :  Apache Forrest software is a publishing framework that trans...
    - forrest-test :  Apache Forrest software is a publishing framework that trans...
    - forrest-test-basic :  Apache Forrest software is a publishing framework that trans...
    - forrest-test-deploy-plugins :  Apache Forrest software is a publishing framework that
trans...
    - xml-batik :  Scalable Vector Graphics
    - xmlgraphics-commons :  Apache XML Graphics Commons - Common Components for Batik an...
    - xmlgraphics-commons-test :  Apache XML Graphics Commons - Common Components for Batik
an...


Full details are available at:
    http://vmgump-vm3.apache.org/commons-io/commons-io/index.html

That said, some information snippets are provided here.

The following annotations (debug/informational/warning/error messages) were provided:
 -DEBUG- Sole jar output [commons-io-*[0-9T].jar] identifier set to project name
 -DEBUG- (Apache Gump generated) Apache Maven Settings in: /srv/gump/public/workspace/commons-io/gump_mvn_settings.xml
 -INFO- Failed with reason build failed
 -DEBUG- Maven POM in: /srv/gump/public/workspace/commons-io/pom.xml
 -INFO- Failed to extract fallback artifacts from Gump Repository



The following work was performed:
http://vmgump-vm3.apache.org/commons-io/commons-io/gump_work/build_commons-io_commons-io.html
Work Name: build_commons-io_commons-io (Type: Build)
Work ended in a state of : Failed
Elapsed: 29 secs
Command Line: /opt/maven3/bin/mvn --batch-mode -DskipTests=true --settings /srv/gump/public/workspace/commons-io/gump_mvn_settings.xml
package 
[Working Directory: /srv/gump/public/workspace/commons-io]
M2_HOME: /opt/maven3
---------------------------------------------
[INFO] Downloading: http://localhost:8192/maven2/org/apache/maven/maven-toolchain/2.2.1/maven-toolchain-2.2.1.jar
[INFO] Downloaded: http://localhost:8192/maven2/org/codehaus/mojo/animal-sniffer/1.16/animal-sniffer-1.16.jar
(34 KB at 476.5 KB/sec)
[INFO] Downloaded: http://localhost:8192/maven2/org/codehaus/mojo/java-boot-classpath-detector/1.16/java-boot-classpath-detector-1.16.jar
(5 KB at 54.8 KB/sec)
[INFO] Downloaded: http://localhost:8192/maven2/org/apache/maven/maven-toolchain/2.2.1/maven-toolchain-2.2.1.jar
(37 KB at 337.1 KB/sec)
[INFO] Downloaded: http://localhost:8192/maven2/org/ow2/asm/asm-all/5.2/asm-all-5.2.jar (242
KB at 1935.8 KB/sec)
[INFO] Checking unresolved references to org.codehaus.mojo.signature:java17:1.0
[INFO] Downloading: http://localhost:8192/maven2/org/codehaus/mojo/signature/java17/1.0/java17-1.0.signature
[INFO] Downloaded: http://localhost:8192/maven2/org/codehaus/mojo/signature/java17/1.0/java17-1.0.signature
(649 KB at 16200.1 KB/sec)
[INFO] 
[INFO] --- maven-resources-plugin:3.0.2:testResources (default-testResources) @ commons-io
---
[INFO] Using 'iso-8859-1' encoding to copy filtered resources.
[INFO] Copying 20 resources
[INFO] Copying 2 resources to META-INF
[INFO] 
[INFO] --- maven-compiler-plugin:3.7.0:testCompile (default-testCompile) @ commons-io ---
[INFO] Changes detected - recompiling the module!
[INFO] Compiling 121 source files to /srv/gump/public/workspace/commons-io/target/test-classes
[INFO] /srv/gump/public/workspace/commons-io/src/test/java/org/apache/commons/io/input/TailerTest.java:
Some input files use or override a deprecated API.
[INFO] /srv/gump/public/workspace/commons-io/src/test/java/org/apache/commons/io/input/TailerTest.java:
Recompile with -Xlint:deprecation for details.
[INFO] Some messages have been simplified; recompile with -Xdiags:verbose to get full output
[INFO] -------------------------------------------------------------
[ERROR] COMPILATION ERROR : 
[INFO] -------------------------------------------------------------
[ERROR] /srv/gump/public/workspace/commons-io/src/test/java/org/apache/commons/io/IOUtilsCopyTestCase.java:[266,45]
no suitable method found for copyLarge(java.io.Reader,java.lang.Appendable)
    method org.apache.commons.io.IOUtils.copyLarge(java.io.InputStream,java.io.OutputStream)
is not applicable
      (argument mismatch; java.io.Reader cannot be converted to java.io.InputStream)
    method org.apache.commons.io.IOUtils.copyLarge(java.io.Reader,java.io.Writer) is not applicable
      (argument mismatch; java.lang.Appendable cannot be converted to java.io.Writer)
[INFO] 1 error
[INFO] -------------------------------------------------------------
[INFO] ------------------------------------------------------------------------
[INFO] BUILD FAILURE
[INFO] ------------------------------------------------------------------------
[INFO] Total time: 27.511 s
[INFO] Finished at: 2019-01-29T00:33:57+00:00
[INFO] Final Memory: 31M/344M
[INFO] ------------------------------------------------------------------------
[ERROR] Failed to execute goal org.apache.maven.plugins:maven-compiler-plugin:3.7.0:testCompile
(default-testCompile) on project commons-io: Compilation failure
[ERROR] /srv/gump/public/workspace/commons-io/src/test/java/org/apache/commons/io/IOUtilsCopyTestCase.java:[266,45]
no suitable method found for copyLarge(java.io.Reader,java.lang.Appendable)
[ERROR] method org.apache.commons.io.IOUtils.copyLarge(java.io.InputStream,java.io.OutputStream)
is not applicable
[ERROR] (argument mismatch; java.io.Reader cannot be converted to java.io.InputStream)
[ERROR] method org.apache.commons.io.IOUtils.copyLarge(java.io.Reader,java.io.Writer) is not
applicable
[ERROR] (argument mismatch; java.lang.Appendable cannot be converted to java.io.Writer)
[ERROR] -> [Help 1]
[ERROR] 
[ERROR] To see the full stack trace of the errors, re-run Maven with the -e switch.
[ERROR] Re-run Maven using the -X switch to enable full debug logging.
[ERROR] 
[ERROR] For more information about the errors and possible solutions, please read the following
articles:
[ERROR] [Help 1] http://cwiki.apache.org/confluence/display/MAVEN/MojoFailureException
---------------------------------------------

To subscribe to this information via syndicated feeds:
- RSS: http://vmgump-vm3.apache.org/commons-io/commons-io/rss.xml
- Atom: http://vmgump-vm3.apache.org/commons-io/commons-io/atom.xml

============================== Gump Tracking Only ===
Produced by Apache Gump(TM) version 2.3.
Gump Run 20190129000007, vmgump-vm3.apache.org:vmgump:20190129000007
Gump E-mail Identifier (unique within run) #2.

*********************************************************** G U M P
[GUMP@vmgump-vm3]: Project test-ant (in module ant) failed
To whom it may engage...
        
This is an automated request, but not an unsolicited one. For 
more information please visit http://gump.apache.org/nagged.html, 
and/or contact the folk at general@gump.apache.org.

Project test-ant has an issue affecting its community integration.
This issue affects 1 projects,
 and has been outstanding for 162 runs.
The current state of this project is 'Failed', with reason 'Build Failed'.
For reference only, the following projects are affected by this:
    - test-ant :  Java based build tool


Full details are available at:
    http://vmgump-vm3.apache.org/ant/test-ant/index.html

That said, some information snippets are provided here.

The following annotations (debug/informational/warning/error messages) were provided:
 -WARNING- Bad *Optional* Dependency. Project: bsh : unknown to *this* workspace
 -INFO- Failed with reason build failed



The following work was performed:
http://vmgump-vm3.apache.org/ant/test-ant/gump_work/build_ant_test-ant.html
Work Name: build_ant_test-ant (Type: Build)
Work ended in a state of : Failed
Elapsed: 8 mins 57 secs
Command Line: /usr/lib/jvm/java-8-oracle/bin/java -Djava.awt.headless=true -Dbuild.sysclasspath=only
-Dsun.zip.disableMemoryMapping=true -Xbootclasspath/p:/srv/gump/public/workspace/xml-xerces2/build/xercesImpl.jar:/srv/gump/public/workspace/xml-commons/java/external/build/xml-apis.jar:/srv/gump/public/workspace/xml-xalan/build/xalan-unbundled.jar:/srv/gump/public/workspace/xml-xalan/build/serializer.jar
org.apache.tools.ant.Main -Dgump.merge=/srv/gump/public/gump/work/merge.xml -Dtest.haltonfailure=false
-Dant.home=/srv/gump/public/workspace/ant/dist run-tests 
[Working Directory: /srv/gump/public/workspace/ant]
CLASSPATH: /usr/lib/jvm/java-8-oracle/lib/tools.jar:/srv/gump/public/workspace/ant/build/testcases:/srv/gump/public/workspace/ant/src/tests/junit:/srv/gump/public/workspace/ant/src/etc/testcases:/srv/gump/public/workspace/ant/src/etc/testcases/taskdefs/optional/out:/srv/gump/public/workspace/ant/src/tests/antunit/filters:/srv/gump/public/workspace/ant/src/tests/antunit/taskdefs/importtests:/srv/gump/public/workspace/ant/src/tests/antunit/filters/foo:/srv/gump/public/workspace/ant/src/tests/antunit/taskdefs/foo:/srv/gump/public/workspace/ant/build/antunit/tmp/testinput/build:/srv/gump/public/workspace/ant/build/antunit/tmp/testoutput:/srv/gump/public/workspace/ant/build/antunit/tmp/test.jar:/srv/gump/public/workspace/ant/build/antunit/tmp/test1.jar:/srv/gump/public/workspace/ant/build/antunit/tmp/test2.jar:/srv/gump/public/workspace/ant/build/antunit/tmp/test3.jar:/srv/gump/public/workspace/ant/build/antunit/tmp/test4.jar:/srv/gump/public/workspace/ant/build/antunit/tmp/test5.jar:/srv
 /gump/public/workspace/ant/build/antunit/tmp/resources:/srv/gump/public/workspace/ant/build/lib/ant.jar:/srv/gump/public/workspace/ant/build/lib/ant-launcher.jar:/srv/gump/public/workspace/ant/build/lib/ant-antlr.jar:/srv/gump/public/workspace/ant/build/lib/ant-apache-bcel.jar:/srv/gump/public/workspace/ant/build/lib/ant-apache-bsf.jar:/srv/gump/public/workspace/ant/build/lib/ant-apache-log4j.jar:/srv/gump/public/workspace/ant/build/lib/ant-apache-oro.jar:/srv/gump/public/workspace/ant/build/lib/ant-apache-regexp.jar:/srv/gump/public/workspace/ant/build/lib/ant-apache-resolver.jar:/srv/gump/public/workspace/ant/build/lib/ant-apache-xalan2.jar:/srv/gump/public/workspace/ant/build/lib/ant-commons-logging.jar:/srv/gump/public/workspace/ant/build/lib/ant-commons-net.jar:/srv/gump/public/workspace/ant/build/lib/ant-jai.jar:/srv/gump/public/workspace/ant/build/lib/ant-javamail.jar:/srv/gump/public/workspace/ant/build/lib/ant-jdepend.jar:/srv/gump/public/workspace/ant/build/lib/ant-jmf.jar
 :/srv/gump/public/workspace/ant/build/lib/ant-jsch.jar:/srv/gump/public/workspace/ant/build/lib/ant-junit.jar:/srv/gump/public/workspace/ant/build/lib/ant-junit4.jar:/srv/gump/public/workspace/ant/build/lib/ant-swing.jar:/srv/gump/public/workspace/ant/build/lib/ant-xz.jar:/srv/gump/packages/antlr/antlr-3.1.3.jar:/srv/gump/public/workspace/ant-contrib/lib/bcel/jars/bcel-5.1.jar:/srv/gump/public/workspace/apache-commons/logging/target/commons-logging-20190129.jar:/srv/gump/public/workspace/apache-commons/logging/target/commons-logging-api-20190129.jar:/srv/gump/public/workspace/apache-commons/net/target/commons-net-3.7-SNAPSHOT.jar:/srv/gump/public/workspace/apache-commons/net/target/commons-net-ftp-3.7-SNAPSHOT.jar:/srv/gump/packages/jaf-1.1ea/activation.jar:/srv/gump/public/workspace/jakarta-bsf/build/lib/bsf.jar:/srv/gump/packages/apache-attic/jakarta-regexp-1.5.jar:/srv/gump/public/workspace/jakarta-servletapi-5/jsr154/dist/lib/servlet-api.jar:/srv/gump/packages/javamail-1.4/mail.
 jar:/srv/gump/packages/javamail-1.4/lib/mailapi.jar:/srv/gump/packages/jdepend-2.6/lib/jdepend.jar:/srv/gump/packages/jsch/jsch-0.1.45.jar:/srv/gump/public/workspace/logging-log4j-12/target/log4j-1.2.18-SNAPSHOT.jar:/srv/gump/packages/apache-attic/oro-2.0.8.jar:/srv/gump/public/workspace/xz-java/build/jar-20190129/xz.jar:/srv/gump/public/workspace/antlibs-antunit/build/ant-antunit-20190129.jar:/srv/gump/packages/hamcrest/hamcrest-core-1.3.jar:/srv/gump/public/workspace/junit/target/junit-4.13-SNAPSHOT.jar:/srv/gump/public/workspace/xml-commons/java/external/build/xml-apis-ext.jar:/srv/gump/packages/hamcrest/hamcrest-library-1.3.jar:/srv/gump/public/workspace/commons-codec-1.x/dist/commons-codec-20190129.jar
---------------------------------------------
[au:antunit] Build File: /srv/gump/public/workspace/ant/src/tests/antunit/types/selectors/modified-test.xml
[au:antunit] Tests run: 1, Failures: 0, Errors: 0, Time elapsed: 0.009 sec
[au:antunit] Target: testUpdate took 0.007 sec
[au:antunit] Build File: /srv/gump/public/workspace/ant/src/tests/antunit/types/selectors/ownedby-test.xml
[au:antunit] Tests run: 3, Failures: 0, Errors: 0, Time elapsed: 0.01 sec
[au:antunit] Target: testOwnedBy took 0.002 sec
[au:antunit] Target: testAsTrueConditions took 0 sec
[au:antunit] Target: testRequiresOwner took 0 sec
[au:antunit] Build File: /srv/gump/public/workspace/ant/src/tests/antunit/types/selectors/present-test.xml
[au:antunit] Tests run: 1, Failures: 0, Errors: 0, Time elapsed: 0.003 sec
[au:antunit] Target: testMapperByTypedef took 0.001 sec
[au:antunit] Build File: /srv/gump/public/workspace/ant/src/tests/antunit/types/selectors/readwrite-test.xml
[au:antunit] Tests run: 4, Failures: 0, Errors: 0, Time elapsed: 0.014 sec
[au:antunit] Target: testWritable took 0.001 sec
[au:antunit] Target: testAsConditions took 0.001 sec
[au:antunit] Target: testReadable took 0.001 sec
[au:antunit] Target: testUnwritable took 0 sec
[au:antunit] Build File: /srv/gump/public/workspace/ant/src/tests/antunit/types/selectors/select-test.xml
[au:antunit] Tests run: 4, Failures: 0, Errors: 0, Time elapsed: 0.016 sec
[au:antunit] Target: testIfFalse took 0.002 sec
[au:antunit] Target: testIfNotSet took 0.002 sec
[au:antunit] Target: testIfTrue took 0.001 sec
[au:antunit] Target: testIfSet took 0.001 sec
[au:antunit] Build File: /srv/gump/public/workspace/ant/src/tests/antunit/types/selectors/symlink-test.xml
[au:antunit] Tests run: 4, Failures: 0, Errors: 0, Time elapsed: 0.012 sec
[au:antunit] Target: testAsFalseConditions took 0.001 sec
[au:antunit] Target: testAsTrueConditions took 0.001 sec
[au:antunit] Target: testNoSymlink took 0.001 sec
[au:antunit] Target: testSymlink took 0.001 sec
[au:antunit] Build File: /srv/gump/public/workspace/ant/src/tests/antunit/types/tarfileset-test.xml
[au:antunit] Tests run: 3, Failures: 0, Errors: 0, Time elapsed: 0.007 sec
[au:antunit] Target: test-refid-check-encoding took 0 sec
[au:antunit] Target: testMissingArchive took 0.001 sec
[au:antunit] Target: testMissingArchiveDoesntMatter took 0 sec
[au:antunit] Build File: /srv/gump/public/workspace/ant/src/tests/antunit/types/zipfileset-test.xml
[au:antunit] Tests run: 5, Failures: 0, Errors: 0, Time elapsed: 0.019 sec
[au:antunit] Target: testMissingArchive took 0 sec
[au:antunit] Target: test-refid-check-encoding took 0.001 sec
[au:antunit] Target: test-refid-modify took 0.007 sec
[au:antunit] Target: test-refid-check-prefix took 0.001 sec
[au:antunit] Target: testMissingArchiveDoesntMatter took 0 sec

check-failed:

run-tests:

BUILD FAILED
/srv/gump/public/workspace/ant/build.xml:1698: Unit tests failed

Total time: 8 minutes 56 seconds
---------------------------------------------

To subscribe to this information via syndicated feeds:
- RSS: http://vmgump-vm3.apache.org/ant/test-ant/rss.xml
- Atom: http://vmgump-vm3.apache.org/ant/test-ant/atom.xml

============================== Gump Tracking Only ===
Produced by Apache Gump(TM) version 2.3.
Gump Run 20190129000007, vmgump-vm3.apache.org:vmgump:20190129000007
Gump E-mail Identifier (unique within run) #3.


--
Apache Gump
http://gump.apache.org/ [Instance: vmgump-vm3]

---------------------------------------------------------------------
To unsubscribe, e-mail: general-unsubscribe@gump.apache.org
For additional commands, e-mail: general-help@gump.apache.org


Mime
View raw message