gump-general mailing list archives

Site index · List index
Message view « Date » · « Thread »
Top « Date » · « Thread »
From g...@vmgump-vm3.apache.org
Subject BATCH: All dressed up, with nowhere to go...
Date Sat, 03 Nov 2018 04:29:22 GMT
Dear Gumpmeisters,
            
The following 7 notifys should have been sent

*********************************************************** G U M P
[GUMP@vmgump-vm3]: Module tomcat-native-1.2-1.1.1 failed
[GUMP@vmgump-vm3]: Project java-hamcrest (in module java-hamcrest) failed
[GUMP@vmgump-vm3]: Module jakarta-servletapi-5 failed
[GUMP@vmgump-vm3]: Project jakarta-servletapi-5-servlet (in module jakarta-servletapi-5) failed
[GUMP@vmgump-vm3]: Project txt2html-task (in module jakarta-servletapi-5) failed
[GUMP@vmgump-vm3]: Module tomcat-8.5.x failed
[GUMP@vmgump-vm3]: Project test-ant (in module ant) failed
*********************************************************** G U M P
[GUMP@vmgump-vm3]: Module tomcat-native-1.2-1.1.1 failed
To whom it may engage...
        
This is an automated request, but not an unsolicited one. For 
more information please visit http://gump.apache.org/nagged.html, 
and/or contact the folk at general@gump.apache.org.

Module tomcat-native-1.2-1.1.1 has an issue affecting its community integration,
 and has been outstanding for 125 runs.
The current state of this module is 'Failed', with reason 'Update Failed'.

Full details are available at:
    http://vmgump-vm3.apache.org/tomcat-native-1.2-1.1.1/index.html

That said, some information snippets are provided here.

The following annotations (debug/informational/warning/error messages) were provided:
 -INFO- Failed with reason update failed



The following work was performed:
http://vmgump-vm3.apache.org/tomcat-native-1.2-1.1.1/gump_work/update_tomcat-native-1.2-1.1.1.html
Work Name: update_tomcat-native-1.2-1.1.1 (Type: Update)
Work ended in a state of : Failed
Elapsed: 10 mins 38 secs
Command Line: svn --quiet update --non-interactive tomcat-native-1.2-1.1.1 
[Working Directory: /srv/gump/public/workspace/cvs]
---------------------------------------------
svn: E205011: Failure occurred processing one or more externals definitions
---------------------------------------------

To subscribe to this information via syndicated feeds:
- RSS: http://vmgump-vm3.apache.org/tomcat-native-1.2-1.1.1/rss.xml
- Atom: http://vmgump-vm3.apache.org/tomcat-native-1.2-1.1.1/atom.xml

============================== Gump Tracking Only ===
Produced by Apache Gump(TM) version 2.3.
Gump Run 20181103000007, vmgump-vm3.apache.org:vmgump:20181103000007
Gump E-mail Identifier (unique within run) #1.

*********************************************************** G U M P
[GUMP@vmgump-vm3]: Project java-hamcrest (in module java-hamcrest) failed
To whom it may engage...
        
This is an automated request, but not an unsolicited one. For 
more information please visit http://gump.apache.org/nagged.html, 
and/or contact the folk at general@gump.apache.org.

Project java-hamcrest has an issue affecting its community integration.
This issue affects 1 projects,
 and has been outstanding for 21 runs.
The current state of this project is 'Failed', with reason 'Build Failed'.
For reference only, the following projects are affected by this:
    - java-hamcrest :  Provides a library of matcher objects (also known as constra...


Full details are available at:
    http://vmgump-vm3.apache.org/java-hamcrest/java-hamcrest/index.html

That said, some information snippets are provided here.

The following annotations (debug/informational/warning/error messages) were provided:
 -DEBUG- Sole jar output [java-hamcrest-*[0-9T].jar] identifier set to project name
 -DEBUG- (Apache Gump generated) Gradle Init Script in: /srv/gump/public/workspace/java-hamcrest/gump_init_script.gradle
 -INFO- Failed with reason build failed
 -DEBUG- Gradle build in: /srv/gump/public/workspace/java-hamcrest/build.gradle
 -INFO- Failed to extract fallback artifacts from Gump Repository



The following work was performed:
http://vmgump-vm3.apache.org/java-hamcrest/java-hamcrest/gump_work/build_java-hamcrest_java-hamcrest.html
Work Name: build_java-hamcrest_java-hamcrest (Type: Build)
Work ended in a state of : Failed
Elapsed: 5 secs
Command Line: gradle --debug -Djava.awt.headless=true -Dbuild.sysclasspath=only -Dsun.zip.disableMemoryMapping=true
-Dmaven.repo.local=/srv/gump/public/workspace/mvnlocalrepo/java-hamcrest.mvnlocalrepo --refresh-dependencies
--init-script /srv/gump/public/workspace/java-hamcrest/gump_init_script.gradle build 
[Working Directory: /srv/gump/public/workspace/java-hamcrest]
---------------------------------------------
00:38:52.958 [DEBUG] [org.gradle.cache.internal.DefaultFileLockManager] Lock acquired.
00:38:52.959 [DEBUG] [org.gradle.cache.internal.DefaultPersistentDirectoryCache] Invalidating
init remapped class cache for 8o1lsfo1l1ovdnf6js3lbf39j (/home/gump/.gradle/caches/2.14.1/scripts-remapped/gump_init_script_12yx9mtnnuqfgx94h66zzd6bx/8o1lsfo1l1ovdnf6js3lbf39j/init57408229)
as it was not closed cleanly.
00:38:52.959 [DEBUG] [org.gradle.cache.internal.DefaultFileLockManager] Releasing lock on
init remapped class cache for 8o1lsfo1l1ovdnf6js3lbf39j (/home/gump/.gradle/caches/2.14.1/scripts-remapped/gump_init_script_12yx9mtnnuqfgx94h66zzd6bx/8o1lsfo1l1ovdnf6js3lbf39j/init57408229).
00:38:52.962 [DEBUG] [org.gradle.cache.internal.DefaultFileLockManager] Waiting to acquire
exclusive lock on init remapped class cache for 8o1lsfo1l1ovdnf6js3lbf39j (/home/gump/.gradle/caches/2.14.1/scripts-remapped/gump_init_script_12yx9mtnnuqfgx94h66zzd6bx/8o1lsfo1l1ovdnf6js3lbf39j/init57408229).
00:38:52.962 [DEBUG] [org.gradle.cache.internal.DefaultFileLockManager] Lock acquired.
00:38:52.963 [DEBUG] [org.gradle.cache.internal.DefaultPersistentDirectoryCache] Invalidating
init remapped class cache for 8o1lsfo1l1ovdnf6js3lbf39j (/home/gump/.gradle/caches/2.14.1/scripts-remapped/gump_init_script_12yx9mtnnuqfgx94h66zzd6bx/8o1lsfo1l1ovdnf6js3lbf39j/init57408229)
as it was not closed cleanly.
00:38:52.964 [DEBUG] [org.gradle.cache.internal.DefaultFileLockManager] Waiting to acquire
shared lock on init generic class cache for initialization script '/srv/gump/public/workspace/java-hamcrest/gump_init_script.gradle'
(/home/gump/.gradle/caches/2.14.1/scripts/8o1lsfo1l1ovdnf6js3lbf39j/init/init57408229).
00:38:52.966 [DEBUG] [org.gradle.cache.internal.DefaultFileLockManager] Lock acquired.
00:38:52.966 [DEBUG] [org.gradle.cache.internal.DefaultPersistentDirectoryCache] Invalidating
init generic class cache for initialization script '/srv/gump/public/workspace/java-hamcrest/gump_init_script.gradle'
(/home/gump/.gradle/caches/2.14.1/scripts/8o1lsfo1l1ovdnf6js3lbf39j/init/init57408229) as
it was not closed cleanly.
00:38:52.967 [DEBUG] [org.gradle.cache.internal.DefaultFileLockManager] Releasing lock on
init generic class cache for initialization script '/srv/gump/public/workspace/java-hamcrest/gump_init_script.gradle'
(/home/gump/.gradle/caches/2.14.1/scripts/8o1lsfo1l1ovdnf6js3lbf39j/init/init57408229).
00:38:52.967 [DEBUG] [org.gradle.cache.internal.DefaultFileLockManager] Waiting to acquire
exclusive lock on init generic class cache for initialization script '/srv/gump/public/workspace/java-hamcrest/gump_init_script.gradle'
(/home/gump/.gradle/caches/2.14.1/scripts/8o1lsfo1l1ovdnf6js3lbf39j/init/init57408229).
00:38:52.967 [DEBUG] [org.gradle.cache.internal.DefaultFileLockManager] Lock acquired.
00:38:52.967 [DEBUG] [org.gradle.cache.internal.DefaultPersistentDirectoryCache] Invalidating
init generic class cache for initialization script '/srv/gump/public/workspace/java-hamcrest/gump_init_script.gradle'
(/home/gump/.gradle/caches/2.14.1/scripts/8o1lsfo1l1ovdnf6js3lbf39j/init/init57408229) as
it was not closed cleanly.
00:38:52.968 [INFO] [org.gradle.groovy.scripts.internal.DefaultScriptCompilationHandler] Compiling
initialization script '/srv/gump/public/workspace/java-hamcrest/gump_init_script.gradle' using
BuildScriptTransformer.
00:38:53.433 [DEBUG] [org.gradle.groovy.scripts.internal.DefaultScriptCompilationHandler]
Timing: Writing script to cache at /home/gump/.gradle/caches/2.14.1/scripts/8o1lsfo1l1ovdnf6js3lbf39j/init/init57408229/classes
took: 0.465 secs
00:38:53.434 [DEBUG] [org.gradle.cache.internal.DefaultFileLockManager] Releasing lock on
init generic class cache for initialization script '/srv/gump/public/workspace/java-hamcrest/gump_init_script.gradle'
(/home/gump/.gradle/caches/2.14.1/scripts/8o1lsfo1l1ovdnf6js3lbf39j/init/init57408229).
00:38:53.436 [DEBUG] [org.gradle.cache.internal.DefaultFileLockManager] Waiting to acquire
shared lock on init generic class cache for initialization script '/srv/gump/public/workspace/java-hamcrest/gump_init_script.gradle'
(/home/gump/.gradle/caches/2.14.1/scripts/8o1lsfo1l1ovdnf6js3lbf39j/init/init57408229).
00:38:53.437 [DEBUG] [org.gradle.cache.internal.DefaultFileLockManager] Lock acquired.
00:38:53.443 [DEBUG] [org.gradle.cache.internal.DefaultFileLockManager] Releasing lock on
init generic class cache for initialization script '/srv/gump/public/workspace/java-hamcrest/gump_init_script.gradle'
(/home/gump/.gradle/caches/2.14.1/scripts/8o1lsfo1l1ovdnf6js3lbf39j/init/init57408229).
00:38:53.477 [DEBUG] [org.gradle.cache.internal.DefaultFileLockManager] Releasing lock on
init remapped class cache for 8o1lsfo1l1ovdnf6js3lbf39j (/home/gump/.gradle/caches/2.14.1/scripts-remapped/gump_init_script_12yx9mtnnuqfgx94h66zzd6bx/8o1lsfo1l1ovdnf6js3lbf39j/init57408229).
00:38:53.477 [DEBUG] [org.gradle.cache.internal.DefaultFileLockManager] Waiting to acquire
shared lock on init remapped class cache for 8o1lsfo1l1ovdnf6js3lbf39j (/home/gump/.gradle/caches/2.14.1/scripts-remapped/gump_init_script_12yx9mtnnuqfgx94h66zzd6bx/8o1lsfo1l1ovdnf6js3lbf39j/init57408229).
00:38:53.478 [DEBUG] [org.gradle.cache.internal.DefaultFileLockManager] Lock acquired.
00:38:53.478 [DEBUG] [org.gradle.cache.internal.DefaultFileLockManager] Releasing lock on
init remapped class cache for 8o1lsfo1l1ovdnf6js3lbf39j (/home/gump/.gradle/caches/2.14.1/scripts-remapped/gump_init_script_12yx9mtnnuqfgx94h66zzd6bx/8o1lsfo1l1ovdnf6js3lbf39j/init57408229).
00:38:53.764 [DEBUG] [org.gradle.initialization.buildsrc.BuildSourceBuilder] Starting to build
the build sources.
00:38:53.775 [DEBUG] [org.gradle.initialization.buildsrc.BuildSourceBuilder] Gradle source
dir does not exist. We leave.
00:38:53.776 [DEBUG] [org.gradle.initialization.DefaultGradlePropertiesLoader] Found env project
properties: []
00:38:53.777 [DEBUG] [org.gradle.initialization.DefaultGradlePropertiesLoader] Found system
project properties: []
00:38:53.794 [DEBUG] [org.gradle.cache.internal.DefaultFileLockManager] Waiting to acquire
shared lock on cp_settings remapped class cache for a7njh6nl80ofu3kr0ab3o9viw (/home/gump/.gradle/caches/2.14.1/scripts-remapped/settings_3zs6mr5f4qq49n5mpvcvec71o/a7njh6nl80ofu3kr0ab3o9viw/cp_settings57408229).
00:38:53.796 [DEBUG] [org.gradle.cache.internal.DefaultFileLockManager] Lock acquired.
00:38:53.798 [DEBUG] [org.gradle.cache.internal.DefaultFileLockManager] Releasing lock on
cp_settings remapped class cache for a7njh6nl80ofu3kr0ab3o9viw (/home/gump/.gradle/caches/2.14.1/scripts-remapped/settings_3zs6mr5f4qq49n5mpvcvec71o/a7njh6nl80ofu3kr0ab3o9viw/cp_settings57408229).
00:38:53.803 [DEBUG] [org.gradle.cache.internal.DefaultFileLockManager] Waiting to acquire
shared lock on settings remapped class cache for a7njh6nl80ofu3kr0ab3o9viw (/home/gump/.gradle/caches/2.14.1/scripts-remapped/settings_3zs6mr5f4qq49n5mpvcvec71o/a7njh6nl80ofu3kr0ab3o9viw/settings57408229).
00:38:53.804 [DEBUG] [org.gradle.cache.internal.DefaultFileLockManager] Lock acquired.
00:38:53.807 [DEBUG] [org.gradle.cache.internal.DefaultFileLockManager] Releasing lock on
settings remapped class cache for a7njh6nl80ofu3kr0ab3o9viw (/home/gump/.gradle/caches/2.14.1/scripts-remapped/settings_3zs6mr5f4qq49n5mpvcvec71o/a7njh6nl80ofu3kr0ab3o9viw/settings57408229).
00:38:53.866 [ERROR] [org.gradle.BuildExceptionReporter] 
00:38:53.866 [ERROR] [org.gradle.BuildExceptionReporter] FAILURE: Build failed with an exception.
00:38:53.867 [ERROR] [org.gradle.BuildExceptionReporter] 
00:38:53.867 [ERROR] [org.gradle.BuildExceptionReporter] * Where:
00:38:53.867 [ERROR] [org.gradle.BuildExceptionReporter] Settings file '/srv/gump/public/workspace/java-hamcrest/settings.gradle'
line: 1
00:38:53.867 [ERROR] [org.gradle.BuildExceptionReporter] 
00:38:53.867 [ERROR] [org.gradle.BuildExceptionReporter] * What went wrong:
00:38:53.868 [ERROR] [org.gradle.BuildExceptionReporter] A problem occurred evaluating settings
'java-hamcrest'.
00:38:53.868 [ERROR] [org.gradle.BuildExceptionReporter] > Could not find method enableFeaturePreview()
for arguments [STABLE_PUBLISHING] on settings 'java-hamcrest' of type org.gradle.initialization.DefaultSettings.
00:38:53.868 [ERROR] [org.gradle.BuildExceptionReporter] 
00:38:53.868 [ERROR] [org.gradle.BuildExceptionReporter] * Try:
00:38:53.868 [ERROR] [org.gradle.BuildExceptionReporter] Run with --stacktrace option to get
the stack trace. 
00:38:53.869 [LIFECYCLE] [org.gradle.BuildResultLogger] 
00:38:53.869 [LIFECYCLE] [org.gradle.BuildResultLogger] BUILD FAILED
00:38:53.869 [LIFECYCLE] [org.gradle.BuildResultLogger] 
00:38:53.870 [LIFECYCLE] [org.gradle.BuildResultLogger] Total time: 5.458 secs
00:38:53.871 [DEBUG] [org.gradle.cache.internal.DefaultCacheAccess] Cache Plugin Resolution
Cache (/home/gump/.gradle/caches/2.14.1/plugin-resolution) was closed 0 times.
---------------------------------------------

To subscribe to this information via syndicated feeds:
- RSS: http://vmgump-vm3.apache.org/java-hamcrest/java-hamcrest/rss.xml
- Atom: http://vmgump-vm3.apache.org/java-hamcrest/java-hamcrest/atom.xml

============================== Gump Tracking Only ===
Produced by Apache Gump(TM) version 2.3.
Gump Run 20181103000007, vmgump-vm3.apache.org:vmgump:20181103000007
Gump E-mail Identifier (unique within run) #4.

*********************************************************** G U M P
[GUMP@vmgump-vm3]: Module jakarta-servletapi-5 failed
To whom it may engage...
        
This is an automated request, but not an unsolicited one. For 
more information please visit http://gump.apache.org/nagged.html, 
and/or contact the folk at general@gump.apache.org.

Module jakarta-servletapi-5 has an issue affecting its community integration,
 and has been outstanding for 927 runs.
The current state of this module is 'Failed', with reason 'Update Failed'.

Full details are available at:
    http://vmgump-vm3.apache.org/jakarta-servletapi-5/index.html

That said, some information snippets are provided here.

The following annotations (debug/informational/warning/error messages) were provided:
 -INFO- Failed with reason update failed



The following work was performed:
http://vmgump-vm3.apache.org/jakarta-servletapi-5/gump_work/update_jakarta-servletapi-5.html
Work Name: update_jakarta-servletapi-5 (Type: Update)
Work ended in a state of : Failed
Elapsed: 10 mins 1 sec
Command Line: svn --quiet update --non-interactive jakarta-servletapi-5 
[Working Directory: /srv/gump/public/workspace/cvs]
---------------------------------------------
svn: E175012: Unable to connect to a repository at URL 'http://svn.apache.org/repos/asf/tomcat/archive/tc5.5.x/trunk/servletapi'
svn: E175012: Connection timed out
---------------------------------------------

To subscribe to this information via syndicated feeds:
- RSS: http://vmgump-vm3.apache.org/jakarta-servletapi-5/rss.xml
- Atom: http://vmgump-vm3.apache.org/jakarta-servletapi-5/atom.xml

============================== Gump Tracking Only ===
Produced by Apache Gump(TM) version 2.3.
Gump Run 20181103000007, vmgump-vm3.apache.org:vmgump:20181103000007
Gump E-mail Identifier (unique within run) #5.

*********************************************************** G U M P
[GUMP@vmgump-vm3]: Project jakarta-servletapi-5-servlet (in module jakarta-servletapi-5) failed
To whom it may engage...
        
This is an automated request, but not an unsolicited one. For 
more information please visit http://gump.apache.org/nagged.html, 
and/or contact the folk at general@gump.apache.org.

Project jakarta-servletapi-5-servlet has an issue affecting its community integration,
 and has been outstanding for 120 runs.
The current state of this project is 'Failed', with reason 'Update Failed'.

Full details are available at:
    http://vmgump-vm3.apache.org/jakarta-servletapi-5/jakarta-servletapi-5-servlet/index.html

That said, some information snippets are provided here.

The following annotations (debug/informational/warning/error messages) were provided:
 -INFO- Failed with reason update failed
 -DEBUG- Extracted fallback artifacts from Gump Repository

To subscribe to this information via syndicated feeds:
- RSS: http://vmgump-vm3.apache.org/jakarta-servletapi-5/jakarta-servletapi-5-servlet/rss.xml
- Atom: http://vmgump-vm3.apache.org/jakarta-servletapi-5/jakarta-servletapi-5-servlet/atom.xml

============================== Gump Tracking Only ===
Produced by Apache Gump(TM) version 2.3.
Gump Run 20181103000007, vmgump-vm3.apache.org:vmgump:20181103000007
Gump E-mail Identifier (unique within run) #6.

*********************************************************** G U M P
[GUMP@vmgump-vm3]: Project txt2html-task (in module jakarta-servletapi-5) failed
To whom it may engage...
        
This is an automated request, but not an unsolicited one. For 
more information please visit http://gump.apache.org/nagged.html, 
and/or contact the folk at general@gump.apache.org.

Project txt2html-task has an issue affecting its community integration,
 and has been outstanding for 120 runs.
The current state of this project is 'Failed', with reason 'Update Failed'.

Full details are available at:
    http://vmgump-vm3.apache.org/jakarta-servletapi-5/txt2html-task/index.html

That said, some information snippets are provided here.

The following annotations (debug/informational/warning/error messages) were provided:
 -DEBUG- Sole jar output [jsp-anttask-20181103.jar] identifier set to project name
 -INFO- Failed with reason update failed
 -DEBUG- Extracted fallback artifacts from Gump Repository

To subscribe to this information via syndicated feeds:
- RSS: http://vmgump-vm3.apache.org/jakarta-servletapi-5/txt2html-task/rss.xml
- Atom: http://vmgump-vm3.apache.org/jakarta-servletapi-5/txt2html-task/atom.xml

============================== Gump Tracking Only ===
Produced by Apache Gump(TM) version 2.3.
Gump Run 20181103000007, vmgump-vm3.apache.org:vmgump:20181103000007
Gump E-mail Identifier (unique within run) #7.

*********************************************************** G U M P
[GUMP@vmgump-vm3]: Module tomcat-8.5.x failed
To whom it may engage...
        
This is an automated request, but not an unsolicited one. For 
more information please visit http://gump.apache.org/nagged.html, 
and/or contact the folk at general@gump.apache.org.

Module tomcat-8.5.x has an issue affecting its community integration,
 and has been outstanding for 206 runs.
The current state of this module is 'Failed', with reason 'Update Failed'.

Full details are available at:
    http://vmgump-vm3.apache.org/tomcat-8.5.x/index.html

That said, some information snippets are provided here.

The following annotations (debug/informational/warning/error messages) were provided:
 -INFO- Failed with reason update failed



The following work was performed:
http://vmgump-vm3.apache.org/tomcat-8.5.x/gump_work/update_tomcat-8.5.x.html
Work Name: update_tomcat-8.5.x (Type: Update)
Work ended in a state of : Failed
Elapsed: 2 mins 37 secs
Command Line: svn --quiet update --non-interactive tomcat-8.5.x 
[Working Directory: /srv/gump/public/workspace/cvs]
---------------------------------------------
svn: E000110: Error running context: Connection timed out
---------------------------------------------

To subscribe to this information via syndicated feeds:
- RSS: http://vmgump-vm3.apache.org/tomcat-8.5.x/rss.xml
- Atom: http://vmgump-vm3.apache.org/tomcat-8.5.x/atom.xml

============================== Gump Tracking Only ===
Produced by Apache Gump(TM) version 2.3.
Gump Run 20181103000007, vmgump-vm3.apache.org:vmgump:20181103000007
Gump E-mail Identifier (unique within run) #8.

*********************************************************** G U M P
[GUMP@vmgump-vm3]: Project test-ant (in module ant) failed
To whom it may engage...
        
This is an automated request, but not an unsolicited one. For 
more information please visit http://gump.apache.org/nagged.html, 
and/or contact the folk at general@gump.apache.org.

Project test-ant has an issue affecting its community integration.
This issue affects 1 projects,
 and has been outstanding for 18 runs.
The current state of this project is 'Failed', with reason 'Build Failed'.
For reference only, the following projects are affected by this:
    - test-ant :  Java based build tool


Full details are available at:
    http://vmgump-vm3.apache.org/ant/test-ant/index.html

That said, some information snippets are provided here.

The following annotations (debug/informational/warning/error messages) were provided:
 -WARNING- Bad *Optional* Dependency. Project: bsh : unknown to *this* workspace
 -INFO- Failed with reason build failed



The following work was performed:
http://vmgump-vm3.apache.org/ant/test-ant/gump_work/build_ant_test-ant.html
Work Name: build_ant_test-ant (Type: Build)
Work ended in a state of : Failed
Elapsed: 8 mins 52 secs
Command Line: /usr/lib/jvm/java-8-oracle/bin/java -Djava.awt.headless=true -Dbuild.sysclasspath=only
-Dsun.zip.disableMemoryMapping=true -Xbootclasspath/p:/srv/gump/public/workspace/xml-xerces2/build/xercesImpl.jar:/srv/gump/public/workspace/xml-commons/java/external/build/xml-apis.jar:/srv/gump/public/workspace/xml-xalan/build/xalan-unbundled.jar:/srv/gump/public/workspace/xml-xalan/build/serializer.jar
org.apache.tools.ant.Main -Dgump.merge=/srv/gump/public/gump/work/merge.xml -Dtest.haltonfailure=false
-Dant.home=/srv/gump/public/workspace/ant/dist run-tests 
[Working Directory: /srv/gump/public/workspace/ant]
CLASSPATH: /usr/lib/jvm/java-8-oracle/lib/tools.jar:/srv/gump/public/workspace/ant/build/testcases:/srv/gump/public/workspace/ant/src/tests/junit:/srv/gump/public/workspace/ant/src/etc/testcases:/srv/gump/public/workspace/ant/src/etc/testcases/taskdefs/optional/out:/srv/gump/public/workspace/ant/src/tests/antunit/filters:/srv/gump/public/workspace/ant/src/tests/antunit/taskdefs/importtests:/srv/gump/public/workspace/ant/src/tests/antunit/filters/foo:/srv/gump/public/workspace/ant/src/tests/antunit/taskdefs/foo:/srv/gump/public/workspace/ant/build/antunit/tmp/testinput/build:/srv/gump/public/workspace/ant/build/antunit/tmp/testoutput:/srv/gump/public/workspace/ant/build/antunit/tmp/test.jar:/srv/gump/public/workspace/ant/build/antunit/tmp/test1.jar:/srv/gump/public/workspace/ant/build/antunit/tmp/test2.jar:/srv/gump/public/workspace/ant/build/antunit/tmp/test3.jar:/srv/gump/public/workspace/ant/build/antunit/tmp/test4.jar:/srv/gump/public/workspace/ant/build/antunit/tmp/test5.jar:/srv
 /gump/public/workspace/ant/build/antunit/tmp/resources:/srv/gump/public/workspace/ant/build/lib/ant.jar:/srv/gump/public/workspace/ant/build/lib/ant-launcher.jar:/srv/gump/public/workspace/ant/build/lib/ant-antlr.jar:/srv/gump/public/workspace/ant/build/lib/ant-apache-bcel.jar:/srv/gump/public/workspace/ant/build/lib/ant-apache-bsf.jar:/srv/gump/public/workspace/ant/build/lib/ant-apache-log4j.jar:/srv/gump/public/workspace/ant/build/lib/ant-apache-oro.jar:/srv/gump/public/workspace/ant/build/lib/ant-apache-regexp.jar:/srv/gump/public/workspace/ant/build/lib/ant-apache-resolver.jar:/srv/gump/public/workspace/ant/build/lib/ant-apache-xalan2.jar:/srv/gump/public/workspace/ant/build/lib/ant-commons-logging.jar:/srv/gump/public/workspace/ant/build/lib/ant-commons-net.jar:/srv/gump/public/workspace/ant/build/lib/ant-jai.jar:/srv/gump/public/workspace/ant/build/lib/ant-javamail.jar:/srv/gump/public/workspace/ant/build/lib/ant-jdepend.jar:/srv/gump/public/workspace/ant/build/lib/ant-jmf.jar
 :/srv/gump/public/workspace/ant/build/lib/ant-jsch.jar:/srv/gump/public/workspace/ant/build/lib/ant-junit.jar:/srv/gump/public/workspace/ant/build/lib/ant-junit4.jar:/srv/gump/public/workspace/ant/build/lib/ant-swing.jar:/srv/gump/public/workspace/ant/build/lib/ant-xz.jar:/srv/gump/packages/antlr/antlr-3.1.3.jar:/srv/gump/public/workspace/ant-contrib/lib/bcel/jars/bcel-5.1.jar:commons-logging-gump-20181102.jar:commons-logging-api-gump-20181102.jar:/srv/gump/public/workspace/apache-commons/net/target/commons-net-3.7-SNAPSHOT.jar:/srv/gump/public/workspace/apache-commons/net/target/commons-net-ftp-3.7-SNAPSHOT.jar:/srv/gump/packages/jaf-1.1ea/activation.jar:bsf-gump-20181102.jar:/srv/gump/packages/apache-attic/jakarta-regexp-1.5.jar:servletapi-gump-20181102.jar:/srv/gump/packages/javamail-1.4/mail.jar:/srv/gump/packages/javamail-1.4/lib/mailapi.jar:/srv/gump/packages/jdepend-2.6/lib/jdepend.jar:/srv/gump/packages/jsch/jsch-0.1.45.jar:/srv/gump/public/workspace/logging-log4j-12/target/
 log4j-1.2.18-SNAPSHOT.jar:/srv/gump/packages/apache-attic/oro-2.0.8.jar:/srv/gump/public/workspace/xz-java/build/jar-20181103/xz.jar:/srv/gump/public/workspace/antlibs-antunit/build/ant-antunit-20181103.jar:/srv/gump/packages/hamcrest/hamcrest-core-1.3.jar:/srv/gump/public/workspace/junit/target/junit-4.13-SNAPSHOT.jar:/srv/gump/public/workspace/xml-commons/java/external/build/xml-apis-ext.jar:/srv/gump/packages/hamcrest/hamcrest-library-1.3.jar:/srv/gump/public/workspace/commons-codec-1.x/dist/commons-codec-20181103.jar
---------------------------------------------
[au:antunit] Build File: /srv/gump/public/workspace/ant/src/tests/antunit/types/selectors/modified-test.xml
[au:antunit] Tests run: 1, Failures: 0, Errors: 0, Time elapsed: 0.01 sec
[au:antunit] Target: testUpdate took 0.007 sec
[au:antunit] Build File: /srv/gump/public/workspace/ant/src/tests/antunit/types/selectors/ownedby-test.xml
[au:antunit] Tests run: 3, Failures: 0, Errors: 0, Time elapsed: 0.009 sec
[au:antunit] Target: testOwnedBy took 0.002 sec
[au:antunit] Target: testAsTrueConditions took 0 sec
[au:antunit] Target: testRequiresOwner took 0.001 sec
[au:antunit] Build File: /srv/gump/public/workspace/ant/src/tests/antunit/types/selectors/present-test.xml
[au:antunit] Tests run: 1, Failures: 0, Errors: 0, Time elapsed: 0.003 sec
[au:antunit] Target: testMapperByTypedef took 0.001 sec
[au:antunit] Build File: /srv/gump/public/workspace/ant/src/tests/antunit/types/selectors/readwrite-test.xml
[au:antunit] Tests run: 4, Failures: 0, Errors: 0, Time elapsed: 0.011 sec
[au:antunit] Target: testWritable took 0.001 sec
[au:antunit] Target: testAsConditions took 0 sec
[au:antunit] Target: testReadable took 0.001 sec
[au:antunit] Target: testUnwritable took 0.001 sec
[au:antunit] Build File: /srv/gump/public/workspace/ant/src/tests/antunit/types/selectors/select-test.xml
[au:antunit] Tests run: 4, Failures: 0, Errors: 0, Time elapsed: 0.104 sec
[au:antunit] Target: testIfFalse took 0.01 sec
[au:antunit] Target: testIfNotSet took 0.002 sec
[au:antunit] Target: testIfTrue took 0.001 sec
[au:antunit] Target: testIfSet took 0.002 sec
[au:antunit] Build File: /srv/gump/public/workspace/ant/src/tests/antunit/types/selectors/symlink-test.xml
[au:antunit] Tests run: 4, Failures: 0, Errors: 0, Time elapsed: 0.012 sec
[au:antunit] Target: testAsFalseConditions took 0.001 sec
[au:antunit] Target: testAsTrueConditions took 0 sec
[au:antunit] Target: testNoSymlink took 0.001 sec
[au:antunit] Target: testSymlink took 0.001 sec
[au:antunit] Build File: /srv/gump/public/workspace/ant/src/tests/antunit/types/tarfileset-test.xml
[au:antunit] Tests run: 3, Failures: 0, Errors: 0, Time elapsed: 0.006 sec
[au:antunit] Target: test-refid-check-encoding took 0 sec
[au:antunit] Target: testMissingArchive took 0 sec
[au:antunit] Target: testMissingArchiveDoesntMatter took 0 sec
[au:antunit] Build File: /srv/gump/public/workspace/ant/src/tests/antunit/types/zipfileset-test.xml
[au:antunit] Tests run: 5, Failures: 0, Errors: 0, Time elapsed: 0.022 sec
[au:antunit] Target: testMissingArchive took 0.001 sec
[au:antunit] Target: test-refid-check-encoding took 0 sec
[au:antunit] Target: test-refid-modify took 0.008 sec
[au:antunit] Target: test-refid-check-prefix took 0.001 sec
[au:antunit] Target: testMissingArchiveDoesntMatter took 0 sec

check-failed:

run-tests:

BUILD FAILED
/srv/gump/public/workspace/ant/build.xml:1692: Unit tests failed

Total time: 8 minutes 52 seconds
---------------------------------------------

To subscribe to this information via syndicated feeds:
- RSS: http://vmgump-vm3.apache.org/ant/test-ant/rss.xml
- Atom: http://vmgump-vm3.apache.org/ant/test-ant/atom.xml

============================== Gump Tracking Only ===
Produced by Apache Gump(TM) version 2.3.
Gump Run 20181103000007, vmgump-vm3.apache.org:vmgump:20181103000007
Gump E-mail Identifier (unique within run) #10.


--
Apache Gump
http://gump.apache.org/ [Instance: vmgump-vm3]

---------------------------------------------------------------------
To unsubscribe, e-mail: general-unsubscribe@gump.apache.org
For additional commands, e-mail: general-help@gump.apache.org


Mime
View raw message