gump-general mailing list archives

Site index · List index
Message view « Date » · « Thread »
Top « Date » · « Thread »
From g...@vmgump-vm3.apache.org
Subject BATCH: All dressed up, with nowhere to go...
Date Mon, 20 Aug 2018 05:08:28 GMT
Dear Gumpmeisters,
            
The following 3 notifys should have been sent

*********************************************************** G U M P
[GUMP@vmgump-vm3]: Module xz-java failed
[GUMP@vmgump-vm3]: Project dist-ant (in module ant) failed
[GUMP@vmgump-vm3]: Project rat (in module rat) failed
*********************************************************** G U M P
[GUMP@vmgump-vm3]: Module xz-java failed
To whom it may engage...
        
This is an automated request, but not an unsolicited one. For 
more information please visit http://gump.apache.org/nagged.html, 
and/or contact the folk at general@gump.apache.org.

Module xz-java has an issue affecting its community integration,
 and has been outstanding for 1020 runs.
The current state of this module is 'Failed', with reason 'Update Failed'.

Full details are available at:
    http://vmgump-vm3.apache.org/xz-java/index.html

That said, some information snippets are provided here.

The following annotations (debug/informational/warning/error messages) were provided:
 -INFO- Failed with reason update failed



The following work was performed:
http://vmgump-vm3.apache.org/xz-java/gump_work/update_xz-java.html
Work Name: update_xz-java (Type: Update)
Work ended in a state of : Failed
Elapsed: 1 min 58 secs
Command Line: git fetch --quiet --no-tags origin +refs/heads/master:refs/remotes/origin/master

[Working Directory: /srv/gump/public/workspace/cvs/xz-java]
---------------------------------------------
fatal: unable to access 'http://git.tukaani.org/xz-java.git/': Recv failure: Connection reset
by peer
---------------------------------------------

To subscribe to this information via syndicated feeds:
- RSS: http://vmgump-vm3.apache.org/xz-java/rss.xml
- Atom: http://vmgump-vm3.apache.org/xz-java/atom.xml

============================== Gump Tracking Only ===
Produced by Apache Gump(TM) version 2.3.
Gump Run 20180820000008, vmgump-vm3.apache.org:vmgump:20180820000008
Gump E-mail Identifier (unique within run) #1.

*********************************************************** G U M P
[GUMP@vmgump-vm3]: Project dist-ant (in module ant) failed
To whom it may engage...
        
This is an automated request, but not an unsolicited one. For 
more information please visit http://gump.apache.org/nagged.html, 
and/or contact the folk at general@gump.apache.org.

Project dist-ant has an issue affecting its community integration.
This issue affects 9 projects,
 and has been outstanding for 288 runs.
The current state of this project is 'Failed', with reason 'Build Failed'.
For reference only, the following projects are affected by this:
    - dist-ant :  Java based build tool
    - dist-xalan2 :  Release 2.x of the Xalan-Java XSLT processor
    - forrest-core :  Apache Forrest software is a publishing framework that trans...
    - forrest-test :  Apache Forrest software is a publishing framework that trans...
    - forrest-test-basic :  Apache Forrest software is a publishing framework that trans...
    - forrest-test-deploy-plugins :  Apache Forrest software is a publishing framework that
trans...
    - org.apache.dist-ant :  Java based build tool
    - test-ant :  Java based build tool
    - xml-batik :  Scalable Vector Graphics


Full details are available at:
    http://vmgump-vm3.apache.org/ant/dist-ant/index.html

That said, some information snippets are provided here.

The following annotations (debug/informational/warning/error messages) were provided:
 -INFO- Optional dependency xz failed with reason update failed
 -INFO- Failed with reason build failed
 -INFO- Failed to extract fallback artifacts from Gump Repository



The following work was performed:
http://vmgump-vm3.apache.org/ant/dist-ant/gump_work/build_ant_dist-ant.html
Work Name: build_ant_dist-ant (Type: Build)
Work ended in a state of : Failed
Elapsed: 43 secs
Command Line: /usr/lib/jvm/java-8-oracle/bin/java -Djava.awt.headless=true -Dbuild.sysclasspath=only
-Dsun.zip.disableMemoryMapping=true -Xbootclasspath/p:/srv/gump/public/workspace/xml-xerces2/build/xercesImpl.jar:/srv/gump/public/workspace/xml-commons/java/external/build/xml-apis.jar:/srv/gump/public/workspace/xml-xalan/build/xalan-unbundled.jar
org.apache.tools.ant.Main -Dgump.merge=/srv/gump/public/gump/work/merge.xml -Dchmod.fail=false
-Doptional.jars.whenmanifestonly=create distribution 
[Working Directory: /srv/gump/public/workspace/ant]
CLASSPATH: /usr/lib/jvm/java-8-oracle/lib/tools.jar:/srv/gump/public/workspace/ant/build/classes:/srv/gump/public/workspace/ant/dist/lib/ant.jar:/srv/gump/public/workspace/ant/dist/lib/ant-launcher.jar:/srv/gump/public/workspace/ant/dist/lib/ant-jmf.jar:/srv/gump/public/workspace/ant/dist/lib/ant-junit.jar:/srv/gump/public/workspace/ant/dist/lib/ant-junit4.jar:/srv/gump/public/workspace/ant/dist/lib/ant-swing.jar:/srv/gump/public/workspace/ant/dist/lib/ant-apache-resolver.jar:/srv/gump/public/workspace/ant/dist/lib/ant-apache-xalan2.jar:/srv/gump/public/workspace/xml-commons/java/build/resolver.jar:/srv/gump/public/workspace/xml-commons/java/external/build/xml-apis-ext.jar:/srv/gump/packages/antlr/antlr-3.1.3.jar:/srv/gump/public/workspace/ant-contrib/lib/bcel/jars/bcel-5.1.jar:/srv/gump/public/workspace/apache-commons/logging/target/commons-logging-20180820.jar:/srv/gump/public/workspace/apache-commons/logging/target/commons-logging-api-20180820.jar:/srv/gump/public/workspace/apache
 -commons/net/target/commons-net-3.7-SNAPSHOT.jar:/srv/gump/public/workspace/apache-commons/net/target/commons-net-ftp-3.7-SNAPSHOT.jar:/srv/gump/packages/jaf-1.1ea/activation.jar:/srv/gump/public/workspace/jakarta-bsf/build/lib/bsf.jar:/srv/gump/packages/apache-attic/jakarta-regexp-1.5.jar:/srv/gump/public/workspace/jakarta-servletapi-5/jsr154/dist/lib/servlet-api.jar:/srv/gump/packages/javamail-1.4/mail.jar:/srv/gump/packages/javamail-1.4/lib/mailapi.jar:/srv/gump/packages/jdepend-2.6/lib/jdepend.jar:/srv/gump/packages/jsch/jsch-0.1.45.jar:/srv/gump/public/workspace/junit/target/junit-4.13-SNAPSHOT.jar:/srv/gump/packages/hamcrest/hamcrest-core-1.3.jar:/srv/gump/packages/hamcrest/hamcrest-library-1.3.jar:/srv/gump/public/workspace/logging-log4j-12/target/log4j-1.2.18-SNAPSHOT.jar:/srv/gump/packages/apache-attic/oro-2.0.8.jar:xz-gump-20180819.jar
---------------------------------------------
  [javadoc]                       ^
  [javadoc]   symbol:   class TestIdentifier
  [javadoc]   location: class LegacyXmlResultFormatter
  [javadoc] Standard Doclet version 1.8.0_181
  [javadoc] Building tree for all the packages and classes...
  [javadoc] Building index for all the packages and classes...
  [javadoc] Building index for all classes...
  [javadoc] Generating /srv/gump/public/workspace/ant/build/javadocs/help-doc.html...
  [javadoc] Note: Custom tags that could override future standard tags:  @todo. To avoid potential
overrides, use at least one period character (.) in custom tag names.
  [javadoc] 100 warnings

dist-javadocs:
    [mkdir] Created dir: /srv/gump/public/workspace/ant/apache-ant-1.10.6alpha/manual/api
     [copy] Copying 1349 files to /srv/gump/public/workspace/ant/apache-ant-1.10.6alpha/manual/api

dist-internal:
    [mkdir] Created dir: /srv/gump/public/workspace/ant/apache-ant-1.10.6alpha/etc
     [copy] Copying 1 file to /srv/gump/public/workspace/ant/apache-ant-1.10.6alpha/lib
     [copy] Copying 1 file to /srv/gump/public/workspace/ant/apache-ant-1.10.6alpha/lib
     [copy] Copying 25 files to /srv/gump/public/workspace/ant/apache-ant-1.10.6alpha/lib
     [copy] Copying 1 file to /srv/gump/public/workspace/ant/apache-ant-1.10.6alpha/lib
     [copy] Copying 234 files to /srv/gump/public/workspace/ant/apache-ant-1.10.6alpha/manual
     [copy] Copying 11 files to /srv/gump/public/workspace/ant/apache-ant-1.10.6alpha
     [copy] Copying 16 files to /srv/gump/public/workspace/ant/apache-ant-1.10.6alpha/etc

zip-distribution:
      [zip] Building zip: /srv/gump/public/workspace/ant/distribution/binaries/apache-ant-1.10.6alpha-bin.zip

pkg-distribution:

tar-distribution:
      [tar] Building tar: /srv/gump/public/workspace/ant/distribution/binaries/apache-ant-1.10.6alpha-bin.tar
     [gzip] Building: /srv/gump/public/workspace/ant/distribution/binaries/apache-ant-1.10.6alpha-bin.tar.gz
    [bzip2] Building: /srv/gump/public/workspace/ant/distribution/binaries/apache-ant-1.10.6alpha-bin.tar.bz2

BUILD FAILED
/srv/gump/public/workspace/ant/build.xml:1304: Problem: failed to create task or type xz
Cause: the class org.apache.tools.ant.taskdefs.optional.xz.Xz was not found.
        This looks like one of Ant's optional components.
Action: Check that the appropriate optional JAR exists in
        -ANT_HOME/lib
        -the IDE Ant configuration dialogs

Do not panic, this is a common problem.
The commonest cause is a missing JAR.

This is not a bug; it is a configuration problem


Total time: 42 seconds
---------------------------------------------

To subscribe to this information via syndicated feeds:
- RSS: http://vmgump-vm3.apache.org/ant/dist-ant/rss.xml
- Atom: http://vmgump-vm3.apache.org/ant/dist-ant/atom.xml

============================== Gump Tracking Only ===
Produced by Apache Gump(TM) version 2.3.
Gump Run 20180820000008, vmgump-vm3.apache.org:vmgump:20180820000008
Gump E-mail Identifier (unique within run) #3.

*********************************************************** G U M P
[GUMP@vmgump-vm3]: Project rat (in module rat) failed
To whom it may engage...
        
This is an automated request, but not an unsolicited one. For 
more information please visit http://gump.apache.org/nagged.html, 
and/or contact the folk at general@gump.apache.org.

Project rat has an issue affecting its community integration.
This issue affects 2 projects,
 and has been outstanding for 86 runs.
The current state of this project is 'Failed', with reason 'Build Failed'.
For reference only, the following projects are affected by this:
    - forrest-rat :  Apache Forrest software is a publishing framework that trans...
    - rat :  Release Audit Tool


Full details are available at:
    http://vmgump-vm3.apache.org/rat/rat/index.html

That said, some information snippets are provided here.

The following annotations (debug/informational/warning/error messages) were provided:
 -DEBUG- (Apache Gump generated) Apache Maven Settings in: /srv/gump/public/workspace/rat/gump_mvn_settings.xml
 -INFO- Failed with reason build failed
 -DEBUG- Maven POM in: /srv/gump/public/workspace/rat/pom.xml
 -INFO- Failed to extract fallback artifacts from Gump Repository



The following work was performed:
http://vmgump-vm3.apache.org/rat/rat/gump_work/build_rat_rat.html
Work Name: build_rat_rat (Type: Build)
Work ended in a state of : Failed
Elapsed: 35 secs
Command Line: /opt/maven3/bin/mvn --batch-mode -DskipTests=true -DjavaVersion=1.8 --settings
/srv/gump/public/workspace/rat/gump_mvn_settings.xml package 
[Working Directory: /srv/gump/public/workspace/rat]
M2_HOME: /opt/maven3
---------------------------------------------
[au:antunit]   <taskdef uri="antlib:org.apache.rat.anttasks"
[au:antunit]            resource="org/apache/rat/anttasks/antlib.xml"
[au:antunit]            classpathref="all-classes-needed-for-tests"
[au:antunit]            loaderref="testloader"/>
[au:antunit] 
[au:antunit]   <target name="setUp">
[au:antunit]     <pathconvert dirsep="/" property="file.name">
[au:antunit]       <path>
[au:antunit]         <pathelement location="/srv/gump/public/workspace/rat/apache-rat-tasks/src/test/resources/antunit/report-normal-operation.xml"/>
[au:antunit]       </path>
[au:antunit] '
[au:antunit] 	took 0.07 sec
[au:antunit] Target: testWithALUnknownSentToFile took 0.085 sec
[au:antunit] Target: testWithReportSentToFile took 0.075 sec
[au:antunit] Target: testCustomMatcherSentToFile  caused an ERROR
[au:antunit] 	at line 333, column 43
[au:antunit] 	Message: Unable to find a javac compiler;
[au:antunit] com.sun.tools.javac.Main is not on the classpath.
[au:antunit] Perhaps JAVA_HOME does not point to the JDK.
[au:antunit] It is currently set to "/usr/lib/jvm/java-8-oracle/jre"
[au:antunit] 	took 0.03 sec
[INFO] ------------------------------------------------------------------------
[INFO] Reactor Summary:
[INFO] 
[INFO] Apache Creadur Rat ................................. SUCCESS [  4.083 s]
[INFO] Apache Creadur Rat::API ............................ SUCCESS [  3.076 s]
[INFO] Apache Creadur Rat::Core ........................... SUCCESS [ 12.082 s]
[INFO] Apache Creadur Rat::Plugin4Maven ................... SUCCESS [  9.839 s]
[INFO] Apache Creadur Rat::Tasks4Ant ...................... FAILURE [  3.828 s]
[INFO] Apache Creadur Rat::Command Line ................... SKIPPED
[INFO] ------------------------------------------------------------------------
[INFO] BUILD FAILURE
[INFO] ------------------------------------------------------------------------
[INFO] Total time: 34.146 s
[INFO] Finished at: 2018-08-20T00:58:11+00:00
[INFO] Final Memory: 49M/392M
[INFO] ------------------------------------------------------------------------
[ERROR] Failed to execute goal org.apache.maven.plugins:maven-antrun-plugin:1.8:run (default)
on project apache-rat-tasks: An Ant BuildException has occured: The following error occurred
while executing this line:
[ERROR] /srv/gump/public/workspace/rat/apache-rat-tasks/src/test/resources/antunit/report-normal-operation.xml:59:
Tests failed with 0 failures and 6 errors
[ERROR] around Ant part ...<ant antfile="src/test/resources/antunit/report-normal-operation.xml"
inheritRefs="false" inheritAll="false">... @ 11:112 in /srv/gump/public/workspace/rat/apache-rat-tasks/target/antrun/build-main.xml
[ERROR] -> [Help 1]
[ERROR] 
[ERROR] To see the full stack trace of the errors, re-run Maven with the -e switch.
[ERROR] Re-run Maven using the -X switch to enable full debug logging.
[ERROR] 
[ERROR] For more information about the errors and possible solutions, please read the following
articles:
[ERROR] [Help 1] http://cwiki.apache.org/confluence/display/MAVEN/MojoExecutionException
[ERROR] 
[ERROR] After correcting the problems, you can resume the build with the command
[ERROR]   mvn <goals> -rf :apache-rat-tasks
---------------------------------------------

To subscribe to this information via syndicated feeds:
- RSS: http://vmgump-vm3.apache.org/rat/rat/rss.xml
- Atom: http://vmgump-vm3.apache.org/rat/rat/atom.xml

============================== Gump Tracking Only ===
Produced by Apache Gump(TM) version 2.3.
Gump Run 20180820000008, vmgump-vm3.apache.org:vmgump:20180820000008
Gump E-mail Identifier (unique within run) #4.


--
Apache Gump
http://gump.apache.org/ [Instance: vmgump-vm3]

---------------------------------------------------------------------
To unsubscribe, e-mail: general-unsubscribe@gump.apache.org
For additional commands, e-mail: general-help@gump.apache.org


Mime
View raw message