gump-general mailing list archives

Site index · List index
Message view « Date » · « Thread »
Top « Date » · « Thread »
From g...@vmgump-vm3.apache.org
Subject BATCH: All dressed up, with nowhere to go...
Date Wed, 18 Apr 2018 04:32:09 GMT
Dear Gumpmeisters,
            
The following 4 notifys should have been sent

*********************************************************** G U M P
[GUMP@vmgump-vm3]: Project compress-antlib-test (in module antlibs-compress) failed
[GUMP@vmgump-vm3]: Module commons-beanutils failed
[GUMP@vmgump-vm3]: Project commons-beanutils (in module commons-beanutils) failed
[GUMP@vmgump-vm3]: Project dist-ant (in module ant) failed
*********************************************************** G U M P
[GUMP@vmgump-vm3]: Project compress-antlib-test (in module antlibs-compress) failed
To whom it may engage...
        
This is an automated request, but not an unsolicited one. For 
more information please visit http://gump.apache.org/nagged.html, 
and/or contact the folk at general@gump.apache.org.

Project compress-antlib-test has an issue affecting its community integration.
This issue affects 1 projects,
 and has been outstanding for 280 runs.
The current state of this project is 'Failed', with reason 'Build Failed'.
For reference only, the following projects are affected by this:
    - compress-antlib-test :  The Apache Compress Antlib contains tasks and resources that...


Full details are available at:
    http://vmgump-vm3.apache.org/antlibs-compress/compress-antlib-test/index.html

That said, some information snippets are provided here.

The following annotations (debug/informational/warning/error messages) were provided:
 -DEBUG- Dependency on ant exists, no need to add for property ant.home.
 -INFO- Failed with reason build failed



The following work was performed:
http://vmgump-vm3.apache.org/antlibs-compress/compress-antlib-test/gump_work/build_antlibs-compress_compress-antlib-test.html
Work Name: build_antlibs-compress_compress-antlib-test (Type: Build)
Work ended in a state of : Failed
Elapsed: 3 mins 44 secs
Command Line: /usr/lib/jvm/java-8-oracle/bin/java -Djava.awt.headless=true -Dbuild.sysclasspath=only
-Xbootclasspath/p:/srv/gump/public/workspace/xml-xerces2/build/xercesImpl.jar:/srv/gump/public/workspace/xml-commons/java/external/build/xml-apis.jar
org.apache.tools.ant.Main -Dgump.merge=/srv/gump/public/gump/work/merge.xml -Dant.home=/srv/gump/public/workspace/ant/dist
test 
[Working Directory: /srv/gump/public/workspace/antlibs-compress]
CLASSPATH: /usr/lib/jvm/java-8-oracle/lib/tools.jar:/srv/gump/public/workspace/antlibs-compress/ivy/ivy.jar:/srv/gump/public/workspace/antlibs-compress/build/ant-compress-20180418.jar:/srv/gump/public/workspace/ant/dist/lib/ant.jar:/srv/gump/public/workspace/ant/dist/lib/ant-launcher.jar:/srv/gump/public/workspace/ant/dist/lib/ant-jmf.jar:/srv/gump/public/workspace/ant/dist/lib/ant-junit.jar:/srv/gump/public/workspace/ant/dist/lib/ant-junit4.jar:/srv/gump/public/workspace/ant/dist/lib/ant-swing.jar:/srv/gump/public/workspace/ant/dist/lib/ant-apache-resolver.jar:/srv/gump/public/workspace/ant/dist/lib/ant-apache-xalan2.jar:/srv/gump/public/workspace/commons-compress/target/commons-compress-1.17-SNAPSHOT.jar:/srv/gump/public/workspace/xz-java/build/jar-20180418/xz.jar:/srv/gump/public/workspace/brotli/java/org/brotli/dec/target/dec-0.2.0-SNAPSHOT.jar:/srv/gump/public/workspace/antlibs-antunit/build/ant-antunit-20180418.jar:/srv/gump/public/workspace/xml-commons/java/external/build/xml-
 apis-ext.jar
---------------------------------------------
[au:antunit] Tests run: 3, Failures: 0, Errors: 0, Time elapsed: 0.065 sec
[au:antunit] Target: testResourceProperties took 0.018 sec
[au:antunit] Target: testUncompressSource took 0.022 sec
[au:antunit] Target: testZipSource took 0.02 sec
[au:antunit] Build File: /srv/gump/public/workspace/antlibs-compress/src/tests/antunit/zipfileset-test.xml
[au:antunit] Tests run: 9, Failures: 0, Errors: 0, Time elapsed: 0.079 sec
[au:antunit] Target: testMissingArchiveDoesntMatter took 0.006 sec
[au:antunit] Target: test-refid-check-encoding took 0.004 sec
[au:antunit] Target: test-refid-check-prefix took 0.003 sec
[au:antunit] Target: testMissingArchive took 0.003 sec
[au:antunit] Target: testFailsOnUnreadableEntries took 0.005 sec
[au:antunit] Target: testZipSource took 0.005 sec
[au:antunit] Target: test-refid-modify took 0.026 sec
[au:antunit] Target: testUncompressSource took 0.005 sec
[au:antunit] Target: testSkipUnreadableEntries took 0.007 sec
[au:antunit] Build File: /srv/gump/public/workspace/antlibs-compress/src/tests/antunit/zresource-test.xml
[au:antunit] Tests run: 1, Failures: 0, Errors: 0, Time elapsed: 0.009 sec
[au:antunit] Target: testNativeZ took 0.008 sec
[au:antunit] Build File: /srv/gump/public/workspace/antlibs-compress/src/tests/antunit/zstd-test.xml
[au:antunit] Tests run: 8, Failures: 0, Errors: 3, Time elapsed: 0.05 sec
[au:antunit] Target: testNestedTask  caused an ERROR
[au:antunit] 	at line 91, column 54
[au:antunit] 	Message: java.lang.NoClassDefFoundError: com/github/luben/zstd/ZstdOutputStream
[au:antunit] 	took 0.005 sec
[au:antunit] Target: testFailTwo took 0.005 sec
[au:antunit] Target: testRealTestWithResource  caused an ERROR
[au:antunit] 	at line 76, column 54
[au:antunit] 	Message: java.lang.NoClassDefFoundError: com/github/luben/zstd/ZstdOutputStream
[au:antunit] 	took 0.005 sec
[au:antunit] Target: testFailTwoDests took 0.005 sec
[au:antunit] Target: testRealTest  caused an ERROR
[au:antunit] 	at line 70, column 56
[au:antunit] 	Message: java.lang.NoClassDefFoundError: com/github/luben/zstd/ZstdOutputStream
[au:antunit] 	took 0.004 sec
[au:antunit] Target: testFailNone took 0.004 sec
[au:antunit] Target: testDateCheck took 0.005 sec
[au:antunit] Target: testFailNoDest took 0.004 sec
[au:antunit] Build File: /srv/gump/public/workspace/antlibs-compress/src/tests/antunit/zstdresource-test.xml
[au:antunit] Tests run: 1, Failures: 0, Errors: 1, Time elapsed: 0.008 sec
[au:antunit] Target: testNativeZstd  caused an ERROR
[au:antunit] 	at line 31, column 29
[au:antunit] 	Message: java.lang.NoClassDefFoundError: com/github/luben/zstd/ZstdInputStream
[au:antunit] 	took 0.007 sec

test:

BUILD FAILED
/srv/gump/public/workspace/antlibs-compress/common/build.xml:209: At least one AntUnit test
has failed.

Total time: 3 minutes 44 seconds
---------------------------------------------

To subscribe to this information via syndicated feeds:
- RSS: http://vmgump-vm3.apache.org/antlibs-compress/compress-antlib-test/rss.xml
- Atom: http://vmgump-vm3.apache.org/antlibs-compress/compress-antlib-test/atom.xml

============================== Gump Tracking Only ===
Produced by Apache Gump(TM) version 2.3.
Gump Run 20180418000005, vmgump-vm3.apache.org:vmgump:20180418000005
Gump E-mail Identifier (unique within run) #1.

*********************************************************** G U M P
[GUMP@vmgump-vm3]: Module commons-beanutils failed
To whom it may engage...
        
This is an automated request, but not an unsolicited one. For 
more information please visit http://gump.apache.org/nagged.html, 
and/or contact the folk at general@gump.apache.org.

Module commons-beanutils has an issue affecting its community integration,
 and has been outstanding for 2 runs.
The current state of this module is 'Failed', with reason 'Update Failed'.

Full details are available at:
    http://vmgump-vm3.apache.org/commons-beanutils/index.html

That said, some information snippets are provided here.

The following annotations (debug/informational/warning/error messages) were provided:
 -INFO- Failed with reason update failed



The following work was performed:
http://vmgump-vm3.apache.org/commons-beanutils/gump_work/update_commons-beanutils.html
Work Name: update_commons-beanutils (Type: Update)
Work ended in a state of : Failed
Elapsed: 
Command Line: svn --quiet checkout http://svn.apache.org/repos/asf/ommons/proper/beanutils/tags/BEANUTILS_1_9_3/
--non-interactive commons-beanutils 
[Working Directory: /srv/gump/public/workspace/cvs]
---------------------------------------------
svn: E170000: URL 'http://svn.apache.org/repos/asf/ommons/proper/beanutils/tags/BEANUTILS_1_9_3'
doesn't exist
---------------------------------------------

To subscribe to this information via syndicated feeds:
- RSS: http://vmgump-vm3.apache.org/commons-beanutils/rss.xml
- Atom: http://vmgump-vm3.apache.org/commons-beanutils/atom.xml

============================== Gump Tracking Only ===
Produced by Apache Gump(TM) version 2.3.
Gump Run 20180418000005, vmgump-vm3.apache.org:vmgump:20180418000005
Gump E-mail Identifier (unique within run) #2.

*********************************************************** G U M P
[GUMP@vmgump-vm3]: Project commons-beanutils (in module commons-beanutils) failed
To whom it may engage...
        
This is an automated request, but not an unsolicited one. For 
more information please visit http://gump.apache.org/nagged.html, 
and/or contact the folk at general@gump.apache.org.

Project commons-beanutils has an issue affecting its community integration,
 and has been outstanding for 2 runs.
The current state of this project is 'Failed', with reason 'Update Failed'.

Full details are available at:
    http://vmgump-vm3.apache.org/commons-beanutils/commons-beanutils/index.html

That said, some information snippets are provided here.

The following annotations (debug/informational/warning/error messages) were provided:
 -DEBUG- Sole pom output [pom.xml] identifier set to project name
 -DEBUG- Dependency on junit exists, no need to add for property junit.home.
 -INFO- Failed with reason update failed
 -DEBUG- Extracted fallback artifacts from Gump Repository

To subscribe to this information via syndicated feeds:
- RSS: http://vmgump-vm3.apache.org/commons-beanutils/commons-beanutils/rss.xml
- Atom: http://vmgump-vm3.apache.org/commons-beanutils/commons-beanutils/atom.xml

============================== Gump Tracking Only ===
Produced by Apache Gump(TM) version 2.3.
Gump Run 20180418000005, vmgump-vm3.apache.org:vmgump:20180418000005
Gump E-mail Identifier (unique within run) #3.

*********************************************************** G U M P
[GUMP@vmgump-vm3]: Project dist-ant (in module ant) failed
To whom it may engage...
        
This is an automated request, but not an unsolicited one. For 
more information please visit http://gump.apache.org/nagged.html, 
and/or contact the folk at general@gump.apache.org.

Project dist-ant has an issue affecting its community integration.
This issue affects 9 projects,
 and has been outstanding for 126 runs.
The current state of this project is 'Failed', with reason 'Build Failed'.
For reference only, the following projects are affected by this:
    - dist-ant :  Java based build tool
    - dist-xalan2 :  Release 2.x of the Xalan-Java XSLT processor
    - forrest-core :  Apache Forrest software is a publishing framework that trans...
    - forrest-test :  Apache Forrest software is a publishing framework that trans...
    - forrest-test-basic :  Apache Forrest software is a publishing framework that trans...
    - forrest-test-deploy-plugins :  Apache Forrest software is a publishing framework that
trans...
    - org.apache.dist-ant :  Java based build tool
    - test-ant :  Java based build tool
    - xml-batik :  Scalable Vector Graphics


Full details are available at:
    http://vmgump-vm3.apache.org/ant/dist-ant/index.html

That said, some information snippets are provided here.

The following annotations (debug/informational/warning/error messages) were provided:
 -INFO- Failed with reason build failed
 -INFO- Failed to extract fallback artifacts from Gump Repository



The following work was performed:
http://vmgump-vm3.apache.org/ant/dist-ant/gump_work/build_ant_dist-ant.html
Work Name: build_ant_dist-ant (Type: Build)
Work ended in a state of : Failed
Elapsed: 6 secs
Command Line: /usr/lib/jvm/java-8-oracle/bin/java -Djava.awt.headless=true -Dbuild.sysclasspath=only
-Xbootclasspath/p:/srv/gump/public/workspace/xml-xerces2/build/xercesImpl.jar:/srv/gump/public/workspace/xml-commons/java/external/build/xml-apis.jar:/srv/gump/public/workspace/xml-xalan/build/xalan-unbundled.jar
org.apache.tools.ant.Main -Dgump.merge=/srv/gump/public/gump/work/merge.xml -Dchmod.fail=false
-Doptional.jars.whenmanifestonly=create distribution 
[Working Directory: /srv/gump/public/workspace/ant]
CLASSPATH: /usr/lib/jvm/java-8-oracle/lib/tools.jar:/srv/gump/public/workspace/ant/build/classes:/srv/gump/public/workspace/ant/dist/lib/ant.jar:/srv/gump/public/workspace/ant/dist/lib/ant-launcher.jar:/srv/gump/public/workspace/ant/dist/lib/ant-jmf.jar:/srv/gump/public/workspace/ant/dist/lib/ant-junit.jar:/srv/gump/public/workspace/ant/dist/lib/ant-junit4.jar:/srv/gump/public/workspace/ant/dist/lib/ant-swing.jar:/srv/gump/public/workspace/ant/dist/lib/ant-apache-resolver.jar:/srv/gump/public/workspace/ant/dist/lib/ant-apache-xalan2.jar:/srv/gump/public/workspace/xml-commons/java/build/resolver.jar:/srv/gump/public/workspace/xml-commons/java/external/build/xml-apis-ext.jar:/srv/gump/packages/antlr/antlr-3.1.3.jar:/srv/gump/public/workspace/ant-contrib/lib/bcel/jars/bcel-5.1.jar:/srv/gump/public/workspace/apache-commons/logging/target/commons-logging-20180418.jar:/srv/gump/public/workspace/apache-commons/logging/target/commons-logging-api-20180418.jar:/srv/gump/public/workspace/apache
 -commons/net/target/commons-net-3.7-SNAPSHOT.jar:/srv/gump/public/workspace/apache-commons/net/target/commons-net-ftp-3.7-SNAPSHOT.jar:/srv/gump/packages/jaf-1.1ea/activation.jar:/srv/gump/public/workspace/jakarta-bsf/build/lib/bsf.jar:/srv/gump/packages/apache-attic/jakarta-regexp-1.5.jar:/srv/gump/public/workspace/jakarta-servletapi-5/jsr154/dist/lib/servlet-api.jar:/srv/gump/packages/javamail-1.4/mail.jar:/srv/gump/packages/javamail-1.4/lib/mailapi.jar:/srv/gump/packages/jdepend-2.6/lib/jdepend.jar:/srv/gump/packages/jsch/jsch-0.1.45.jar:/srv/gump/public/workspace/junit/target/junit-4.13-SNAPSHOT.jar:/srv/gump/packages/hamcrest/hamcrest-core-1.3.jar:/srv/gump/public/workspace/logging-log4j-12/target/log4j-1.2.18-SNAPSHOT.jar:/srv/gump/packages/apache-attic/oro-2.0.8.jar:/srv/gump/public/workspace/xz-java/build/jar-20180418/xz.jar
---------------------------------------------
    [javac]                                                ^
    [javac]   symbol:   method containsString(String)
    [javac]   location: class ANTLRTest
    [javac] /srv/gump/public/workspace/ant/src/tests/junit/org/apache/tools/ant/taskdefs/optional/ANTLRTest.java:207:
error: cannot find symbol
    [javac]         assertThat(buildRule.getFullLog(), not(containsString("Skipped grammar
file.")));
    [javac]                                                ^
    [javac]   symbol:   method containsString(String)
    [javac]   location: class ANTLRTest
    [javac] /srv/gump/public/workspace/ant/src/tests/junit/org/apache/tools/ant/taskdefs/optional/jdepend/JDependTest.java:50:
error: cannot find symbol
    [javac]         assertThat(buildRule.getOutput(), containsString("Package: org.apache.tools.ant.util.facade"));
    [javac]                                           ^
    [javac]   symbol:   method containsString(String)
    [javac]   location: class JDependTest
    [javac] /srv/gump/public/workspace/ant/src/tests/junit/org/apache/tools/ant/taskdefs/optional/jdepend/JDependTest.java:59:
error: cannot find symbol
    [javac]         assertThat(buildRule.getOutput(), containsString("<DependsUpon>"));
    [javac]                                           ^
    [javac]   symbol:   method containsString(String)
    [javac]   location: class JDependTest
    [javac] /srv/gump/public/workspace/ant/src/tests/junit/org/apache/tools/ant/taskdefs/optional/jdepend/JDependTest.java:69:
error: cannot find symbol
    [javac]         assertThat(buildRule.getLog(), containsString("Package: org.apache.tools.ant.util.facade"));
    [javac]                                        ^
    [javac]   symbol:   method containsString(String)
    [javac]   location: class JDependTest
    [javac] /srv/gump/public/workspace/ant/src/tests/junit/org/apache/tools/ant/taskdefs/optional/jdepend/JDependTest.java:78:
error: cannot find symbol
    [javac]         assertThat(buildRule.getLog(), containsString("<DependsUpon>"));
    [javac]                                        ^
    [javac]   symbol:   method containsString(String)
    [javac]   location: class JDependTest
    [javac] /srv/gump/public/workspace/ant/src/tests/junit/org/apache/tools/ant/taskdefs/optional/jdepend/JDependTest.java:87:
error: cannot find symbol
    [javac]         assertThat(buildRule.getLog(), containsString("JDepend FAILED - Timed
out"));
    [javac]                                        ^
    [javac]   symbol:   method containsString(String)
    [javac]   location: class JDependTest
    [javac] /srv/gump/public/workspace/ant/src/tests/junit/org/apache/tools/ant/taskdefs/optional/jdepend/JDependTest.java:97:
error: cannot find symbol
    [javac]         assertThat(buildRule.getLog(), containsString("Package: org.apache.tools.ant.util.facade"));
    [javac]                                        ^
    [javac]   symbol:   method containsString(String)
    [javac]   location: class JDependTest
    [javac] /srv/gump/public/workspace/ant/src/tests/junit/org/apache/tools/ant/taskdefs/optional/net/FTPTest.java:216:
error: cannot find symbol
    [javac]         assertThat(buildRule.getLog(), containsString("selectors are not supported
in remote filesets"));
    [javac]                                        ^
    [javac]   symbol:   method containsString(String)
    [javac]   location: class FTPTest
    [javac] 21 errors

BUILD FAILED
/srv/gump/public/workspace/ant/build.xml:1199: The following error occurred while executing
this line:
/srv/gump/public/workspace/ant/build.xml:1545: Compile failed; see the compiler error output
for details.

Total time: 5 seconds
---------------------------------------------

To subscribe to this information via syndicated feeds:
- RSS: http://vmgump-vm3.apache.org/ant/dist-ant/rss.xml
- Atom: http://vmgump-vm3.apache.org/ant/dist-ant/atom.xml

============================== Gump Tracking Only ===
Produced by Apache Gump(TM) version 2.3.
Gump Run 20180418000005, vmgump-vm3.apache.org:vmgump:20180418000005
Gump E-mail Identifier (unique within run) #4.


--
Apache Gump
http://gump.apache.org/ [Instance: vmgump-vm3]

---------------------------------------------------------------------
To unsubscribe, e-mail: general-unsubscribe@gump.apache.org
For additional commands, e-mail: general-help@gump.apache.org


Mime
View raw message