gump-general mailing list archives

Site index · List index
Message view « Date » · « Thread »
Top « Date » · « Thread »
From g...@vmgump-vm3.apache.org
Subject BATCH: All dressed up, with nowhere to go...
Date Tue, 17 Apr 2018 04:33:32 GMT
Dear Gumpmeisters,
            
The following 6 notifys should have been sent

*********************************************************** G U M P
[GUMP@vmgump-vm3]: Project compress-antlib-test (in module antlibs-compress) failed
[GUMP@vmgump-vm3]: Project dist-ant (in module ant) failed
[GUMP@vmgump-vm3]: Project commons-digester (in module commons-digester-2.x) failed
[GUMP@vmgump-vm3]: Project commons-jxpath (in module apache-commons) failed
[GUMP@vmgump-vm3]: Project commons-validator (in module apache-commons) failed
[GUMP@vmgump-vm3]: Project checkstyle (in module checkstyle) failed
*********************************************************** G U M P
[GUMP@vmgump-vm3]: Project compress-antlib-test (in module antlibs-compress) failed
To whom it may engage...
        
This is an automated request, but not an unsolicited one. For 
more information please visit http://gump.apache.org/nagged.html, 
and/or contact the folk at general@gump.apache.org.

Project compress-antlib-test has an issue affecting its community integration.
This issue affects 1 projects,
 and has been outstanding for 276 runs.
The current state of this project is 'Failed', with reason 'Build Failed'.
For reference only, the following projects are affected by this:
    - compress-antlib-test :  The Apache Compress Antlib contains tasks and resources that...


Full details are available at:
    http://vmgump-vm3.apache.org/antlibs-compress/compress-antlib-test/index.html

That said, some information snippets are provided here.

The following annotations (debug/informational/warning/error messages) were provided:
 -DEBUG- Dependency on ant exists, no need to add for property ant.home.
 -INFO- Failed with reason build failed



The following work was performed:
http://vmgump-vm3.apache.org/antlibs-compress/compress-antlib-test/gump_work/build_antlibs-compress_compress-antlib-test.html
Work Name: build_antlibs-compress_compress-antlib-test (Type: Build)
Work ended in a state of : Failed
Elapsed: 3 mins 44 secs
Command Line: /usr/lib/jvm/java-8-oracle/bin/java -Djava.awt.headless=true -Dbuild.sysclasspath=only
-Xbootclasspath/p:/srv/gump/public/workspace/xml-xerces2/build/xercesImpl.jar:/srv/gump/public/workspace/xml-commons/java/external/build/xml-apis.jar
org.apache.tools.ant.Main -Dgump.merge=/srv/gump/public/gump/work/merge.xml -Dant.home=/srv/gump/public/workspace/ant/dist
test 
[Working Directory: /srv/gump/public/workspace/antlibs-compress]
CLASSPATH: /usr/lib/jvm/java-8-oracle/lib/tools.jar:/srv/gump/public/workspace/antlibs-compress/ivy/ivy.jar:/srv/gump/public/workspace/antlibs-compress/build/ant-compress-20180417.jar:/srv/gump/public/workspace/ant/dist/lib/ant.jar:/srv/gump/public/workspace/ant/dist/lib/ant-launcher.jar:/srv/gump/public/workspace/ant/dist/lib/ant-jmf.jar:/srv/gump/public/workspace/ant/dist/lib/ant-junit.jar:/srv/gump/public/workspace/ant/dist/lib/ant-junit4.jar:/srv/gump/public/workspace/ant/dist/lib/ant-swing.jar:/srv/gump/public/workspace/ant/dist/lib/ant-apache-resolver.jar:/srv/gump/public/workspace/ant/dist/lib/ant-apache-xalan2.jar:/srv/gump/public/workspace/commons-compress/target/commons-compress-1.17-SNAPSHOT.jar:/srv/gump/public/workspace/xz-java/build/jar-20180417/xz.jar:/srv/gump/public/workspace/brotli/java/org/brotli/dec/target/dec-0.2.0-SNAPSHOT.jar:/srv/gump/public/workspace/antlibs-antunit/build/ant-antunit-20180417.jar:/srv/gump/public/workspace/xml-commons/java/external/build/xml-
 apis-ext.jar
---------------------------------------------
[au:antunit] [au:antunit] Tests run: 3, Failures: 0, Errors: 0, Time elapsed: 0.067 sec
[au:antunit] [au:antunit] Target: testResourceProperties took 0.019 sec
[au:antunit] [au:antunit] Target: testUncompressSource took 0.023 sec
[au:antunit] [au:antunit] Target: testZipSource took 0.019 sec
[au:antunit] [au:antunit] Build File: /srv/gump/public/workspace/antlibs-compress/src/tests/antunit/zipfileset-test.xml
[au:antunit] [au:antunit] Tests run: 9, Failures: 0, Errors: 0, Time elapsed: 0.095 sec
[au:antunit] [au:antunit] Target: testMissingArchiveDoesntMatter took 0.007 sec
[au:antunit] [au:antunit] Target: test-refid-check-encoding took 0.005 sec
[au:antunit] [au:antunit] Target: test-refid-check-prefix took 0.005 sec
[au:antunit] [au:antunit] Target: testMissingArchive took 0.005 sec
[au:antunit] [au:antunit] Target: testFailsOnUnreadableEntries took 0.006 sec
[au:antunit] [au:antunit] Target: testZipSource took 0.005 sec
[au:antunit] [au:antunit] Target: test-refid-modify took 0.033 sec
[au:antunit] [au:antunit] Target: testUncompressSource took 0.007 sec
[au:antunit] [au:antunit] Target: testSkipUnreadableEntries took 0.005 sec
[au:antunit] [au:antunit] Build File: /srv/gump/public/workspace/antlibs-compress/src/tests/antunit/zresource-test.xml
[au:antunit] [au:antunit] Tests run: 1, Failures: 0, Errors: 0, Time elapsed: 0.007 sec
[au:antunit] [au:antunit] Target: testNativeZ took 0.006 sec
[au:antunit] [au:antunit] Build File: /srv/gump/public/workspace/antlibs-compress/src/tests/antunit/zstd-test.xml
[au:antunit] [au:antunit] Tests run: 8, Failures: 0, Errors: 3, Time elapsed: 0.043 sec
[au:antunit] [au:antunit] Target: testNestedTask  caused an ERROR
[au:antunit] [au:antunit] 	at line 91, column 54
[au:antunit] [au:antunit] 	Message: java.lang.NoClassDefFoundError: com/github/luben/zstd/ZstdOutputStream
[au:antunit] [au:antunit] 	took 0.006 sec
[au:antunit] [au:antunit] Target: testFailTwo took 0.004 sec
[au:antunit] [au:antunit] Target: testRealTestWithResource  caused an ERROR
[au:antunit] [au:antunit] 	at line 76, column 54
[au:antunit] [au:antunit] 	Message: java.lang.NoClassDefFoundError: com/github/luben/zstd/ZstdOutputStream
[au:antunit] [au:antunit] 	took 0.004 sec
[au:antunit] [au:antunit] Target: testFailTwoDests took 0.004 sec
[au:antunit] [au:antunit] Target: testRealTest  caused an ERROR
[au:antunit] [au:antunit] 	at line 70, column 56
[au:antunit] [au:antunit] 	Message: java.lang.NoClassDefFoundError: com/github/luben/zstd/ZstdOutputStream
[au:antunit] [au:antunit] 	took 0.003 sec
[au:antunit] [au:antunit] Target: testFailNone took 0.004 sec
[au:antunit] [au:antunit] Target: testDateCheck took 0.003 sec
[au:antunit] [au:antunit] Target: testFailNoDest took 0.004 sec
[au:antunit] [au:antunit] Build File: /srv/gump/public/workspace/antlibs-compress/src/tests/antunit/zstdresource-test.xml
[au:antunit] [au:antunit] Tests run: 1, Failures: 0, Errors: 1, Time elapsed: 0.009 sec
[au:antunit] [au:antunit] Target: testNativeZstd  caused an ERROR
[au:antunit] [au:antunit] 	at line 31, column 29
[au:antunit] [au:antunit] 	Message: java.lang.NoClassDefFoundError: com/github/luben/zstd/ZstdInputStream
[au:antunit] [au:antunit] 	took 0.009 sec

test:

BUILD FAILED
/srv/gump/public/workspace/antlibs-compress/common/build.xml:209: At least one AntUnit test
has failed.

Total time: 3 minutes 43 seconds
---------------------------------------------

To subscribe to this information via syndicated feeds:
- RSS: http://vmgump-vm3.apache.org/antlibs-compress/compress-antlib-test/rss.xml
- Atom: http://vmgump-vm3.apache.org/antlibs-compress/compress-antlib-test/atom.xml

============================== Gump Tracking Only ===
Produced by Apache Gump(TM) version 2.3.
Gump Run 20180417000006, vmgump-vm3.apache.org:vmgump:20180417000006
Gump E-mail Identifier (unique within run) #1.

*********************************************************** G U M P
[GUMP@vmgump-vm3]: Project dist-ant (in module ant) failed
To whom it may engage...
        
This is an automated request, but not an unsolicited one. For 
more information please visit http://gump.apache.org/nagged.html, 
and/or contact the folk at general@gump.apache.org.

Project dist-ant has an issue affecting its community integration.
This issue affects 9 projects,
 and has been outstanding for 122 runs.
The current state of this project is 'Failed', with reason 'Build Failed'.
For reference only, the following projects are affected by this:
    - dist-ant :  Java based build tool
    - dist-xalan2 :  Release 2.x of the Xalan-Java XSLT processor
    - forrest-core :  Apache Forrest software is a publishing framework that trans...
    - forrest-test :  Apache Forrest software is a publishing framework that trans...
    - forrest-test-basic :  Apache Forrest software is a publishing framework that trans...
    - forrest-test-deploy-plugins :  Apache Forrest software is a publishing framework that
trans...
    - org.apache.dist-ant :  Java based build tool
    - test-ant :  Java based build tool
    - xml-batik :  Scalable Vector Graphics


Full details are available at:
    http://vmgump-vm3.apache.org/ant/dist-ant/index.html

That said, some information snippets are provided here.

The following annotations (debug/informational/warning/error messages) were provided:
 -INFO- Failed with reason build failed
 -INFO- Failed to extract fallback artifacts from Gump Repository



The following work was performed:
http://vmgump-vm3.apache.org/ant/dist-ant/gump_work/build_ant_dist-ant.html
Work Name: build_ant_dist-ant (Type: Build)
Work ended in a state of : Failed
Elapsed: 6 secs
Command Line: /usr/lib/jvm/java-8-oracle/bin/java -Djava.awt.headless=true -Dbuild.sysclasspath=only
-Xbootclasspath/p:/srv/gump/public/workspace/xml-xerces2/build/xercesImpl.jar:/srv/gump/public/workspace/xml-commons/java/external/build/xml-apis.jar:/srv/gump/public/workspace/xml-xalan/build/xalan-unbundled.jar
org.apache.tools.ant.Main -Dgump.merge=/srv/gump/public/gump/work/merge.xml -Dchmod.fail=false
-Doptional.jars.whenmanifestonly=create distribution 
[Working Directory: /srv/gump/public/workspace/ant]
CLASSPATH: /usr/lib/jvm/java-8-oracle/lib/tools.jar:/srv/gump/public/workspace/ant/build/classes:/srv/gump/public/workspace/ant/dist/lib/ant.jar:/srv/gump/public/workspace/ant/dist/lib/ant-launcher.jar:/srv/gump/public/workspace/ant/dist/lib/ant-jmf.jar:/srv/gump/public/workspace/ant/dist/lib/ant-junit.jar:/srv/gump/public/workspace/ant/dist/lib/ant-junit4.jar:/srv/gump/public/workspace/ant/dist/lib/ant-swing.jar:/srv/gump/public/workspace/ant/dist/lib/ant-apache-resolver.jar:/srv/gump/public/workspace/ant/dist/lib/ant-apache-xalan2.jar:/srv/gump/public/workspace/xml-commons/java/build/resolver.jar:/srv/gump/public/workspace/xml-commons/java/external/build/xml-apis-ext.jar:/srv/gump/packages/antlr/antlr-3.1.3.jar:/srv/gump/public/workspace/ant-contrib/lib/bcel/jars/bcel-5.1.jar:/srv/gump/public/workspace/apache-commons/logging/target/commons-logging-20180417.jar:/srv/gump/public/workspace/apache-commons/logging/target/commons-logging-api-20180417.jar:/srv/gump/public/workspace/apache
 -commons/net/target/commons-net-3.7-SNAPSHOT.jar:/srv/gump/public/workspace/apache-commons/net/target/commons-net-ftp-3.7-SNAPSHOT.jar:/srv/gump/packages/jaf-1.1ea/activation.jar:/srv/gump/public/workspace/jakarta-bsf/build/lib/bsf.jar:/srv/gump/packages/apache-attic/jakarta-regexp-1.5.jar:/srv/gump/public/workspace/jakarta-servletapi-5/jsr154/dist/lib/servlet-api.jar:/srv/gump/packages/javamail-1.4/mail.jar:/srv/gump/packages/javamail-1.4/lib/mailapi.jar:/srv/gump/packages/jdepend-2.6/lib/jdepend.jar:/srv/gump/packages/jsch/jsch-0.1.45.jar:/srv/gump/public/workspace/junit/target/junit-4.13-SNAPSHOT.jar:/srv/gump/packages/hamcrest/hamcrest-core-1.3.jar:/srv/gump/public/workspace/logging-log4j-12/target/log4j-1.2.18-SNAPSHOT.jar:/srv/gump/packages/apache-attic/oro-2.0.8.jar:/srv/gump/public/workspace/xz-java/build/jar-20180417/xz.jar
---------------------------------------------
    [javac]     [javac]                                                ^
    [javac]     [javac]   symbol:   method containsString(String)
    [javac]     [javac]   location: class ANTLRTest
    [javac]     [javac] /srv/gump/public/workspace/ant/src/tests/junit/org/apache/tools/ant/taskdefs/optional/ANTLRTest.java:207:
error: cannot find symbol
    [javac]     [javac]         assertThat(buildRule.getFullLog(), not(containsString("Skipped
grammar file.")));
    [javac]     [javac]                                                ^
    [javac]     [javac]   symbol:   method containsString(String)
    [javac]     [javac]   location: class ANTLRTest
    [javac]     [javac] /srv/gump/public/workspace/ant/src/tests/junit/org/apache/tools/ant/taskdefs/optional/jdepend/JDependTest.java:50:
error: cannot find symbol
    [javac]     [javac]         assertThat(buildRule.getOutput(), containsString("Package:
org.apache.tools.ant.util.facade"));
    [javac]     [javac]                                           ^
    [javac]     [javac]   symbol:   method containsString(String)
    [javac]     [javac]   location: class JDependTest
    [javac]     [javac] /srv/gump/public/workspace/ant/src/tests/junit/org/apache/tools/ant/taskdefs/optional/jdepend/JDependTest.java:59:
error: cannot find symbol
    [javac]     [javac]         assertThat(buildRule.getOutput(), containsString("<DependsUpon>"));
    [javac]     [javac]                                           ^
    [javac]     [javac]   symbol:   method containsString(String)
    [javac]     [javac]   location: class JDependTest
    [javac]     [javac] /srv/gump/public/workspace/ant/src/tests/junit/org/apache/tools/ant/taskdefs/optional/jdepend/JDependTest.java:69:
error: cannot find symbol
    [javac]     [javac]         assertThat(buildRule.getLog(), containsString("Package: org.apache.tools.ant.util.facade"));
    [javac]     [javac]                                        ^
    [javac]     [javac]   symbol:   method containsString(String)
    [javac]     [javac]   location: class JDependTest
    [javac]     [javac] /srv/gump/public/workspace/ant/src/tests/junit/org/apache/tools/ant/taskdefs/optional/jdepend/JDependTest.java:78:
error: cannot find symbol
    [javac]     [javac]         assertThat(buildRule.getLog(), containsString("<DependsUpon>"));
    [javac]     [javac]                                        ^
    [javac]     [javac]   symbol:   method containsString(String)
    [javac]     [javac]   location: class JDependTest
    [javac]     [javac] /srv/gump/public/workspace/ant/src/tests/junit/org/apache/tools/ant/taskdefs/optional/jdepend/JDependTest.java:87:
error: cannot find symbol
    [javac]     [javac]         assertThat(buildRule.getLog(), containsString("JDepend FAILED
- Timed out"));
    [javac]     [javac]                                        ^
    [javac]     [javac]   symbol:   method containsString(String)
    [javac]     [javac]   location: class JDependTest
    [javac]     [javac] /srv/gump/public/workspace/ant/src/tests/junit/org/apache/tools/ant/taskdefs/optional/jdepend/JDependTest.java:97:
error: cannot find symbol
    [javac]     [javac]         assertThat(buildRule.getLog(), containsString("Package: org.apache.tools.ant.util.facade"));
    [javac]     [javac]                                        ^
    [javac]     [javac]   symbol:   method containsString(String)
    [javac]     [javac]   location: class JDependTest
    [javac]     [javac] /srv/gump/public/workspace/ant/src/tests/junit/org/apache/tools/ant/taskdefs/optional/net/FTPTest.java:216:
error: cannot find symbol
    [javac]     [javac]         assertThat(buildRule.getLog(), containsString("selectors are
not supported in remote filesets"));
    [javac]     [javac]                                        ^
    [javac]     [javac]   symbol:   method containsString(String)
    [javac]     [javac]   location: class FTPTest
    [javac]     [javac] 21 errors

BUILD FAILED
/srv/gump/public/workspace/ant/build.xml:1199: The following error occurred while executing
this line:
/srv/gump/public/workspace/ant/build.xml:1545: Compile failed; see the compiler error output
for details.

Total time: 5 seconds
---------------------------------------------

To subscribe to this information via syndicated feeds:
- RSS: http://vmgump-vm3.apache.org/ant/dist-ant/rss.xml
- Atom: http://vmgump-vm3.apache.org/ant/dist-ant/atom.xml

============================== Gump Tracking Only ===
Produced by Apache Gump(TM) version 2.3.
Gump Run 20180417000006, vmgump-vm3.apache.org:vmgump:20180417000006
Gump E-mail Identifier (unique within run) #2.

*********************************************************** G U M P
[GUMP@vmgump-vm3]: Project commons-digester (in module commons-digester-2.x) failed
To whom it may engage...
        
This is an automated request, but not an unsolicited one. For 
more information please visit http://gump.apache.org/nagged.html, 
and/or contact the folk at general@gump.apache.org.

Project commons-digester has an issue affecting its community integration.
This issue affects 1 projects,
 and has been outstanding for 3 runs.
The current state of this project is 'Failed', with reason 'Build Failed'.
For reference only, the following projects are affected by this:
    - commons-digester :  XML to Java Object Configuration


Full details are available at:
    http://vmgump-vm3.apache.org/commons-digester-2.x/commons-digester/index.html

That said, some information snippets are provided here.

The following annotations (debug/informational/warning/error messages) were provided:
 -DEBUG- Sole jar output [commons-digester-2.2-SNAPSHOT.jar] identifier set to project name
 -WARNING- Bad *Optional* Dependency. Project: velocity-engine : unknown to *this* workspace
 -DEBUG- (Apache Gump generated) Apache Maven Settings in: /srv/gump/public/workspace/commons-digester-2.x/gump_mvn_settings.xml
 -INFO- Failed with reason build failed
 -DEBUG- Maven POM in: /srv/gump/public/workspace/commons-digester-2.x/pom.xml
 -INFO- Failed to extract fallback artifacts from Gump Repository



The following work was performed:
http://vmgump-vm3.apache.org/commons-digester-2.x/commons-digester/gump_work/build_commons-digester-2.x_commons-digester.html
Work Name: build_commons-digester-2.x_commons-digester (Type: Build)
Work ended in a state of : Failed
Elapsed: 6 secs
Command Line: /opt/maven2/bin/mvn --batch-mode -DskipTests=true --settings /srv/gump/public/workspace/commons-digester-2.x/gump_mvn_settings.xml
package 
[Working Directory: /srv/gump/public/workspace/commons-digester-2.x]
M2_HOME: /opt/maven2
---------------------------------------------
 class SetPropertyRule
/srv/gump/public/workspace/commons-digester-2.x/src/main/java/org/apache/commons/digester/SetPropertyRule.java:[145,18]
error: cannot find symbol

 class SetPropertyRule
/srv/gump/public/workspace/commons-digester-2.x/src/main/java/org/apache/commons/digester/SetPropertyRule.java:[152,16]
error: cannot find symbol

 class SetPropertyRule
/srv/gump/public/workspace/commons-digester-2.x/src/main/java/org/apache/commons/digester/SetPropertyRule.java:[160,8]
error: cannot find symbol

 class SetPropertyRule
/srv/gump/public/workspace/commons-digester-2.x/src/main/java/org/apache/commons/digester/SetRootRule.java:[208,12]
error: cannot find symbol

 class SetRootRule
/srv/gump/public/workspace/commons-digester-2.x/src/main/java/org/apache/commons/digester/SetRootRule.java:[213,12]
error: cannot find symbol

 class SetRootRule
/srv/gump/public/workspace/commons-digester-2.x/src/main/java/org/apache/commons/digester/annotations/utils/AnnotationUtils.java:[98,19]
error: cannot find symbol

 class AnnotationUtils
/srv/gump/public/workspace/commons-digester-2.x/src/main/java/org/apache/commons/digester/BeanPropertySetterRule.java:[185,27]
error: cannot find symbol

 class BeanPropertySetterRule
/srv/gump/public/workspace/commons-digester-2.x/src/main/java/org/apache/commons/digester/BeanPropertySetterRule.java:[186,12]
error: cannot find symbol

 class BeanPropertySetterRule
/srv/gump/public/workspace/commons-digester-2.x/src/main/java/org/apache/commons/digester/BeanPropertySetterRule.java:[187,18]
error: cannot find symbol

 class BeanPropertySetterRule
/srv/gump/public/workspace/commons-digester-2.x/src/main/java/org/apache/commons/digester/BeanPropertySetterRule.java:[194,16]
error: cannot find symbol

 class BeanPropertySetterRule
/srv/gump/public/workspace/commons-digester-2.x/src/main/java/org/apache/commons/digester/BeanPropertySetterRule.java:[202,8]
error: cannot find symbol

 class BeanPropertySetterRule
/srv/gump/public/workspace/commons-digester-2.x/src/main/java/org/apache/commons/digester/plugins/strategies/LoaderFromClass.java:[97,29]
error: cannot find symbol

 class LoaderFromClass
/srv/gump/public/workspace/commons-digester-2.x/src/main/java/org/apache/commons/digester/SetNextRule.java:[215,12]
error: cannot find symbol

 class SetNextRule
/srv/gump/public/workspace/commons-digester-2.x/src/main/java/org/apache/commons/digester/SetNextRule.java:[220,12]
error: cannot find symbol


[INFO] ------------------------------------------------------------------------
[INFO] For more information, run Maven with the -e switch
[INFO] ------------------------------------------------------------------------
[INFO] Total time: 5 seconds
[INFO] Finished at: Tue Apr 17 00:51:49 UTC 2018
[INFO] Final Memory: 30M/325M
[INFO] ------------------------------------------------------------------------
---------------------------------------------

To subscribe to this information via syndicated feeds:
- RSS: http://vmgump-vm3.apache.org/commons-digester-2.x/commons-digester/rss.xml
- Atom: http://vmgump-vm3.apache.org/commons-digester-2.x/commons-digester/atom.xml

============================== Gump Tracking Only ===
Produced by Apache Gump(TM) version 2.3.
Gump Run 20180417000006, vmgump-vm3.apache.org:vmgump:20180417000006
Gump E-mail Identifier (unique within run) #3.

*********************************************************** G U M P
[GUMP@vmgump-vm3]: Project commons-jxpath (in module apache-commons) failed
To whom it may engage...
        
This is an automated request, but not an unsolicited one. For 
more information please visit http://gump.apache.org/nagged.html, 
and/or contact the folk at general@gump.apache.org.

Project commons-jxpath has an issue affecting its community integration.
This issue affects 1 projects,
 and has been outstanding for 3 runs.
The current state of this project is 'Failed', with reason 'Build Failed'.
For reference only, the following projects are affected by this:
    - commons-jxpath :  XPath traversal of JavaBeans


Full details are available at:
    http://vmgump-vm3.apache.org/apache-commons/commons-jxpath/index.html

That said, some information snippets are provided here.

The following annotations (debug/informational/warning/error messages) were provided:
 -DEBUG- Sole jar output [commons-jxpath-*[0-9T].jar] identifier set to project name
 -DEBUG- (Apache Gump generated) Apache Maven Settings in: /srv/gump/public/workspace/apache-commons/jxpath/gump_mvn_settings.xml
 -INFO- Failed with reason build failed
 -DEBUG- Maven POM in: /srv/gump/public/workspace/apache-commons/jxpath/pom.xml
 -DEBUG- Extracted fallback artifacts from Gump Repository



The following work was performed:
http://vmgump-vm3.apache.org/apache-commons/commons-jxpath/gump_work/build_apache-commons_commons-jxpath.html
Work Name: build_apache-commons_commons-jxpath (Type: Build)
Work ended in a state of : Failed
Elapsed: 6 secs
Command Line: /opt/maven3/bin/mvn --batch-mode -DskipTests=true --settings /srv/gump/public/workspace/apache-commons/jxpath/gump_mvn_settings.xml
package 
[Working Directory: /srv/gump/public/workspace/apache-commons/jxpath]
M2_HOME: /opt/maven3
---------------------------------------------
[ERROR] symbol:   class DynaProperty
[ERROR] location: class org.apache.commons.jxpath.ri.model.dynabeans.DynaBeanPropertyPointer
[ERROR] /srv/gump/public/workspace/apache-commons/jxpath/src/main/java/org/apache/commons/jxpath/ri/model/dynabeans/DynaBeanPropertyPointer.java:[194,9]
cannot find symbol
[ERROR] symbol:   class DynaClass
[ERROR] location: class org.apache.commons.jxpath.ri.model.dynabeans.DynaBeanPropertyPointer
[ERROR] /srv/gump/public/workspace/apache-commons/jxpath/src/main/java/org/apache/commons/jxpath/ri/model/dynabeans/DynaBeanPropertyPointer.java:[203,9]
cannot find symbol
[ERROR] symbol:   class DynaClass
[ERROR] location: class org.apache.commons.jxpath.ri.model.dynabeans.DynaBeanPropertyPointer
[ERROR] /srv/gump/public/workspace/apache-commons/jxpath/src/main/java/org/apache/commons/jxpath/ri/model/dynabeans/DynaBeanPropertyPointer.java:[204,9]
cannot find symbol
[ERROR] symbol:   class DynaProperty
[ERROR] location: class org.apache.commons.jxpath.ri.model.dynabeans.DynaBeanPropertyPointer
[ERROR] /srv/gump/public/workspace/apache-commons/jxpath/src/main/java/org/apache/commons/jxpath/ri/model/dynabeans/DynaBeanPropertyPointer.java:[260,9]
cannot find symbol
[ERROR] symbol:   class DynaClass
[ERROR] location: class org.apache.commons.jxpath.ri.model.dynabeans.DynaBeanPropertyPointer
[ERROR] /srv/gump/public/workspace/apache-commons/jxpath/src/main/java/org/apache/commons/jxpath/ri/model/dynabeans/DynaBeanPropertyPointer.java:[261,9]
cannot find symbol
[ERROR] symbol:   class DynaProperty
[ERROR] location: class org.apache.commons.jxpath.ri.model.dynabeans.DynaBeanPropertyPointer
[ERROR] /srv/gump/public/workspace/apache-commons/jxpath/src/main/java/org/apache/commons/jxpath/ri/model/dynabeans/DynaBeanPointerFactory.java:[45,32]
cannot find symbol
[ERROR] symbol:   class DynaBean
[ERROR] location: class org.apache.commons.jxpath.ri.model.dynabeans.DynaBeanPointerFactory
[ERROR] /srv/gump/public/workspace/apache-commons/jxpath/src/main/java/org/apache/commons/jxpath/ri/model/dynabeans/DynaBeanPointerFactory.java:[45,70]
cannot find symbol
[ERROR] symbol:   class DynaBean
[ERROR] location: class org.apache.commons.jxpath.ri.model.dynabeans.DynaBeanPointerFactory
[ERROR] /srv/gump/public/workspace/apache-commons/jxpath/src/main/java/org/apache/commons/jxpath/ri/model/dynabeans/DynaBeanPointerFactory.java:[50,32]
cannot find symbol
[ERROR] symbol:   class DynaBean
[ERROR] location: class org.apache.commons.jxpath.ri.model.dynabeans.DynaBeanPointerFactory
[ERROR] /srv/gump/public/workspace/apache-commons/jxpath/src/main/java/org/apache/commons/jxpath/ri/model/dynabeans/DynaBeanPointerFactory.java:[50,78]
cannot find symbol
[ERROR] symbol:   class DynaBean
[ERROR] location: class org.apache.commons.jxpath.ri.model.dynabeans.DynaBeanPointerFactory
[ERROR] /srv/gump/public/workspace/apache-commons/jxpath/src/main/java/org/apache/commons/jxpath/ri/model/dynabeans/StrictLazyDynaBeanPointerFactory.java:[79,30]
cannot find symbol
[ERROR] symbol: class LazyDynaClass
[ERROR] /srv/gump/public/workspace/apache-commons/jxpath/src/main/java/org/apache/commons/jxpath/ri/model/dynabeans/StrictLazyDynaBeanPointerFactory.java:[97,34]
cannot find symbol
[ERROR] symbol:   class LazyDynaBean
[ERROR] location: class org.apache.commons.jxpath.ri.model.dynabeans.StrictLazyDynaBeanPointerFactory
[ERROR] /srv/gump/public/workspace/apache-commons/jxpath/src/main/java/org/apache/commons/jxpath/ri/model/dynabeans/StrictLazyDynaBeanPointerFactory.java:[98,18]
cannot find symbol
[ERROR] symbol:   class LazyDynaBean
[ERROR] location: class org.apache.commons.jxpath.ri.model.dynabeans.StrictLazyDynaBeanPointerFactory
[ERROR] /srv/gump/public/workspace/apache-commons/jxpath/src/main/java/org/apache/commons/jxpath/ri/model/dynabeans/StrictLazyDynaBeanPointerFactory.java:[105,34]
cannot find symbol
[ERROR] symbol:   class LazyDynaBean
[ERROR] location: class org.apache.commons.jxpath.ri.model.dynabeans.StrictLazyDynaBeanPointerFactory
[ERROR] /srv/gump/public/workspace/apache-commons/jxpath/src/main/java/org/apache/commons/jxpath/ri/model/dynabeans/StrictLazyDynaBeanPointerFactory.java:[106,18]
cannot find symbol
[ERROR] symbol:   class LazyDynaBean
[ERROR] location: class org.apache.commons.jxpath.ri.model.dynabeans.StrictLazyDynaBeanPointerFactory
[ERROR] -> [Help 1]
[ERROR] 
[ERROR] To see the full stack trace of the errors, re-run Maven with the -e switch.
[ERROR] Re-run Maven using the -X switch to enable full debug logging.
[ERROR] 
[ERROR] For more information about the errors and possible solutions, please read the following
articles:
[ERROR] [Help 1] http://cwiki.apache.org/confluence/display/MAVEN/MojoFailureException
---------------------------------------------

To subscribe to this information via syndicated feeds:
- RSS: http://vmgump-vm3.apache.org/apache-commons/commons-jxpath/rss.xml
- Atom: http://vmgump-vm3.apache.org/apache-commons/commons-jxpath/atom.xml

============================== Gump Tracking Only ===
Produced by Apache Gump(TM) version 2.3.
Gump Run 20180417000006, vmgump-vm3.apache.org:vmgump:20180417000006
Gump E-mail Identifier (unique within run) #4.

*********************************************************** G U M P
[GUMP@vmgump-vm3]: Project commons-validator (in module apache-commons) failed
To whom it may engage...
        
This is an automated request, but not an unsolicited one. For 
more information please visit http://gump.apache.org/nagged.html, 
and/or contact the folk at general@gump.apache.org.

Project commons-validator has an issue affecting its community integration.
This issue affects 2 projects,
 and has been outstanding for 3 runs.
The current state of this project is 'Failed', with reason 'Build Failed'.
For reference only, the following projects are affected by this:
    - commons-validator :  Validation Framework
    - xmlgraphics-commons-test :  Apache XML Graphics Commons - Common Components for Batik
an...


Full details are available at:
    http://vmgump-vm3.apache.org/apache-commons/commons-validator/index.html

That said, some information snippets are provided here.

The following annotations (debug/informational/warning/error messages) were provided:
 -DEBUG- Sole jar output [commons-validator-*[0-9T].jar] identifier set to project name
 -INFO- Optional dependency commons-digester failed with reason build failed
 -DEBUG- (Apache Gump generated) Apache Maven Settings in: /srv/gump/public/workspace/apache-commons/validator/gump_mvn_settings.xml
 -INFO- Failed with reason build failed
 -DEBUG- Maven POM in: /srv/gump/public/workspace/apache-commons/validator/pom.xml
 -DEBUG- Extracted fallback artifacts from Gump Repository



The following work was performed:
http://vmgump-vm3.apache.org/apache-commons/commons-validator/gump_work/build_apache-commons_commons-validator.html
Work Name: build_apache-commons_commons-validator (Type: Build)
Work ended in a state of : Failed
Elapsed: 5 secs
Command Line: /opt/maven3/bin/mvn --batch-mode -DskipTests=true --settings /srv/gump/public/workspace/apache-commons/validator/gump_mvn_settings.xml
package 
[Working Directory: /srv/gump/public/workspace/apache-commons/validator]
M2_HOME: /opt/maven3
---------------------------------------------
[INFO] Copying 2 resources to META-INF
[INFO] Copying 8 resources
[INFO] 
[INFO] --- maven-compiler-plugin:3.7.0:compile (default-compile) @ commons-validator ---
[INFO] Changes detected - recompiling the module!
[INFO] Compiling 64 source files to /srv/gump/public/workspace/apache-commons/validator/target/classes
[INFO] /srv/gump/public/workspace/apache-commons/validator/src/main/java/org/apache/commons/validator/Field.java:
Some input files use or override a deprecated API.
[INFO] /srv/gump/public/workspace/apache-commons/validator/src/main/java/org/apache/commons/validator/Field.java:
Recompile with -Xlint:deprecation for details.
[INFO] -------------------------------------------------------------
[ERROR] COMPILATION ERROR : 
[INFO] -------------------------------------------------------------
[ERROR] /srv/gump/public/workspace/apache-commons/validator/src/main/java/org/apache/commons/validator/Field.java:[31,36]
package org.apache.commons.beanutils does not exist
[ERROR] /srv/gump/public/workspace/apache-commons/validator/src/main/java/org/apache/commons/validator/util/ValidatorUtils.java:[26,36]
package org.apache.commons.beanutils does not exist
[ERROR] /srv/gump/public/workspace/apache-commons/validator/src/main/java/org/apache/commons/validator/Field.java:[763,17]
cannot find symbol
  symbol:   variable PropertyUtils
  location: class org.apache.commons.validator.Field
[ERROR] /srv/gump/public/workspace/apache-commons/validator/src/main/java/org/apache/commons/validator/Field.java:[796,17]
cannot find symbol
  symbol:   variable PropertyUtils
  location: class org.apache.commons.validator.Field
[ERROR] /srv/gump/public/workspace/apache-commons/validator/src/main/java/org/apache/commons/validator/util/ValidatorUtils.java:[105,21]
cannot find symbol
  symbol:   variable PropertyUtils
  location: class org.apache.commons.validator.util.ValidatorUtils
[INFO] 5 errors 
[INFO] -------------------------------------------------------------
[INFO] ------------------------------------------------------------------------
[INFO] BUILD FAILURE
[INFO] ------------------------------------------------------------------------
[INFO] Total time: 4.261 s
[INFO] Finished at: 2018-04-17T00:54:48+00:00
[INFO] Final Memory: 25M/238M
[INFO] ------------------------------------------------------------------------
[ERROR] Failed to execute goal org.apache.maven.plugins:maven-compiler-plugin:3.7.0:compile
(default-compile) on project commons-validator: Compilation failure: Compilation failure:
[ERROR] /srv/gump/public/workspace/apache-commons/validator/src/main/java/org/apache/commons/validator/Field.java:[31,36]
package org.apache.commons.beanutils does not exist
[ERROR] /srv/gump/public/workspace/apache-commons/validator/src/main/java/org/apache/commons/validator/util/ValidatorUtils.java:[26,36]
package org.apache.commons.beanutils does not exist
[ERROR] /srv/gump/public/workspace/apache-commons/validator/src/main/java/org/apache/commons/validator/Field.java:[763,17]
cannot find symbol
[ERROR] symbol:   variable PropertyUtils
[ERROR] location: class org.apache.commons.validator.Field
[ERROR] /srv/gump/public/workspace/apache-commons/validator/src/main/java/org/apache/commons/validator/Field.java:[796,17]
cannot find symbol
[ERROR] symbol:   variable PropertyUtils
[ERROR] location: class org.apache.commons.validator.Field
[ERROR] /srv/gump/public/workspace/apache-commons/validator/src/main/java/org/apache/commons/validator/util/ValidatorUtils.java:[105,21]
cannot find symbol
[ERROR] symbol:   variable PropertyUtils
[ERROR] location: class org.apache.commons.validator.util.ValidatorUtils
[ERROR] -> [Help 1]
[ERROR] 
[ERROR] To see the full stack trace of the errors, re-run Maven with the -e switch.
[ERROR] Re-run Maven using the -X switch to enable full debug logging.
[ERROR] 
[ERROR] For more information about the errors and possible solutions, please read the following
articles:
[ERROR] [Help 1] http://cwiki.apache.org/confluence/display/MAVEN/MojoFailureException
---------------------------------------------

To subscribe to this information via syndicated feeds:
- RSS: http://vmgump-vm3.apache.org/apache-commons/commons-validator/rss.xml
- Atom: http://vmgump-vm3.apache.org/apache-commons/commons-validator/atom.xml

============================== Gump Tracking Only ===
Produced by Apache Gump(TM) version 2.3.
Gump Run 20180417000006, vmgump-vm3.apache.org:vmgump:20180417000006
Gump E-mail Identifier (unique within run) #5.

*********************************************************** G U M P
[GUMP@vmgump-vm3]: Project checkstyle (in module checkstyle) failed
To whom it may engage...
        
This is an automated request, but not an unsolicited one. For 
more information please visit http://gump.apache.org/nagged.html, 
and/or contact the folk at general@gump.apache.org.

Project checkstyle has an issue affecting its community integration.
This issue affects 4 projects,
 and has been outstanding for 3 runs.
The current state of this project is 'Failed', with reason 'Build Failed'.
For reference only, the following projects are affected by this:
    - checkstyle :  Java style checker
    - tomcat-tc7.0.x-validate :  Tomcat 7.x, a web server implementing Java Servlet 3.0,
    ...
    - tomcat-tc8.0.x-validate :  Tomcat 8.x, a web server implementing the Java Servlet 3.1,
...
    - tomcat-trunk-validate :  Tomcat 9.x, a web server implementing the Java Servlet 4.0,
...


Full details are available at:
    http://vmgump-vm3.apache.org/checkstyle/checkstyle/index.html

That said, some information snippets are provided here.

The following annotations (debug/informational/warning/error messages) were provided:
 -INFO- Optional dependency commons-validator failed with reason build failed
 -DEBUG- (Apache Gump generated) Apache Maven Settings in: /srv/gump/public/workspace/checkstyle/gump_mvn_settings.xml
 -INFO- Failed with reason build failed
 -DEBUG- Maven POM in: /srv/gump/public/workspace/checkstyle/pom.xml
 -INFO- Failed to extract fallback artifacts from Gump Repository



The following work was performed:
http://vmgump-vm3.apache.org/checkstyle/checkstyle/gump_work/build_checkstyle_checkstyle.html
Work Name: build_checkstyle_checkstyle (Type: Build)
Work ended in a state of : Failed
Elapsed: 1 min 20 secs
Command Line: /opt/maven3/bin/mvn --batch-mode -Dcheckstyle.ant.skip=true -Dcheckstyle.skip=true
-Dpmd.skip=true -Dfindbugs.skip=true -Dcobertura.skip=true -DskipTests=true --settings /srv/gump/public/workspace/checkstyle/gump_mvn_settings.xml
install 
[Working Directory: /srv/gump/public/workspace/checkstyle]
M2_HOME: /opt/maven3
---------------------------------------------
[ERROR] location: class com.puppycrawl.tools.checkstyle.api.AutomaticBean
[ERROR] /srv/gump/public/workspace/checkstyle/src/main/java/com/puppycrawl/tools/checkstyle/api/AutomaticBean.java:[139,58]
cannot find symbol
[ERROR] symbol:   class IntegerConverter
[ERROR] location: class com.puppycrawl.tools.checkstyle.api.AutomaticBean
[ERROR] /srv/gump/public/workspace/checkstyle/src/main/java/com/puppycrawl/tools/checkstyle/api/AutomaticBean.java:[141,26]
cannot find symbol
[ERROR] symbol:   class LongConverter
[ERROR] location: class com.puppycrawl.tools.checkstyle.api.AutomaticBean
[ERROR] /srv/gump/public/workspace/checkstyle/src/main/java/com/puppycrawl/tools/checkstyle/api/AutomaticBean.java:[142,26]
cannot find symbol
[ERROR] symbol:   class LongConverter
[ERROR] location: class com.puppycrawl.tools.checkstyle.api.AutomaticBean
[ERROR] /srv/gump/public/workspace/checkstyle/src/main/java/com/puppycrawl/tools/checkstyle/api/AutomaticBean.java:[143,26]
cannot find symbol
[ERROR] symbol:   class ArrayConverter
[ERROR] location: class com.puppycrawl.tools.checkstyle.api.AutomaticBean
[ERROR] /srv/gump/public/workspace/checkstyle/src/main/java/com/puppycrawl/tools/checkstyle/api/AutomaticBean.java:[143,59]
cannot find symbol
[ERROR] symbol:   class LongConverter
[ERROR] location: class com.puppycrawl.tools.checkstyle.api.AutomaticBean
[ERROR] /srv/gump/public/workspace/checkstyle/src/main/java/com/puppycrawl/tools/checkstyle/api/AutomaticBean.java:[145,26]
cannot find symbol
[ERROR] symbol:   class ShortConverter
[ERROR] location: class com.puppycrawl.tools.checkstyle.api.AutomaticBean
[ERROR] /srv/gump/public/workspace/checkstyle/src/main/java/com/puppycrawl/tools/checkstyle/api/AutomaticBean.java:[146,26]
cannot find symbol
[ERROR] symbol:   class ShortConverter
[ERROR] location: class com.puppycrawl.tools.checkstyle.api.AutomaticBean
[ERROR] /srv/gump/public/workspace/checkstyle/src/main/java/com/puppycrawl/tools/checkstyle/api/AutomaticBean.java:[147,26]
cannot find symbol
[ERROR] symbol:   class ArrayConverter
[ERROR] location: class com.puppycrawl.tools.checkstyle.api.AutomaticBean
[ERROR] /srv/gump/public/workspace/checkstyle/src/main/java/com/puppycrawl/tools/checkstyle/api/AutomaticBean.java:[147,60]
cannot find symbol
[ERROR] symbol:   class ShortConverter
[ERROR] location: class com.puppycrawl.tools.checkstyle.api.AutomaticBean
[ERROR] /srv/gump/public/workspace/checkstyle/src/main/java/com/puppycrawl/tools/checkstyle/api/AutomaticBean.java:[213,15]
cannot find symbol
[ERROR] symbol:   class BeanUtilsBean
[ERROR] location: class com.puppycrawl.tools.checkstyle.api.AutomaticBean
[ERROR] /srv/gump/public/workspace/checkstyle/src/main/java/com/puppycrawl/tools/checkstyle/api/AutomaticBean.java:[221,25]
cannot find symbol
[ERROR] symbol:   variable PropertyUtils
[ERROR] location: class com.puppycrawl.tools.checkstyle.api.AutomaticBean
[ERROR] /srv/gump/public/workspace/checkstyle/src/main/java/com/puppycrawl/tools/checkstyle/api/AutomaticBean.java:[241,49]
cannot find symbol
[ERROR] symbol:   class ConversionException
[ERROR] location: class com.puppycrawl.tools.checkstyle.api.AutomaticBean
[ERROR] /srv/gump/public/workspace/checkstyle/src/main/java/com/puppycrawl/tools/checkstyle/api/AutomaticBean.java:[297,9]
method does not override or implement a method from a supertype
[ERROR] /srv/gump/public/workspace/checkstyle/src/main/java/com/puppycrawl/tools/checkstyle/api/AutomaticBean.java:[308,9]
method does not override or implement a method from a supertype
[ERROR] /srv/gump/public/workspace/checkstyle/src/main/java/com/puppycrawl/tools/checkstyle/api/AutomaticBean.java:[319,9]
method does not override or implement a method from a supertype
[ERROR] /srv/gump/public/workspace/checkstyle/src/main/java/com/puppycrawl/tools/checkstyle/api/AutomaticBean.java:[330,9]
method does not override or implement a method from a supertype
[ERROR] /srv/gump/public/workspace/checkstyle/src/main/java/com/puppycrawl/tools/checkstyle/api/AutomaticBean.java:[357,9]
method does not override or implement a method from a supertype
[ERROR] /srv/gump/public/workspace/checkstyle/src/main/java/com/puppycrawl/tools/checkstyle/api/AutomaticBean.java:[382,9]
method does not override or implement a method from a supertype
[ERROR] -> [Help 1]
[ERROR] 
[ERROR] To see the full stack trace of the errors, re-run Maven with the -e switch.
[ERROR] Re-run Maven using the -X switch to enable full debug logging.
[ERROR] 
[ERROR] For more information about the errors and possible solutions, please read the following
articles:
[ERROR] [Help 1] http://cwiki.apache.org/confluence/display/MAVEN/MojoFailureException
---------------------------------------------

To subscribe to this information via syndicated feeds:
- RSS: http://vmgump-vm3.apache.org/checkstyle/checkstyle/rss.xml
- Atom: http://vmgump-vm3.apache.org/checkstyle/checkstyle/atom.xml

============================== Gump Tracking Only ===
Produced by Apache Gump(TM) version 2.3.
Gump Run 20180417000006, vmgump-vm3.apache.org:vmgump:20180417000006
Gump E-mail Identifier (unique within run) #6.


--
Apache Gump
http://gump.apache.org/ [Instance: vmgump-vm3]


---------------------------------------------------------------------
To unsubscribe, e-mail: general-unsubscribe@gump.apache.org
For additional commands, e-mail: general-help@gump.apache.org


Mime
View raw message