gump-general mailing list archives

Site index · List index
Message view « Date » · « Thread »
Top « Date » · « Thread »
From g...@vmgump-vm3.apache.org
Subject BATCH: All dressed up, with nowhere to go...
Date Mon, 16 Oct 2017 22:25:56 GMT
Dear Gumpmeisters,
            
The following 1 notifys should have been sent

*********************************************************** G U M P
[GUMP@vmgump-vm3]: Project checkstyle (in module checkstyle) failed
*********************************************************** G U M P
[GUMP@vmgump-vm3]: Project checkstyle (in module checkstyle) failed
To whom it may engage...
        
This is an automated request, but not an unsolicited one. For 
more information please visit http://gump.apache.org/nagged.html, 
and/or contact the folk at general@gump.apache.org.

Project checkstyle has an issue affecting its community integration.
This issue affects 5 projects.
The current state of this project is 'Failed', with reason 'Build Failed'.
For reference only, the following projects are affected by this:
    - checkstyle :  Java style checker
    - tomcat-tc7.0.x-validate :  Tomcat 7.x, a web server implementing Java Servlet 3.0,
    ...
    - tomcat-tc8.0.x-validate :  Tomcat 8.x, a web server implementing the Java Servlet 3.1,
...
    - tomcat-trunk-validate :  Tomcat 9.x, a web server implementing the Java Servlet 4.0,
...
    - xmlgraphics-commons-test :  Apache XML Graphics Commons - Common Components for Batik
an...


Full details are available at:
    http://vmgump-vm3.apache.org/checkstyle/checkstyle/index.html

That said, some information snippets are provided here.

The following annotations (debug/informational/warning/error messages) were provided:
 -DEBUG- (Apache Gump generated) Apache Maven Settings in: /srv/gump/public/workspace/checkstyle/gump_mvn_settings.xml
 -INFO- Failed with reason build failed
 -DEBUG- Maven POM in: /srv/gump/public/workspace/checkstyle/pom.xml
 -INFO- Failed to extract fallback artifacts from Gump Repository



The following work was performed:
http://vmgump-vm3.apache.org/checkstyle/checkstyle/gump_work/build_checkstyle_checkstyle.html
Work Name: build_checkstyle_checkstyle (Type: Build)
Work ended in a state of : Failed
Elapsed: 3 mins 21 secs
Command Line: /opt/maven3/bin/mvn --batch-mode -Dcheckstyle.ant.skip=true -Dcheckstyle.skip=true
-Dpmd.skip=true -Dfindbugs.skip=true -Dcobertura.skip=true -DskipTests=true --settings /srv/gump/public/workspace/checkstyle/gump_mvn_settings.xml
install 
[Working Directory: /srv/gump/public/workspace/checkstyle]
M2_HOME: /opt/maven3
---------------------------------------------
[INFO] Downloading: http://localhost:8192/maven2/com/puppycrawl/tools/checkstyle/8.3/checkstyle-8.3.jar
[INFO] Downloaded: http://localhost:8192/maven2/com/puppycrawl/tools/checkstyle/8.3/checkstyle-8.3.jar
(1207 KB at 16531.2 KB/sec)
[INFO] 
[INFO] --- maven-failsafe-plugin:2.20.1:verify (verify) @ checkstyle ---
[INFO] Tests are skipped.
[INFO] 
[INFO] --- maven-antrun-plugin:1.8:run (ant-phase-verify) @ checkstyle ---
[INFO] Executing tasks

main:

execute:
[INFO] Executed tasks
[INFO] 
[INFO] >>> maven-pmd-plugin:3.8:check (default) > :pmd @ checkstyle >>>
[INFO] 
[INFO] --- maven-pmd-plugin:3.8:pmd (pmd) @ checkstyle ---
[INFO] Downloading: https://oss.sonatype.org/content/repositories/codehaus-snapshots/net/sourceforge/pmd/pmd-java/5.8.1/pmd-java-5.8.1.pom
[INFO] Downloading: http://sevntu-checkstyle.github.io/sevntu.checkstyle/maven2/net/sourceforge/pmd/pmd-java/5.8.1/pmd-java-5.8.1.pom
[INFO] Downloading: http://localhost:8192/maven2/net/sourceforge/pmd/pmd-java/5.8.1/pmd-java-5.8.1.pom
[INFO] Downloaded: http://localhost:8192/maven2/net/sourceforge/pmd/pmd-java/5.8.1/pmd-java-5.8.1.pom
(7 KB at 238.2 KB/sec)
[INFO] Downloading: https://oss.sonatype.org/content/repositories/codehaus-snapshots/net/sourceforge/pmd/pmd/5.8.1/pmd-5.8.1.pom
[INFO] Downloading: http://sevntu-checkstyle.github.io/sevntu.checkstyle/maven2/net/sourceforge/pmd/pmd/5.8.1/pmd-5.8.1.pom
[INFO] Downloading: http://localhost:8192/maven2/net/sourceforge/pmd/pmd/5.8.1/pmd-5.8.1.pom
[INFO] Downloaded: http://localhost:8192/maven2/net/sourceforge/pmd/pmd/5.8.1/pmd-5.8.1.pom
(41 KB at 1571.8 KB/sec)
[INFO] Downloading: https://oss.sonatype.org/content/repositories/codehaus-snapshots/net/sourceforge/pmd/pmd-core/5.8.1/pmd-core-5.8.1.pom
[INFO] Downloading: http://sevntu-checkstyle.github.io/sevntu.checkstyle/maven2/net/sourceforge/pmd/pmd-core/5.8.1/pmd-core-5.8.1.pom
[INFO] Downloading: http://localhost:8192/maven2/net/sourceforge/pmd/pmd-core/5.8.1/pmd-core-5.8.1.pom
[INFO] Downloaded: http://localhost:8192/maven2/net/sourceforge/pmd/pmd-core/5.8.1/pmd-core-5.8.1.pom
(6 KB at 16.6 KB/sec)
[INFO] Downloading: https://oss.sonatype.org/content/repositories/codehaus-snapshots/net/sourceforge/pmd/pmd-javascript/5.8.1/pmd-javascript-5.8.1.pom
[INFO] Downloading: http://sevntu-checkstyle.github.io/sevntu.checkstyle/maven2/net/sourceforge/pmd/pmd-javascript/5.8.1/pmd-javascript-5.8.1.pom
[INFO] Downloading: http://localhost:8192/maven2/net/sourceforge/pmd/pmd-javascript/5.8.1/pmd-javascript-5.8.1.pom
[INFO] Downloaded: http://localhost:8192/maven2/net/sourceforge/pmd/pmd-javascript/5.8.1/pmd-javascript-5.8.1.pom
(5 KB at 195.8 KB/sec)
[INFO] Downloading: https://oss.sonatype.org/content/repositories/codehaus-snapshots/net/sourceforge/pmd/pmd-jsp/5.8.1/pmd-jsp-5.8.1.pom
[INFO] Downloading: http://sevntu-checkstyle.github.io/sevntu.checkstyle/maven2/net/sourceforge/pmd/pmd-jsp/5.8.1/pmd-jsp-5.8.1.pom
[INFO] Downloading: http://localhost:8192/maven2/net/sourceforge/pmd/pmd-jsp/5.8.1/pmd-jsp-5.8.1.pom
[INFO] ------------------------------------------------------------------------
[INFO] BUILD FAILURE
[INFO] ------------------------------------------------------------------------
[INFO] Total time: 03:20 min
[INFO] Finished at: 2017-10-16T19:11:10+00:00
[INFO] Final Memory: 56M/436M
[INFO] ------------------------------------------------------------------------
[ERROR] Failed to execute goal org.apache.maven.plugins:maven-pmd-plugin:3.8:pmd (pmd) on
project checkstyle: Execution pmd of goal org.apache.maven.plugins:maven-pmd-plugin:3.8:pmd
failed: Plugin org.apache.maven.plugins:maven-pmd-plugin:3.8 or one of its dependencies could
not be resolved: Failed to collect dependencies at org.apache.maven.plugins:maven-pmd-plugin:jar:3.8
-> net.sourceforge.pmd:pmd-jsp:jar:5.8.1: Failed to read artifact descriptor for net.sourceforge.pmd:pmd-jsp:jar:5.8.1:
Could not transfer artifact net.sourceforge.pmd:pmd-jsp:pom:5.8.1 from/to gump-central (http://localhost:8192/maven2):
TransferFailedException: ClientProtocolException: Status line contains invalid status code:
HTTP/1.1 :01 :01 -> [Help 1]
[ERROR] 
[ERROR] To see the full stack trace of the errors, re-run Maven with the -e switch.
[ERROR] Re-run Maven using the -X switch to enable full debug logging.
[ERROR] 
[ERROR] For more information about the errors and possible solutions, please read the following
articles:
[ERROR] [Help 1] http://cwiki.apache.org/confluence/display/MAVEN/PluginResolutionException
---------------------------------------------

To subscribe to this information via syndicated feeds:
- RSS: http://vmgump-vm3.apache.org/checkstyle/checkstyle/rss.xml
- Atom: http://vmgump-vm3.apache.org/checkstyle/checkstyle/atom.xml

============================== Gump Tracking Only ===
Produced by Apache Gump(TM) version 2.3.
Gump Run 20171016180006, vmgump-vm3.apache.org:vmgump:20171016180006
Gump E-mail Identifier (unique within run) #1.


--
Apache Gump
http://gump.apache.org/ [Instance: vmgump-vm3]

---------------------------------------------------------------------
To unsubscribe, e-mail: general-unsubscribe@gump.apache.org
For additional commands, e-mail: general-help@gump.apache.org


Mime
View raw message