gump-general mailing list archives

Site index · List index
Message view « Date » · « Thread »
Top « Date » · « Thread »
From g...@vmgump-vm3.apache.org
Subject BATCH: All dressed up, with nowhere to go...
Date Wed, 11 Oct 2017 04:06:46 GMT
Dear Gumpmeisters,
            
The following 3 notifys should have been sent

*********************************************************** G U M P
[GUMP@vmgump-vm3]: Project logging-log4j-12 (in module logging-log4j-12) failed
[GUMP@vmgump-vm3]: Project antunit-test (in module antlibs-antunit) failed
[GUMP@vmgump-vm3]: Project test-ant (in module ant) failed
*********************************************************** G U M P
[GUMP@vmgump-vm3]: Project logging-log4j-12 (in module logging-log4j-12) failed
To whom it may engage...
        
This is an automated request, but not an unsolicited one. For 
more information please visit http://gump.apache.org/nagged.html, 
and/or contact the folk at general@gump.apache.org.

Project logging-log4j-12 has an issue affecting its community integration.
This issue affects 21 projects.
The current state of this project is 'Failed', with reason 'Build Failed'.
For reference only, the following projects are affected by this:
    - checkstyle :  Java style checker
    - commons-beanutils :  Bean Utilities
    - commons-digester :  XML to Java Object Configuration
    - commons-logging :  Logging Library Package
    - commons-logging-step-1 :  Logging Library Package
    - forrest-core :  Apache Forrest software is a publishing framework that trans...
    - forrest-test :  Apache Forrest software is a publishing framework that trans...
    - forrest-test-basic :  Apache Forrest software is a publishing framework that trans...
    - forrest-test-deploy-plugins :  Apache Forrest software is a publishing framework that
trans...
    - jakarta-bsf :  Bean Scripting Framework
    - logging-log4j-12 :  Fast and flexible logging package for Java
    - logging-log4j-12-tests :  Fast and flexible logging package for Java
    - org.apache.poi :  POI
    - poi :  POI
    - poi-test :  POI
    - tomcat-tc7.0.x-validate :  Tomcat 7.x, a web server implementing Java Servlet 3.0,
    ...
    - tomcat-tc8.0.x-validate :  Tomcat 8.x, a web server implementing the Java Servlet 3.1,
...
    - tomcat-trunk-validate :  Tomcat 9.x, a web server implementing the Java Servlet 4.0,
...
    - xml-batik :  Scalable Vector Graphics
    - xmlgraphics-commons :  Apache XML Graphics Commons - Common Components for Batik an...
    - xmlgraphics-commons-test :  Apache XML Graphics Commons - Common Components for Batik
an...


Full details are available at:
    http://vmgump-vm3.apache.org/logging-log4j-12/logging-log4j-12/index.html

That said, some information snippets are provided here.

The following annotations (debug/informational/warning/error messages) were provided:
 -DEBUG- (Apache Gump generated) Apache Maven Settings in: /srv/gump/public/workspace/logging-log4j-12/gump_mvn_settings.xml
 -INFO- Failed with reason build failed
 -DEBUG- Maven POM in: /srv/gump/public/workspace/logging-log4j-12/pom.xml
 -DEBUG- Extracted fallback artifacts from Gump Repository



The following work was performed:
http://vmgump-vm3.apache.org/logging-log4j-12/logging-log4j-12/gump_work/build_logging-log4j-12_logging-log4j-12.html
Work Name: build_logging-log4j-12_logging-log4j-12 (Type: Build)
Work ended in a state of : Failed
Elapsed: 41 secs
Command Line: /opt/maven2/bin/mvn --batch-mode -DskipTests=true -Dmaven.javadoc.failOnError=false
--settings /srv/gump/public/workspace/logging-log4j-12/gump_mvn_settings.xml package 
[Working Directory: /srv/gump/public/workspace/logging-log4j-12]
M2_HOME: /opt/maven2
---------------------------------------------
8K downloaded  (maven-2.0.pom)
Downloading: http://localhost:8192/maven/2/org/codehaus/plexus/plexus-archiver/1.0-alpha-7/plexus-archiver-1.0-alpha-7.pom
[INFO] Unable to find resource 'org.codehaus.plexus:plexus-archiver:pom:1.0-alpha-7' in repository
maven2-repository.dev.java.net (http://download.java.net/maven/2/)
Downloading: http://localhost:8192/maven2/org/codehaus/plexus/plexus-archiver/1.0-alpha-7/plexus-archiver-1.0-alpha-7.pom
1K downloaded  (plexus-archiver-1.0-alpha-7.pom)
Downloading: http://localhost:8192/maven/2/org/codehaus/plexus/plexus-components/1.1.6/plexus-components-1.1.6.pom
[INFO] Unable to find resource 'org.codehaus.plexus:plexus-components:pom:1.1.6' in repository
maven2-repository.dev.java.net (http://download.java.net/maven/2/)
Downloading: http://localhost:8192/maven2/org/codehaus/plexus/plexus-components/1.1.6/plexus-components-1.1.6.pom
1K downloaded  (plexus-components-1.1.6.pom)
Downloading: http://localhost:8192/maven/2/org/codehaus/plexus/plexus/1.0.8/plexus-1.0.8.pom
[INFO] Unable to find resource 'org.codehaus.plexus:plexus:pom:1.0.8' in repository maven2-repository.dev.java.net
(http://download.java.net/maven/2/)
Downloading: http://localhost:8192/maven2/org/codehaus/plexus/plexus/1.0.8/plexus-1.0.8.pom
7K downloaded  (plexus-1.0.8.pom)
Downloading: http://localhost:8192/maven/2/org/codehaus/plexus/plexus-utils/1.2/plexus-utils-1.2.pom
[INFO] Unable to find resource 'org.codehaus.plexus:plexus-utils:pom:1.2' in repository maven2-repository.dev.java.net
(http://download.java.net/maven/2/)
Downloading: http://localhost:8192/maven2/org/codehaus/plexus/plexus-utils/1.2/plexus-utils-1.2.pom
767b downloaded  (plexus-utils-1.2.pom)
Downloading: http://localhost:8192/maven/2/org/codehaus/plexus/plexus/1.0.5/plexus-1.0.5.pom
[INFO] Unable to find resource 'org.codehaus.plexus:plexus:pom:1.0.5' in repository maven2-repository.dev.java.net
(http://download.java.net/maven/2/)
Downloading: http://localhost:8192/maven2/org/codehaus/plexus/plexus/1.0.5/plexus-1.0.5.pom
[WARNING] Unable to get resource 'org.codehaus.plexus:plexus:pom:1.0.5' from repository central
(http://repo1.maven.org/maven2): Error transferring file: Invalid Http response
[INFO] ------------------------------------------------------------------------
[ERROR] BUILD ERROR
[INFO] ------------------------------------------------------------------------
[INFO] Failed to resolve artifact.

Unable to get dependency information: Unable to read the metadata file for artifact 'org.codehaus.plexus:plexus-utils:jar':
Cannot find parent: org.codehaus.plexus:plexus for project: null:plexus-utils:jar:1.2 for
project null:plexus-utils:jar:1.2
  org.codehaus.plexus:plexus-utils:jar:1.2

from the specified remote repositories:
  central (http://repo1.maven.org/maven2),
  codehaus-snapshots (http://snapshots.repository.codehaus.org),
  apache-snapshots (http://people.apache.org/maven-snapshot-repository),
  maven2-repository.dev.java.net (http://download.java.net/maven/2/),
  apache.snapshots (http://repository.apache.org/snapshots)

Path to dependency: 
	1) org.apache.felix:maven-bundle-plugin:maven-plugin:2.1.0
	2) org.apache.maven:maven-archiver:jar:2.2
	3) org.codehaus.plexus:plexus-archiver:jar:1.0-alpha-7



[INFO] ------------------------------------------------------------------------
[INFO] For more information, run Maven with the -e switch
[INFO] ------------------------------------------------------------------------
[INFO] Total time: 40 seconds
[INFO] Finished at: Wed Oct 11 00:01:30 UTC 2017
[INFO] Final Memory: 6M/59M
[INFO] ------------------------------------------------------------------------
---------------------------------------------

To subscribe to this information via syndicated feeds:
- RSS: http://vmgump-vm3.apache.org/logging-log4j-12/logging-log4j-12/rss.xml
- Atom: http://vmgump-vm3.apache.org/logging-log4j-12/logging-log4j-12/atom.xml

============================== Gump Tracking Only ===
Produced by Apache Gump(TM) version 2.3.
Gump Run 20171011000009, vmgump-vm3.apache.org:vmgump:20171011000009
Gump E-mail Identifier (unique within run) #1.

*********************************************************** G U M P
[GUMP@vmgump-vm3]: Project antunit-test (in module antlibs-antunit) failed
To whom it may engage...
        
This is an automated request, but not an unsolicited one. For 
more information please visit http://gump.apache.org/nagged.html, 
and/or contact the folk at general@gump.apache.org.

Project antunit-test has an issue affecting its community integration.
This issue affects 1 projects,
 and has been outstanding for 564 runs.
The current state of this project is 'Failed', with reason 'Build Failed'.
For reference only, the following projects are affected by this:
    - antunit-test :  Antlib that provides a test framework for Apache Ant tasks a...


Full details are available at:
    http://vmgump-vm3.apache.org/antlibs-antunit/antunit-test/index.html

That said, some information snippets are provided here.

The following annotations (debug/informational/warning/error messages) were provided:
 -DEBUG- Dependency on ant-testutil exists, no need to add for property ant-testutil.jar.
 -INFO- Failed with reason build failed



The following work was performed:
http://vmgump-vm3.apache.org/antlibs-antunit/antunit-test/gump_work/build_antlibs-antunit_antunit-test.html
Work Name: build_antlibs-antunit_antunit-test (Type: Build)
Work ended in a state of : Failed
Elapsed: 6 secs
Command Line: /usr/lib/jvm/java-8-oracle/bin/java -Djava.awt.headless=true -Dbuild.sysclasspath=only
-Xbootclasspath/p:/srv/gump/public/workspace/xml-xerces2/build/xercesImpl.jar:/srv/gump/public/workspace/xml-commons/java/external/build/xml-apis.jar
org.apache.tools.ant.Main -Dgump.merge=/srv/gump/public/gump/work/merge.xml -Dant-testutil.jar=/srv/gump/public/workspace/ant/build/lib/ant-testutil.jar
test 
[Working Directory: /srv/gump/public/workspace/antlibs-antunit]
CLASSPATH: /usr/lib/jvm/java-8-oracle/lib/tools.jar:/srv/gump/public/workspace/antlibs-antunit/build/test-classes:/srv/gump/public/workspace/antlibs-antunit/ivy/ivy.jar:/srv/gump/public/workspace/ant/dist/lib/ant.jar:/srv/gump/public/workspace/ant/dist/lib/ant-launcher.jar:/srv/gump/public/workspace/ant/dist/lib/ant-jmf.jar:/srv/gump/public/workspace/ant/dist/lib/ant-junit.jar:/srv/gump/public/workspace/ant/dist/lib/ant-junit4.jar:/srv/gump/public/workspace/ant/dist/lib/ant-swing.jar:/srv/gump/public/workspace/ant/dist/lib/ant-apache-resolver.jar:/srv/gump/public/workspace/ant/dist/lib/ant-apache-xalan2.jar:/srv/gump/public/workspace/ant/build/lib/ant-testutil.jar:/srv/gump/public/workspace/antlibs-antunit/build/ant-antunit-20171011.jar:/srv/gump/public/workspace/junit/target/junit-4.13-SNAPSHOT.jar:/srv/gump/public/workspace/xml-commons/java/external/build/xml-apis-ext.jar
---------------------------------------------
    [junit] 
    [junit] Testcase: testSuiteSetUpTearDown took 0.055 sec
    [junit] Testcase: testBadCharacters took 0.032 sec
    [junit] Testcase: testProperties took 0.071 sec
    [junit] Testcase: testSetUpTearDown took 0.047 sec
    [junit] Testcase: testShowDebug took 0.045 sec
    [junit] Testcase: testShowError took 0.026 sec
    [junit] Testcase: testStdoutPlacement took 0.034 sec
    [junit] Testcase: testShowVerbose took 0.034 sec
    [junit] Testcase: testShowInfo took 0.027 sec
    [junit] Testcase: testShowNone took 0.1 sec
    [junit] Testcase: testShowWarning took 0.029 sec
    [junit] Testcase: testShowDefault took 0.024 sec

setup-for-antunit-tests:

ready-to-test-with-antunit:

antunit-test:
    [mkdir] Created dir: /srv/gump/public/workspace/antlibs-antunit/build/reports/antunit
[au:antunit] Build File: /srv/gump/public/workspace/antlibs-antunit/src/tests/antunit/assertLogContains-test.xml
[au:antunit] Tests run: 3, Failures: 0, Errors: 0, Time elapsed: 0.025 sec
[au:antunit] Target: testWithExplicitMerge took 0.002 sec
[au:antunit] Target: testWithoutMerge took 0.001 sec
[au:antunit] Target: testWithImplicitMerge took 0 sec
[au:antunit] Build File: /srv/gump/public/workspace/antlibs-antunit/src/tests/antunit/assertResourceContains-test.xml
[au:antunit] Tests run: 2, Failures: 0, Errors: 0, Time elapsed: 0.081 sec
[au:antunit] Target: testURLUsingRef took 0.052 sec
[au:antunit] Target: testURLUsingRef-no took 0.019 sec
[au:antunit] Build File: /srv/gump/public/workspace/antlibs-antunit/src/tests/antunit/assertResourceExists-test.xml
[au:antunit] Tests run: 4, Failures: 0, Errors: 0, Time elapsed: 0.179 sec
[au:antunit] Target: testURLUsingRef-no took 0.044 sec
[au:antunit] Target: testURL took 0.032 sec
[au:antunit] Target: testURL-no took 0.05 sec
[au:antunit] Target: testURLUsingRef took 0.032 sec
[au:antunit] Build File: /srv/gump/public/workspace/antlibs-antunit/src/tests/antunit/resourceexists-test.xml
[au:antunit] Tests run: 6, Failures: 0, Errors: 0, Time elapsed: 0.093 sec
[au:antunit] Target: test-refid-file took 0 sec
[au:antunit] Target: testURL took 0.023 sec
[au:antunit] Target: test-no took 0 sec
[au:antunit] Target: test-yes took 0.001 sec
[au:antunit] Target: test-refid-fileset took 0.001 sec
[au:antunit] Target: testURLAttributeUsingRef took 0.032 sec

test:

BUILD FAILED
/srv/gump/public/workspace/antlibs-antunit/common/build.xml:208: At least one JUnit test has
failed.

Total time: 5 seconds
---------------------------------------------

To subscribe to this information via syndicated feeds:
- RSS: http://vmgump-vm3.apache.org/antlibs-antunit/antunit-test/rss.xml
- Atom: http://vmgump-vm3.apache.org/antlibs-antunit/antunit-test/atom.xml

============================== Gump Tracking Only ===
Produced by Apache Gump(TM) version 2.3.
Gump Run 20171011000009, vmgump-vm3.apache.org:vmgump:20171011000009
Gump E-mail Identifier (unique within run) #3.

*********************************************************** G U M P
[GUMP@vmgump-vm3]: Project test-ant (in module ant) failed
To whom it may engage...
        
This is an automated request, but not an unsolicited one. For 
more information please visit http://gump.apache.org/nagged.html, 
and/or contact the folk at general@gump.apache.org.

Project test-ant has an issue affecting its community integration.
This issue affects 1 projects,
 and has been outstanding for 564 runs.
The current state of this project is 'Failed', with reason 'Build Failed'.
For reference only, the following projects are affected by this:
    - test-ant :  Java based build tool


Full details are available at:
    http://vmgump-vm3.apache.org/ant/test-ant/index.html

That said, some information snippets are provided here.

The following annotations (debug/informational/warning/error messages) were provided:
 -WARNING- Bad *Optional* Dependency. Project: bsh : unknown to *this* workspace
 -INFO- Failed with reason build failed



The following work was performed:
http://vmgump-vm3.apache.org/ant/test-ant/gump_work/build_ant_test-ant.html
Work Name: build_ant_test-ant (Type: Build)
Work ended in a state of : Failed
Elapsed: 7 mins 39 secs
Command Line: /usr/lib/jvm/java-8-oracle/bin/java -Djava.awt.headless=true -Dbuild.sysclasspath=only
-Xbootclasspath/p:/srv/gump/public/workspace/xml-xerces2/build/xercesImpl.jar:/srv/gump/public/workspace/xml-commons/java/external/build/xml-apis.jar:/srv/gump/public/workspace/xml-xalan/build/xalan-unbundled.jar:/srv/gump/public/workspace/xml-xalan/build/serializer.jar
org.apache.tools.ant.Main -Dgump.merge=/srv/gump/public/gump/work/merge.xml -Dtest.haltonfailure=false
-Dant.home=/srv/gump/public/workspace/ant/dist run-tests 
[Working Directory: /srv/gump/public/workspace/ant]
CLASSPATH: /usr/lib/jvm/java-8-oracle/lib/tools.jar:/srv/gump/public/workspace/ant/build/testcases:/srv/gump/public/workspace/ant/src/tests/junit:/srv/gump/public/workspace/ant/src/etc/testcases:/srv/gump/public/workspace/ant/src/etc/testcases/taskdefs/optional/out:/srv/gump/public/workspace/ant/src/tests/antunit/filters:/srv/gump/public/workspace/ant/src/tests/antunit/taskdefs/importtests:/srv/gump/public/workspace/ant/src/tests/antunit/filters/foo:/srv/gump/public/workspace/ant/src/tests/antunit/taskdefs/foo:/srv/gump/public/workspace/ant/build/antunit/tmp/testinput/build:/srv/gump/public/workspace/ant/build/antunit/tmp/testoutput:/srv/gump/public/workspace/ant/build/antunit/tmp/test.jar:/srv/gump/public/workspace/ant/build/antunit/tmp/test1.jar:/srv/gump/public/workspace/ant/build/antunit/tmp/test2.jar:/srv/gump/public/workspace/ant/build/antunit/tmp/test3.jar:/srv/gump/public/workspace/ant/build/antunit/tmp/test4.jar:/srv/gump/public/workspace/ant/build/antunit/tmp/test5.jar:/srv
 /gump/public/workspace/ant/build/antunit/tmp/resources:/srv/gump/public/workspace/ant/build/lib/ant.jar:/srv/gump/public/workspace/ant/build/lib/ant-launcher.jar:/srv/gump/public/workspace/ant/build/lib/ant-antlr.jar:/srv/gump/public/workspace/ant/build/lib/ant-apache-bcel.jar:/srv/gump/public/workspace/ant/build/lib/ant-apache-bsf.jar:/srv/gump/public/workspace/ant/build/lib/ant-apache-log4j.jar:/srv/gump/public/workspace/ant/build/lib/ant-apache-oro.jar:/srv/gump/public/workspace/ant/build/lib/ant-apache-regexp.jar:/srv/gump/public/workspace/ant/build/lib/ant-apache-resolver.jar:/srv/gump/public/workspace/ant/build/lib/ant-apache-xalan2.jar:/srv/gump/public/workspace/ant/build/lib/ant-commons-logging.jar:/srv/gump/public/workspace/ant/build/lib/ant-commons-net.jar:/srv/gump/public/workspace/ant/build/lib/ant-jai.jar:/srv/gump/public/workspace/ant/build/lib/ant-javamail.jar:/srv/gump/public/workspace/ant/build/lib/ant-jdepend.jar:/srv/gump/public/workspace/ant/build/lib/ant-jmf.jar
 :/srv/gump/public/workspace/ant/build/lib/ant-jsch.jar:/srv/gump/public/workspace/ant/build/lib/ant-junit.jar:/srv/gump/public/workspace/ant/build/lib/ant-junit4.jar:/srv/gump/public/workspace/ant/build/lib/ant-swing.jar:/srv/gump/public/workspace/ant/build/lib/ant-xz.jar:/srv/gump/packages/antlr/antlr-3.1.3.jar:/srv/gump/public/workspace/ant-contrib/lib/bcel/jars/bcel-5.1.jar:commons-logging-gump-20171009.jar:commons-logging-api-gump-20171009.jar:/srv/gump/public/workspace/apache-commons/net/target/commons-net-3.7-SNAPSHOT.jar:/srv/gump/public/workspace/apache-commons/net/target/commons-net-ftp-3.7-SNAPSHOT.jar:/srv/gump/packages/jaf-1.1ea/activation.jar:bsf-gump-20171009.jar:/srv/gump/packages/apache-attic/jakarta-regexp-1.5.jar:/srv/gump/public/workspace/jakarta-servletapi-5/jsr154/dist/lib/servlet-api.jar:/srv/gump/packages/javamail-1.4/mail.jar:/srv/gump/packages/javamail-1.4/lib/mailapi.jar:/srv/gump/packages/jdepend-2.6/lib/jdepend.jar:/srv/gump/packages/jsch/jsch-0.1.45.jar:
 log4j-gump-20171009.jar:/srv/gump/packages/apache-attic/oro-2.0.8.jar:/srv/gump/public/workspace/xz-java/build/jar-20171011/xz.jar:/srv/gump/public/workspace/antlibs-antunit/build/ant-antunit-20171011.jar:/srv/gump/packages/hamcrest/hamcrest-core-1.3.jar:/srv/gump/public/workspace/junit/target/junit-4.13-SNAPSHOT.jar:/srv/gump/public/workspace/xml-commons/java/external/build/xml-apis-ext.jar:/srv/gump/public/workspace/commons-codec-1.x/dist/commons-codec-20171011.jar
---------------------------------------------
[au:antunit] Build File: /srv/gump/public/workspace/ant/src/tests/antunit/types/selectors/modified-test.xml
[au:antunit] Tests run: 1, Failures: 0, Errors: 0, Time elapsed: 0.019 sec
[au:antunit] Target: testUpdate took 0.011 sec
[au:antunit] Build File: /srv/gump/public/workspace/ant/src/tests/antunit/types/selectors/ownedby-test.xml
[au:antunit] Tests run: 3, Failures: 0, Errors: 0, Time elapsed: 0.008 sec
[au:antunit] Target: testOwnedBy took 0.002 sec
[au:antunit] Target: testAsTrueConditions took 0 sec
[au:antunit] Target: testRequiresOwner took 0 sec
[au:antunit] Build File: /srv/gump/public/workspace/ant/src/tests/antunit/types/selectors/present-test.xml
[au:antunit] Tests run: 1, Failures: 0, Errors: 0, Time elapsed: 0.002 sec
[au:antunit] Target: testMapperByTypedef took 0.001 sec
[au:antunit] Build File: /srv/gump/public/workspace/ant/src/tests/antunit/types/selectors/readwrite-test.xml
[au:antunit] Tests run: 4, Failures: 0, Errors: 0, Time elapsed: 0.008 sec
[au:antunit] Target: testWritable took 0.001 sec
[au:antunit] Target: testAsConditions took 0.001 sec
[au:antunit] Target: testReadable took 0.001 sec
[au:antunit] Target: testUnwritable took 0 sec
[au:antunit] Build File: /srv/gump/public/workspace/ant/src/tests/antunit/types/selectors/select-test.xml
[au:antunit] Tests run: 4, Failures: 0, Errors: 0, Time elapsed: 0.012 sec
[au:antunit] Target: testIfFalse took 0.001 sec
[au:antunit] Target: testIfNotSet took 0.002 sec
[au:antunit] Target: testIfTrue took 0.002 sec
[au:antunit] Target: testIfSet took 0.002 sec
[au:antunit] Build File: /srv/gump/public/workspace/ant/src/tests/antunit/types/selectors/symlink-test.xml
[au:antunit] Tests run: 4, Failures: 0, Errors: 0, Time elapsed: 0.015 sec
[au:antunit] Target: testAsFalseConditions took 0.001 sec
[au:antunit] Target: testAsTrueConditions took 0.002 sec
[au:antunit] Target: testNoSymlink took 0.001 sec
[au:antunit] Target: testSymlink took 0.006 sec
[au:antunit] Build File: /srv/gump/public/workspace/ant/src/tests/antunit/types/tarfileset-test.xml
[au:antunit] Tests run: 3, Failures: 0, Errors: 0, Time elapsed: 0.005 sec
[au:antunit] Target: test-refid-check-encoding took 0 sec
[au:antunit] Target: testMissingArchive took 0.001 sec
[au:antunit] Target: testMissingArchiveDoesntMatter took 0.001 sec
[au:antunit] Build File: /srv/gump/public/workspace/ant/src/tests/antunit/types/zipfileset-test.xml
[au:antunit] Tests run: 5, Failures: 0, Errors: 0, Time elapsed: 0.014 sec
[au:antunit] Target: testMissingArchive took 0 sec
[au:antunit] Target: test-refid-check-encoding took 0 sec
[au:antunit] Target: test-refid-modify took 0.006 sec
[au:antunit] Target: test-refid-check-prefix took 0 sec
[au:antunit] Target: testMissingArchiveDoesntMatter took 0 sec

check-failed:

run-tests:

BUILD FAILED
/srv/gump/public/workspace/ant/build.xml:1628: Unit tests failed

Total time: 7 minutes 39 seconds
---------------------------------------------

To subscribe to this information via syndicated feeds:
- RSS: http://vmgump-vm3.apache.org/ant/test-ant/rss.xml
- Atom: http://vmgump-vm3.apache.org/ant/test-ant/atom.xml

============================== Gump Tracking Only ===
Produced by Apache Gump(TM) version 2.3.
Gump Run 20171011000009, vmgump-vm3.apache.org:vmgump:20171011000009
Gump E-mail Identifier (unique within run) #4.


--
Apache Gump
http://gump.apache.org/ [Instance: vmgump-vm3]

---------------------------------------------------------------------
To unsubscribe, e-mail: general-unsubscribe@gump.apache.org
For additional commands, e-mail: general-help@gump.apache.org


Mime
View raw message