gump-general mailing list archives

Site index · List index
Message view « Date » · « Thread »
Top « Date » · « Thread »
From g...@vmgump-vm3.apache.org
Subject BATCH: All dressed up, with nowhere to go...
Date Thu, 14 Sep 2017 01:09:30 GMT
Dear Gumpmeisters,
            
The following 3 notifys should have been sent

*********************************************************** G U M P
[GUMP@vmgump-vm3]: Project antunit-test (in module antlibs-antunit) failed
[GUMP@vmgump-vm3]: Project test-ant (in module ant) failed
[GUMP@vmgump-vm3]: Project easymock (in module easymock) failed
*********************************************************** G U M P
[GUMP@vmgump-vm3]: Project antunit-test (in module antlibs-antunit) failed
To whom it may engage...
        
This is an automated request, but not an unsolicited one. For 
more information please visit http://gump.apache.org/nagged.html, 
and/or contact the folk at general@gump.apache.org.

Project antunit-test has an issue affecting its community integration.
This issue affects 1 projects,
 and has been outstanding for 456 runs.
The current state of this project is 'Failed', with reason 'Build Failed'.
For reference only, the following projects are affected by this:
    - antunit-test :  Antlib that provides a test framework for Apache Ant tasks a...


Full details are available at:
    http://vmgump-vm3.apache.org/antlibs-antunit/antunit-test/index.html

That said, some information snippets are provided here.

The following annotations (debug/informational/warning/error messages) were provided:
 -DEBUG- Dependency on ant-testutil exists, no need to add for property ant-testutil.jar.
 -INFO- Failed with reason build failed



The following work was performed:
http://vmgump-vm3.apache.org/antlibs-antunit/antunit-test/gump_work/build_antlibs-antunit_antunit-test.html
Work Name: build_antlibs-antunit_antunit-test (Type: Build)
Work ended in a state of : Failed
Elapsed: 6 secs
Command Line: /usr/lib/jvm/java-8-oracle/bin/java -Djava.awt.headless=true -Dbuild.sysclasspath=only
-Xbootclasspath/p:/srv/gump/public/workspace/xml-xerces2/build/xercesImpl.jar:/srv/gump/public/workspace/xml-commons/java/external/build/xml-apis.jar
org.apache.tools.ant.Main -Dgump.merge=/srv/gump/public/gump/work/merge.xml -Dant-testutil.jar=/srv/gump/public/workspace/ant/build/lib/ant-testutil.jar
test 
[Working Directory: /srv/gump/public/workspace/antlibs-antunit]
CLASSPATH: /usr/lib/jvm/java-8-oracle/lib/tools.jar:/srv/gump/public/workspace/antlibs-antunit/build/test-classes:/srv/gump/public/workspace/antlibs-antunit/ivy/ivy.jar:/srv/gump/public/workspace/ant/dist/lib/ant.jar:/srv/gump/public/workspace/ant/dist/lib/ant-launcher.jar:/srv/gump/public/workspace/ant/dist/lib/ant-jmf.jar:/srv/gump/public/workspace/ant/dist/lib/ant-junit.jar:/srv/gump/public/workspace/ant/dist/lib/ant-junit4.jar:/srv/gump/public/workspace/ant/dist/lib/ant-swing.jar:/srv/gump/public/workspace/ant/dist/lib/ant-apache-resolver.jar:/srv/gump/public/workspace/ant/dist/lib/ant-apache-xalan2.jar:/srv/gump/public/workspace/ant/build/lib/ant-testutil.jar:/srv/gump/public/workspace/antlibs-antunit/build/ant-antunit-20170914.jar:/srv/gump/public/workspace/junit/target/junit-4.13-SNAPSHOT.jar:/srv/gump/public/workspace/xml-commons/java/external/build/xml-apis-ext.jar
---------------------------------------------
    [junit] 
    [junit] Testcase: testSuiteSetUpTearDown took 0.057 sec
    [junit] Testcase: testBadCharacters took 0.192 sec
    [junit] Testcase: testProperties took 0.072 sec
    [junit] Testcase: testSetUpTearDown took 0.048 sec
    [junit] Testcase: testShowDebug took 0.041 sec
    [junit] Testcase: testShowError took 0.03 sec
    [junit] Testcase: testStdoutPlacement took 0.038 sec
    [junit] Testcase: testShowVerbose took 0.034 sec
    [junit] Testcase: testShowInfo took 0.03 sec
    [junit] Testcase: testShowNone took 0.025 sec
    [junit] Testcase: testShowWarning took 0.022 sec
    [junit] Testcase: testShowDefault took 0.025 sec

setup-for-antunit-tests:

ready-to-test-with-antunit:

antunit-test:
    [mkdir] Created dir: /srv/gump/public/workspace/antlibs-antunit/build/reports/antunit
[au:antunit] Build File: /srv/gump/public/workspace/antlibs-antunit/src/tests/antunit/assertLogContains-test.xml
[au:antunit] Tests run: 3, Failures: 0, Errors: 0, Time elapsed: 0.014 sec
[au:antunit] Target: testWithExplicitMerge took 0.002 sec
[au:antunit] Target: testWithoutMerge took 0.001 sec
[au:antunit] Target: testWithImplicitMerge took 0 sec
[au:antunit] Build File: /srv/gump/public/workspace/antlibs-antunit/src/tests/antunit/assertResourceContains-test.xml
[au:antunit] Tests run: 2, Failures: 0, Errors: 0, Time elapsed: 0.081 sec
[au:antunit] Target: testURLUsingRef took 0.048 sec
[au:antunit] Target: testURLUsingRef-no took 0.029 sec
[au:antunit] Build File: /srv/gump/public/workspace/antlibs-antunit/src/tests/antunit/assertResourceExists-test.xml
[au:antunit] Tests run: 4, Failures: 0, Errors: 0, Time elapsed: 0.16 sec
[au:antunit] Target: testURLUsingRef-no took 0.046 sec
[au:antunit] Target: testURL took 0.033 sec
[au:antunit] Target: testURL-no took 0.052 sec
[au:antunit] Target: testURLUsingRef took 0.022 sec
[au:antunit] Build File: /srv/gump/public/workspace/antlibs-antunit/src/tests/antunit/resourceexists-test.xml
[au:antunit] Tests run: 6, Failures: 0, Errors: 0, Time elapsed: 0.06 sec
[au:antunit] Target: test-refid-file took 0.001 sec
[au:antunit] Target: testURL took 0.022 sec
[au:antunit] Target: test-no took 0 sec
[au:antunit] Target: test-yes took 0 sec
[au:antunit] Target: test-refid-fileset took 0.001 sec
[au:antunit] Target: testURLAttributeUsingRef took 0.027 sec

test:

BUILD FAILED
/srv/gump/public/workspace/antlibs-antunit/common/build.xml:208: At least one JUnit test has
failed.

Total time: 6 seconds
---------------------------------------------

To subscribe to this information via syndicated feeds:
- RSS: http://vmgump-vm3.apache.org/antlibs-antunit/antunit-test/rss.xml
- Atom: http://vmgump-vm3.apache.org/antlibs-antunit/antunit-test/atom.xml

============================== Gump Tracking Only ===
Produced by Apache Gump(TM) version 2.3.
Gump Run 20170914000010, vmgump-vm3.apache.org:vmgump:20170914000010
Gump E-mail Identifier (unique within run) #2.

*********************************************************** G U M P
[GUMP@vmgump-vm3]: Project test-ant (in module ant) failed
To whom it may engage...
        
This is an automated request, but not an unsolicited one. For 
more information please visit http://gump.apache.org/nagged.html, 
and/or contact the folk at general@gump.apache.org.

Project test-ant has an issue affecting its community integration.
This issue affects 1 projects,
 and has been outstanding for 456 runs.
The current state of this project is 'Failed', with reason 'Build Failed'.
For reference only, the following projects are affected by this:
    - test-ant :  Java based build tool


Full details are available at:
    http://vmgump-vm3.apache.org/ant/test-ant/index.html

That said, some information snippets are provided here.

The following annotations (debug/informational/warning/error messages) were provided:
 -WARNING- Bad *Optional* Dependency. Project: bsh : unknown to *this* workspace
 -INFO- Failed with reason build failed



The following work was performed:
http://vmgump-vm3.apache.org/ant/test-ant/gump_work/build_ant_test-ant.html
Work Name: build_ant_test-ant (Type: Build)
Work ended in a state of : Failed
Elapsed: 7 mins 40 secs
Command Line: /usr/lib/jvm/java-8-oracle/bin/java -Djava.awt.headless=true -Dbuild.sysclasspath=only
-Xbootclasspath/p:/srv/gump/public/workspace/xml-xerces2/build/xercesImpl.jar:/srv/gump/public/workspace/xml-commons/java/external/build/xml-apis.jar:/srv/gump/public/workspace/xml-xalan/build/xalan-unbundled.jar:/srv/gump/public/workspace/xml-xalan/build/serializer.jar
org.apache.tools.ant.Main -Dgump.merge=/srv/gump/public/gump/work/merge.xml -Dtest.haltonfailure=false
-Dant.home=/srv/gump/public/workspace/ant/dist run-tests 
[Working Directory: /srv/gump/public/workspace/ant]
CLASSPATH: /usr/lib/jvm/java-8-oracle/lib/tools.jar:/srv/gump/public/workspace/ant/build/testcases:/srv/gump/public/workspace/ant/src/tests/junit:/srv/gump/public/workspace/ant/src/etc/testcases:/srv/gump/public/workspace/ant/src/etc/testcases/taskdefs/optional/out:/srv/gump/public/workspace/ant/src/tests/antunit/filters:/srv/gump/public/workspace/ant/src/tests/antunit/taskdefs/importtests:/srv/gump/public/workspace/ant/src/tests/antunit/filters/foo:/srv/gump/public/workspace/ant/src/tests/antunit/taskdefs/foo:/srv/gump/public/workspace/ant/build/antunit/tmp/testinput/build:/srv/gump/public/workspace/ant/build/antunit/tmp/testoutput:/srv/gump/public/workspace/ant/build/antunit/tmp/test.jar:/srv/gump/public/workspace/ant/build/antunit/tmp/test1.jar:/srv/gump/public/workspace/ant/build/antunit/tmp/test2.jar:/srv/gump/public/workspace/ant/build/antunit/tmp/test3.jar:/srv/gump/public/workspace/ant/build/antunit/tmp/test4.jar:/srv/gump/public/workspace/ant/build/antunit/tmp/test5.jar:/srv
 /gump/public/workspace/ant/build/antunit/tmp/resources:/srv/gump/public/workspace/ant/build/lib/ant.jar:/srv/gump/public/workspace/ant/build/lib/ant-launcher.jar:/srv/gump/public/workspace/ant/build/lib/ant-antlr.jar:/srv/gump/public/workspace/ant/build/lib/ant-apache-bcel.jar:/srv/gump/public/workspace/ant/build/lib/ant-apache-bsf.jar:/srv/gump/public/workspace/ant/build/lib/ant-apache-log4j.jar:/srv/gump/public/workspace/ant/build/lib/ant-apache-oro.jar:/srv/gump/public/workspace/ant/build/lib/ant-apache-regexp.jar:/srv/gump/public/workspace/ant/build/lib/ant-apache-resolver.jar:/srv/gump/public/workspace/ant/build/lib/ant-apache-xalan2.jar:/srv/gump/public/workspace/ant/build/lib/ant-commons-logging.jar:/srv/gump/public/workspace/ant/build/lib/ant-commons-net.jar:/srv/gump/public/workspace/ant/build/lib/ant-jai.jar:/srv/gump/public/workspace/ant/build/lib/ant-javamail.jar:/srv/gump/public/workspace/ant/build/lib/ant-jdepend.jar:/srv/gump/public/workspace/ant/build/lib/ant-jmf.jar
 :/srv/gump/public/workspace/ant/build/lib/ant-jsch.jar:/srv/gump/public/workspace/ant/build/lib/ant-junit.jar:/srv/gump/public/workspace/ant/build/lib/ant-junit4.jar:/srv/gump/public/workspace/ant/build/lib/ant-swing.jar:/srv/gump/public/workspace/ant/build/lib/ant-xz.jar:/srv/gump/packages/antlr/antlr-3.1.3.jar:/srv/gump/public/workspace/ant-contrib/lib/bcel/jars/bcel-5.1.jar:/srv/gump/public/workspace/apache-commons/logging/target/commons-logging-20170914.jar:/srv/gump/public/workspace/apache-commons/logging/target/commons-logging-api-20170914.jar:/srv/gump/public/workspace/apache-commons/net/target/commons-net-3.7-SNAPSHOT.jar:/srv/gump/public/workspace/apache-commons/net/target/commons-net-ftp-3.7-SNAPSHOT.jar:/srv/gump/packages/jaf-1.1ea/activation.jar:/srv/gump/public/workspace/jakarta-bsf/build/lib/bsf.jar:/srv/gump/packages/apache-attic/jakarta-regexp-1.5.jar:/srv/gump/public/workspace/jakarta-servletapi-5/jsr154/dist/lib/servlet-api.jar:/srv/gump/packages/javamail-1.4/mail.
 jar:/srv/gump/packages/javamail-1.4/lib/mailapi.jar:/srv/gump/packages/jdepend-2.6/lib/jdepend.jar:/srv/gump/packages/jsch/jsch-0.1.45.jar:/srv/gump/public/workspace/logging-log4j-12/target/log4j-1.2.18-SNAPSHOT.jar:/srv/gump/packages/apache-attic/oro-2.0.8.jar:/srv/gump/public/workspace/xz-java/build/jar-20170914/xz.jar:/srv/gump/public/workspace/antlibs-antunit/build/ant-antunit-20170914.jar:/srv/gump/packages/hamcrest/hamcrest-core-1.3.jar:/srv/gump/public/workspace/junit/target/junit-4.13-SNAPSHOT.jar:/srv/gump/public/workspace/xml-commons/java/external/build/xml-apis-ext.jar:/srv/gump/public/workspace/commons-codec-1.x/dist/commons-codec-20170914.jar
---------------------------------------------
[au:antunit] Build File: /srv/gump/public/workspace/ant/src/tests/antunit/types/selectors/modified-test.xml
[au:antunit] Tests run: 1, Failures: 0, Errors: 0, Time elapsed: 0.006 sec
[au:antunit] Target: testUpdate took 0.004 sec
[au:antunit] Build File: /srv/gump/public/workspace/ant/src/tests/antunit/types/selectors/ownedby-test.xml
[au:antunit] Tests run: 3, Failures: 0, Errors: 0, Time elapsed: 0.006 sec
[au:antunit] Target: testOwnedBy took 0.002 sec
[au:antunit] Target: testAsTrueConditions took 0 sec
[au:antunit] Target: testRequiresOwner took 0 sec
[au:antunit] Build File: /srv/gump/public/workspace/ant/src/tests/antunit/types/selectors/present-test.xml
[au:antunit] Tests run: 1, Failures: 0, Errors: 0, Time elapsed: 0.002 sec
[au:antunit] Target: testMapperByTypedef took 0.001 sec
[au:antunit] Build File: /srv/gump/public/workspace/ant/src/tests/antunit/types/selectors/readwrite-test.xml
[au:antunit] Tests run: 4, Failures: 0, Errors: 0, Time elapsed: 0.008 sec
[au:antunit] Target: testWritable took 0.001 sec
[au:antunit] Target: testAsConditions took 0.001 sec
[au:antunit] Target: testReadable took 0.001 sec
[au:antunit] Target: testUnwritable took 0 sec
[au:antunit] Build File: /srv/gump/public/workspace/ant/src/tests/antunit/types/selectors/select-test.xml
[au:antunit] Tests run: 4, Failures: 0, Errors: 0, Time elapsed: 0.012 sec
[au:antunit] Target: testIfFalse took 0.002 sec
[au:antunit] Target: testIfNotSet took 0.002 sec
[au:antunit] Target: testIfTrue took 0.002 sec
[au:antunit] Target: testIfSet took 0.002 sec
[au:antunit] Build File: /srv/gump/public/workspace/ant/src/tests/antunit/types/selectors/symlink-test.xml
[au:antunit] Tests run: 4, Failures: 0, Errors: 0, Time elapsed: 0.014 sec
[au:antunit] Target: testAsFalseConditions took 0.002 sec
[au:antunit] Target: testAsTrueConditions took 0.003 sec
[au:antunit] Target: testNoSymlink took 0.001 sec
[au:antunit] Target: testSymlink took 0.004 sec
[au:antunit] Build File: /srv/gump/public/workspace/ant/src/tests/antunit/types/tarfileset-test.xml
[au:antunit] Tests run: 3, Failures: 0, Errors: 0, Time elapsed: 0.005 sec
[au:antunit] Target: test-refid-check-encoding took 0 sec
[au:antunit] Target: testMissingArchive took 0.001 sec
[au:antunit] Target: testMissingArchiveDoesntMatter took 0 sec
[au:antunit] Build File: /srv/gump/public/workspace/ant/src/tests/antunit/types/zipfileset-test.xml
[au:antunit] Tests run: 5, Failures: 0, Errors: 0, Time elapsed: 0.066 sec
[au:antunit] Target: testMissingArchive took 0 sec
[au:antunit] Target: test-refid-check-encoding took 0 sec
[au:antunit] Target: test-refid-modify took 0.005 sec
[au:antunit] Target: test-refid-check-prefix took 0.001 sec
[au:antunit] Target: testMissingArchiveDoesntMatter took 0.001 sec

check-failed:

run-tests:

BUILD FAILED
/srv/gump/public/workspace/ant/build.xml:1628: Unit tests failed

Total time: 7 minutes 40 seconds
---------------------------------------------

To subscribe to this information via syndicated feeds:
- RSS: http://vmgump-vm3.apache.org/ant/test-ant/rss.xml
- Atom: http://vmgump-vm3.apache.org/ant/test-ant/atom.xml

============================== Gump Tracking Only ===
Produced by Apache Gump(TM) version 2.3.
Gump Run 20170914000010, vmgump-vm3.apache.org:vmgump:20170914000010
Gump E-mail Identifier (unique within run) #3.

*********************************************************** G U M P
[GUMP@vmgump-vm3]: Project easymock (in module easymock) failed
To whom it may engage...
        
This is an automated request, but not an unsolicited one. For 
more information please visit http://gump.apache.org/nagged.html, 
and/or contact the folk at general@gump.apache.org.

Project easymock has an issue affecting its community integration.
This issue affects 11 projects.
The current state of this project is 'Failed', with reason 'Build Failed'.
For reference only, the following projects are affected by this:
    - easymock :  EasyMock is a Java library that provides an easy way to use ...
    - tomcat-tc7.0.x-test-apr :  Tomcat 7.x, a web server implementing Java Servlet 3.0,
    ...
    - tomcat-tc7.0.x-test-bio :  Tomcat 7.x, a web server implementing Java Servlet 3.0,
    ...
    - tomcat-tc7.0.x-test-nio :  Tomcat 7.x, a web server implementing Java Servlet 3.0,
    ...
    - tomcat-tc8.0.x-test-apr :  Tomcat 8.x, a web server implementing the Java Servlet 3.1,
...
    - tomcat-tc8.0.x-test-bio :  Tomcat 8.x, a web server implementing the Java Servlet 3.1,
...
    - tomcat-tc8.0.x-test-nio :  Tomcat 8.x, a web server implementing the Java Servlet 3.1,
...
    - tomcat-tc8.0.x-test-nio2 :  Tomcat 8.x, a web server implementing the Java Servlet 3.1,
...
    - tomcat-trunk-test-apr :  Tomcat 9.x, a web server implementing the Java Servlet 4.0,
...
    - tomcat-trunk-test-nio :  Tomcat 9.x, a web server implementing the Java Servlet 4.0,
...
    - tomcat-trunk-test-nio2 :  Tomcat 9.x, a web server implementing the Java Servlet 4.0,
...


Full details are available at:
    http://vmgump-vm3.apache.org/easymock/easymock/index.html

That said, some information snippets are provided here.

The following annotations (debug/informational/warning/error messages) were provided:
 -DEBUG- (Apache Gump generated) Apache Maven Settings in: /srv/gump/public/workspace/easymock/core/gump_mvn_settings.xml
 -INFO- Failed with reason build failed
 -DEBUG- Maven POM in: /srv/gump/public/workspace/easymock/core/pom.xml
 -INFO- Failed to extract fallback artifacts from Gump Repository



The following work was performed:
http://vmgump-vm3.apache.org/easymock/easymock/gump_work/build_easymock_easymock.html
Work Name: build_easymock_easymock (Type: Build)
Work ended in a state of : Failed
Elapsed: 10 secs
Command Line: /opt/maven3/bin/mvn --batch-mode -Dmaven.test.skip=true --settings /srv/gump/public/workspace/easymock/core/gump_mvn_settings.xml
package 
[Working Directory: /srv/gump/public/workspace/easymock/core]
M2_HOME: /opt/maven3
---------------------------------------------
[INFO] ------------------------------------------------------------------------
[INFO] BUILD FAILURE
[INFO] ------------------------------------------------------------------------
[INFO] Total time: 9.163 s
[INFO] Finished at: 2017-09-14T00:59:41+00:00
[INFO] Final Memory: 32M/333M
[INFO] ------------------------------------------------------------------------
[ERROR] Failed to execute goal org.apache.maven.plugins:maven-shade-plugin:3.1.0:shade (default)
on project easymock: Execution default of goal org.apache.maven.plugins:maven-shade-plugin:3.1.0:shade
failed: A required class was missing while executing org.apache.maven.plugins:maven-shade-plugin:3.1.0:shade:
org/objectweb/asm/ModuleVisitor
[ERROR] -----------------------------------------------------
[ERROR] realm =    plugin>org.apache.maven.plugins:maven-shade-plugin:3.1.0
[ERROR] strategy = org.codehaus.plexus.classworlds.strategy.SelfFirstStrategy
[ERROR] urls[0] = file:/srv/gump/public/workspace/mvnlocalrepo/shared/org/apache/maven/plugins/maven-shade-plugin/3.1.0/maven-shade-plugin-3.1.0.jar
[ERROR] urls[1] = file:/srv/gump/public/workspace/mvnlocalrepo/shared/org/sonatype/sisu/sisu-inject-bean/1.4.2/sisu-inject-bean-1.4.2.jar
[ERROR] urls[2] = file:/srv/gump/public/workspace/mvnlocalrepo/shared/org/sonatype/sisu/sisu-guice/2.1.7/sisu-guice-2.1.7-noaop.jar
[ERROR] urls[3] = file:/srv/gump/public/workspace/mvnlocalrepo/shared/org/sonatype/aether/aether-util/1.7/aether-util-1.7.jar
[ERROR] urls[4] = file:/srv/gump/public/workspace/mvnlocalrepo/shared/org/codehaus/plexus/plexus-interpolation/1.14/plexus-interpolation-1.14.jar
[ERROR] urls[5] = file:/srv/gump/public/workspace/mvnlocalrepo/shared/org/codehaus/plexus/plexus-component-annotations/1.6/plexus-component-annotations-1.6.jar
[ERROR] urls[6] = file:/srv/gump/public/workspace/mvnlocalrepo/shared/org/sonatype/plexus/plexus-sec-dispatcher/1.3/plexus-sec-dispatcher-1.3.jar
[ERROR] urls[7] = file:/srv/gump/public/workspace/mvnlocalrepo/shared/org/sonatype/plexus/plexus-cipher/1.4/plexus-cipher-1.4.jar
[ERROR] urls[8] = file:/srv/gump/public/workspace/mvnlocalrepo/shared/org/codehaus/plexus/plexus-utils/3.0.24/plexus-utils-3.0.24.jar
[ERROR] urls[9] = file:/srv/gump/public/workspace/mvnlocalrepo/shared/org/apache/maven/shared/maven-artifact-transfer/0.9.1/maven-artifact-transfer-0.9.1.jar
[ERROR] urls[10] = file:/srv/gump/public/workspace/mvnlocalrepo/shared/org/apache/maven/shared/maven-common-artifact-filters/3.0.1/maven-common-artifact-filters-3.0.1.jar
[ERROR] urls[11] = file:/srv/gump/public/workspace/mvnlocalrepo/shared/org/apache/maven/shared/maven-shared-utils/3.1.0/maven-shared-utils-3.1.0.jar
[ERROR] urls[12] = file:/srv/gump/public/workspace/mvnlocalrepo/shared/commons-codec/commons-codec/1.6/commons-codec-1.6.jar
[ERROR] urls[13] = file:/srv/gump/public/workspace/mvnlocalrepo/shared/org/ow2/asm/asm/6.0_BETA/asm-6.0_BETA.jar
[ERROR] urls[14] = file:/srv/gump/public/workspace/mvnlocalrepo/shared/org/ow2/asm/asm-commons/6.0_BETA/asm-commons-6.0_BETA.jar
[ERROR] urls[15] = file:/srv/gump/public/workspace/mvnlocalrepo/shared/org/ow2/asm/asm-tree/6.0_BETA/asm-tree-6.0_BETA.jar
[ERROR] urls[16] = file:/srv/gump/public/workspace/mvnlocalrepo/shared/org/jdom/jdom/1.1.3/jdom-1.1.3.jar
[ERROR] urls[17] = file:/srv/gump/public/workspace/mvnlocalrepo/shared/org/apache/maven/shared/maven-dependency-tree/2.2/maven-dependency-tree-2.2.jar
[ERROR] urls[18] = file:/srv/gump/public/workspace/mvnlocalrepo/shared/org/eclipse/aether/aether-util/0.9.0.M2/aether-util-0.9.0.M2.jar
[ERROR] urls[19] = file:/srv/gump/public/workspace/mvnlocalrepo/shared/commons-io/commons-io/2.5/commons-io-2.5.jar
[ERROR] urls[20] = file:/srv/gump/public/workspace/mvnlocalrepo/shared/org/vafer/jdependency/1.2/jdependency-1.2.jar
[ERROR] urls[21] = file:/srv/gump/public/workspace/mvnlocalrepo/shared/org/ow2/asm/asm-analysis/6.0_BETA/asm-analysis-6.0_BETA.jar
[ERROR] urls[22] = file:/srv/gump/public/workspace/mvnlocalrepo/shared/org/ow2/asm/asm-util/6.0_BETA/asm-util-6.0_BETA.jar
[ERROR] urls[23] = file:/srv/gump/public/workspace/mvnlocalrepo/shared/com/google/guava/guava/19.0/guava-19.0.jar
[ERROR] urls[24] = file:/srv/gump/public/workspace/mvnlocalrepo/shared/com/google/code/findbugs/jsr305/1.3.9/jsr305-1.3.9.jar
[ERROR] urls[25] = file:/srv/gump/public/workspace/mvnlocalrepo/shared/com/google/errorprone/error_prone_annotations/2.0.18/error_prone_annotations-2.0.18.jar
[ERROR] urls[26] = file:/srv/gump/public/workspace/mvnlocalrepo/shared/com/google/j2objc/j2objc-annotations/1.1/j2objc-annotations-1.1.jar
[ERROR] urls[27] = file:/srv/gump/public/workspace/mvnlocalrepo/shared/org/codehaus/mojo/animal-sniffer-annotations/1.14/animal-sniffer-annotations-1.14.jar
[ERROR] Number of foreign imports: 1
[ERROR] import: Entry[import  from realm ClassRealm[project>org.easymock:easymock:3.6-SNAPSHOT,
parent: ClassRealm[maven.api, parent: null]]]
[ERROR] 
[ERROR] -----------------------------------------------------: org.objectweb.asm.ModuleVisitor
[ERROR] -> [Help 1]
[ERROR] 
[ERROR] To see the full stack trace of the errors, re-run Maven with the -e switch.
[ERROR] Re-run Maven using the -X switch to enable full debug logging.
[ERROR] 
[ERROR] For more information about the errors and possible solutions, please read the following
articles:
[ERROR] [Help 1] http://cwiki.apache.org/confluence/display/MAVEN/PluginContainerException
---------------------------------------------

To subscribe to this information via syndicated feeds:
- RSS: http://vmgump-vm3.apache.org/easymock/easymock/rss.xml
- Atom: http://vmgump-vm3.apache.org/easymock/easymock/atom.xml

============================== Gump Tracking Only ===
Produced by Apache Gump(TM) version 2.3.
Gump Run 20170914000010, vmgump-vm3.apache.org:vmgump:20170914000010
Gump E-mail Identifier (unique within run) #4.


--
Apache Gump
http://gump.apache.org/ [Instance: vmgump-vm3]

---------------------------------------------------------------------
To unsubscribe, e-mail: general-unsubscribe@gump.apache.org
For additional commands, e-mail: general-help@gump.apache.org


Mime
View raw message