gump-general mailing list archives

Site index · List index
Message view « Date » · « Thread »
Top « Date » · « Thread »
From g...@vmgump-vm3.apache.org
Subject BATCH: All dressed up, with nowhere to go...
Date Wed, 24 May 2017 10:19:15 GMT
Dear Gumpmeisters,
            
The following 2 notifys should have been sent

*********************************************************** G U M P
[GUMP@vmgump-vm3]: Project google-guava-parent (in module google-guava) failed
[GUMP@vmgump-vm3]: Project checkstyle (in module checkstyle) failed
*********************************************************** G U M P
[GUMP@vmgump-vm3]: Project google-guava-parent (in module google-guava) failed
To whom it may engage...
        
This is an automated request, but not an unsolicited one. For 
more information please visit http://gump.apache.org/nagged.html, 
and/or contact the folk at general@gump.apache.org.

Project google-guava-parent has an issue affecting its community integration.
This issue affects 1 projects.
The current state of this project is 'Failed', with reason 'Build Failed'.
For reference only, the following projects are affected by this:
    - google-guava-parent :  Guava is a suite of core and expanded libraries that include...


Full details are available at:
    http://vmgump-vm3.apache.org/google-guava/google-guava-parent/index.html

That said, some information snippets are provided here.

The following annotations (debug/informational/warning/error messages) were provided:
 -DEBUG- (Apache Gump generated) Apache Maven Settings in: /srv/gump/public/workspace/google-guava/gump_mvn_settings.xml
 -INFO- Failed with reason build failed
 -DEBUG- Maven POM in: /srv/gump/public/workspace/google-guava/pom.xml
 -INFO- Failed to extract fallback artifacts from Gump Repository



The following work was performed:
http://vmgump-vm3.apache.org/google-guava/google-guava-parent/gump_work/build_google-guava_google-guava-parent.html
Work Name: build_google-guava_google-guava-parent (Type: Build)
Work ended in a state of : Failed
Elapsed: 5 secs
Command Line: /opt/maven3/bin/mvn --batch-mode -Dpackaging=pom -DgroupId=com.google.guava
-Dfile=pom.xml -DartifactId=guava-parent -Dversion=23.0-SNAPSHOT --settings /srv/gump/public/workspace/google-guava/gump_mvn_settings.xml
install:install-file 
[Working Directory: /srv/gump/public/workspace/google-guava]
M2_HOME: /opt/maven3
---------------------------------------------
[INFO] Downloading: http://localhost:8192/maven2/org/eclipse/aether/aether-util/0.9.0.M2/aether-util-0.9.0.M2.jar
[INFO] Downloaded: http://localhost:8192/maven2/org/codehaus/plexus/plexus-io/2.0.2/plexus-io-2.0.2.jar
(57 KB at 314.4 KB/sec)
[INFO] Downloaded: http://localhost:8192/maven2/org/codehaus/plexus/plexus-archiver/2.1/plexus-archiver-2.1.jar
(181 KB at 989.6 KB/sec)
[INFO] Downloading: http://localhost:8192/maven2/org/codehaus/plexus/plexus-utils/3.0.10/plexus-utils-3.0.10.jar
[INFO] Downloading: http://localhost:8192/maven2/org/apache/maven/doxia/doxia-sink-api/1.0/doxia-sink-api-1.0.jar
[INFO] Downloaded: http://localhost:8192/maven2/org/apache/maven/shared/maven-dependency-tree/2.1/maven-dependency-tree-2.1.jar
(59 KB at 314.8 KB/sec)
[INFO] Downloading: http://localhost:8192/maven2/org/apache/maven/doxia/doxia-site-renderer/1.0/doxia-site-renderer-1.0.jar
[INFO] Downloaded: http://localhost:8192/maven2/org/codehaus/plexus/plexus-component-annotations/1.5.5/plexus-component-annotations-1.5.5.jar
(5 KB at 20.8 KB/sec)
[INFO] Downloading: http://localhost:8192/maven2/org/apache/maven/doxia/doxia-core/1.0/doxia-core-1.0.jar
[INFO] Downloaded: http://localhost:8192/maven2/org/eclipse/aether/aether-util/0.9.0.M2/aether-util-0.9.0.M2.jar
(131 KB at 642.6 KB/sec)
[INFO] Downloading: http://localhost:8192/maven2/org/codehaus/plexus/plexus-i18n/1.0-beta-7/plexus-i18n-1.0-beta-7.jar
[INFO] Downloaded: http://localhost:8192/maven2/org/codehaus/plexus/plexus-utils/3.0.10/plexus-utils-3.0.10.jar
(226 KB at 1063.5 KB/sec)
[INFO] Downloading: http://localhost:8192/maven2/org/codehaus/plexus/plexus-velocity/1.1.7/plexus-velocity-1.1.7.jar
[INFO] Downloaded: http://localhost:8192/maven2/org/apache/maven/doxia/doxia-site-renderer/1.0/doxia-site-renderer-1.0.jar
(46 KB at 207.4 KB/sec)
[INFO] Downloading: http://localhost:8192/maven2/org/apache/velocity/velocity/1.5/velocity-1.5.jar
[INFO] Downloaded: http://localhost:8192/maven2/org/apache/maven/doxia/doxia-sink-api/1.0/doxia-sink-api-1.0.jar
(10 KB at 44.5 KB/sec)
[INFO] Downloading: http://localhost:8192/maven2/commons-lang/commons-lang/2.1/commons-lang-2.1.jar
[INFO] Downloaded: http://localhost:8192/maven2/org/apache/maven/doxia/doxia-core/1.0/doxia-core-1.0.jar
(54 KB at 239.6 KB/sec)
[INFO] Downloaded: http://localhost:8192/maven2/org/codehaus/plexus/plexus-i18n/1.0-beta-7/plexus-i18n-1.0-beta-7.jar
(11 KB at 45.6 KB/sec)
[INFO] Downloading: http://localhost:8192/maven2/oro/oro/2.0.8/oro-2.0.8.jar
[INFO] Downloading: http://localhost:8192/maven2/org/apache/maven/doxia/doxia-decoration-model/1.0/doxia-decoration-model-1.0.jar
[INFO] Downloaded: http://localhost:8192/maven2/commons-lang/commons-lang/2.1/commons-lang-2.1.jar
(279 KB at 1156.3 KB/sec)
[INFO] Downloading: http://localhost:8192/maven2/commons-collections/commons-collections/3.2/commons-collections-3.2.jar
[INFO] Downloaded: http://localhost:8192/maven2/org/codehaus/plexus/plexus-velocity/1.1.7/plexus-velocity-1.1.7.jar
(8 KB at 30.9 KB/sec)
[INFO] Downloading: http://localhost:8192/maven2/org/apache/maven/doxia/doxia-module-apt/1.0/doxia-module-apt-1.0.jar
[INFO] Downloaded: http://localhost:8192/maven2/oro/oro/2.0.8/oro-2.0.8.jar (64 KB at 257.0
KB/sec)
[INFO] Downloading: http://localhost:8192/maven2/org/apache/maven/doxia/doxia-module-fml/1.0/doxia-module-fml-1.0.jar
[INFO] Downloaded: http://localhost:8192/maven2/org/apache/maven/doxia/doxia-decoration-model/1.0/doxia-decoration-model-1.0.jar
(48 KB at 184.7 KB/sec)
[INFO] Downloading: http://localhost:8192/maven2/org/apache/maven/doxia/doxia-module-xdoc/1.0/doxia-module-xdoc-1.0.jar
[INFO] Downloaded: http://localhost:8192/maven2/org/apache/maven/doxia/doxia-module-apt/1.0/doxia-module-apt-1.0.jar
(46 KB at 176.8 KB/sec)
[INFO] Downloading: http://localhost:8192/maven2/org/apache/maven/doxia/doxia-module-xhtml/1.0/doxia-module-xhtml-1.0.jar
[INFO] Downloaded: http://localhost:8192/maven2/org/apache/maven/doxia/doxia-module-fml/1.0/doxia-module-fml-1.0.jar
(19 KB at 67.8 KB/sec)
[INFO] Downloaded: http://localhost:8192/maven2/org/apache/maven/doxia/doxia-module-xdoc/1.0/doxia-module-xdoc-1.0.jar
(28 KB at 99.4 KB/sec)
[INFO] Downloaded: http://localhost:8192/maven2/org/apache/velocity/velocity/1.5/velocity-1.5.jar
(383 KB at 1397.6 KB/sec)
[INFO] Downloaded: http://localhost:8192/maven2/org/apache/maven/doxia/doxia-module-xhtml/1.0/doxia-module-xhtml-1.0.jar
(22 KB at 77.4 KB/sec)
[INFO] Downloaded: http://localhost:8192/maven2/commons-collections/commons-collections/3.2/commons-collections-3.2.jar
(562 KB at 1978.5 KB/sec)
[ERROR] [ERROR] Some problems were encountered while processing the POMs:
[FATAL] Non-resolvable parent POM for com.google.guava:guava-gwt:[unknown-version]: Could
not find artifact com.google.guava:guava-parent:pom:22.0-SNAPSHOT in sonatype-google-snapshots
(https://oss.sonatype.org/content/repositories/google-snapshots/) and 'parent.relativePath'
points at wrong local POM @ line 5, column 11
 @ 
[ERROR] The build could not read 1 project -> [Help 1]
[ERROR]   
[ERROR]   The project com.google.guava:guava-gwt:[unknown-version] (/srv/gump/public/workspace/google-guava/guava-gwt/pom.xml)
has 1 error
[ERROR]     Non-resolvable parent POM for com.google.guava:guava-gwt:[unknown-version]: Could
not find artifact com.google.guava:guava-parent:pom:22.0-SNAPSHOT in sonatype-google-snapshots
(https://oss.sonatype.org/content/repositories/google-snapshots/) and 'parent.relativePath'
points at wrong local POM @ line 5, column 11 -> [Help 2]
[ERROR] 
[ERROR] To see the full stack trace of the errors, re-run Maven with the -e switch.
[ERROR] Re-run Maven using the -X switch to enable full debug logging.
[ERROR] 
[ERROR] For more information about the errors and possible solutions, please read the following
articles:
[ERROR] [Help 1] http://cwiki.apache.org/confluence/display/MAVEN/ProjectBuildingException
[ERROR] [Help 2] http://cwiki.apache.org/confluence/display/MAVEN/UnresolvableModelException
---------------------------------------------

To subscribe to this information via syndicated feeds:
- RSS: http://vmgump-vm3.apache.org/google-guava/google-guava-parent/rss.xml
- Atom: http://vmgump-vm3.apache.org/google-guava/google-guava-parent/atom.xml

============================== Gump Tracking Only ===
Produced by Apache Gump(TM) version 2.3.
Gump Run 20170524060006, vmgump-vm3.apache.org:vmgump:20170524060006
Gump E-mail Identifier (unique within run) #1.

*********************************************************** G U M P
[GUMP@vmgump-vm3]: Project checkstyle (in module checkstyle) failed
To whom it may engage...
        
This is an automated request, but not an unsolicited one. For 
more information please visit http://gump.apache.org/nagged.html, 
and/or contact the folk at general@gump.apache.org.

Project checkstyle has an issue affecting its community integration.
This issue affects 5 projects.
The current state of this project is 'Failed', with reason 'Build Failed'.
For reference only, the following projects are affected by this:
    - checkstyle :  Java style checker
    - tomcat-tc7.0.x-validate :  Tomcat 7.x, a web server implementing Java Servlet 3.0,
    ...
    - tomcat-tc8.0.x-validate :  Tomcat 8.x, a web server implementing the Java Servlet 3.1,
...
    - tomcat-trunk-validate :  Tomcat 9.x, a web server implementing the Java Servlet 4.0,
...
    - xmlgraphics-commons-test :  Apache XML Graphics Commons - Common Components for Batik
an...


Full details are available at:
    http://vmgump-vm3.apache.org/checkstyle/checkstyle/index.html

That said, some information snippets are provided here.

The following annotations (debug/informational/warning/error messages) were provided:
 -DEBUG- (Apache Gump generated) Apache Maven Settings in: /srv/gump/public/workspace/checkstyle/gump_mvn_settings.xml
 -INFO- Failed with reason build failed
 -DEBUG- Maven POM in: /srv/gump/public/workspace/checkstyle/pom.xml
 -INFO- Failed to extract fallback artifacts from Gump Repository



The following work was performed:
http://vmgump-vm3.apache.org/checkstyle/checkstyle/gump_work/build_checkstyle_checkstyle.html
Work Name: build_checkstyle_checkstyle (Type: Build)
Work ended in a state of : Failed
Elapsed: 27 secs
Command Line: /opt/maven3/bin/mvn --batch-mode -Dcobertura.skip=true -DskipTests=true -Dfindbugs.skip=true
-Dcheckstyle.ant.skip=true -Dcheckstyle.skip=true --settings /srv/gump/public/workspace/checkstyle/gump_mvn_settings.xml
install 
[Working Directory: /srv/gump/public/workspace/checkstyle]
M2_HOME: /opt/maven3
---------------------------------------------
[INFO] Downloading: http://localhost:8192/maven2/junit/junit/4.11-beta-1/junit-4.11-beta-1.pom
[INFO] Downloaded: http://localhost:8192/maven2/junit/junit/4.11-beta-1/junit-4.11-beta-1.pom
(25 KB at 4006.8 KB/sec)
[INFO] Downloading: http://localhost:8192/maven2/nl/jqno/equalsverifier/equalsverifier/2.2.2/equalsverifier-2.2.2.pom
[INFO] Downloaded: http://localhost:8192/maven2/nl/jqno/equalsverifier/equalsverifier/2.2.2/equalsverifier-2.2.2.pom
(13 KB at 996.4 KB/sec)
[INFO] Downloading: http://localhost:8192/maven2/org/eclipse/jgit/org.eclipse.jgit/4.7.0.201704051617-r/org.eclipse.jgit-4.7.0.201704051617-r.pom
[INFO] Downloaded: http://localhost:8192/maven2/org/eclipse/jgit/org.eclipse.jgit/4.7.0.201704051617-r/org.eclipse.jgit-4.7.0.201704051617-r.pom
(10 KB at 480.6 KB/sec)
[INFO] Downloading: http://localhost:8192/maven2/org/eclipse/jgit/org.eclipse.jgit-parent/4.7.0.201704051617-r/org.eclipse.jgit-parent-4.7.0.201704051617-r.pom
[INFO] Downloaded: http://localhost:8192/maven2/org/eclipse/jgit/org.eclipse.jgit-parent/4.7.0.201704051617-r/org.eclipse.jgit-parent-4.7.0.201704051617-r.pom
(29 KB at 2002.2 KB/sec)
[INFO] Downloading: http://localhost:8192/maven2/com/jcraft/jsch/0.1.54/jsch-0.1.54.pom
[INFO] Downloaded: http://localhost:8192/maven2/com/jcraft/jsch/0.1.54/jsch-0.1.54.pom (4
KB at 287.2 KB/sec)
[INFO] Downloading: http://localhost:8192/maven2/com/googlecode/javaewah/JavaEWAH/1.1.6/JavaEWAH-1.1.6.pom
[INFO] Downloaded: http://localhost:8192/maven2/com/googlecode/javaewah/JavaEWAH/1.1.6/JavaEWAH-1.1.6.pom
(6 KB at 490.6 KB/sec)
[INFO] Downloading: http://localhost:8192/maven2/org/apache/httpcomponents/httpclient/4.3.6/httpclient-4.3.6.pom
[INFO] Downloaded: http://localhost:8192/maven2/org/apache/httpcomponents/httpclient/4.3.6/httpclient-4.3.6.pom
(6 KB at 339.1 KB/sec)
[INFO] Downloading: http://localhost:8192/maven2/org/apache/httpcomponents/httpcomponents-client/4.3.6/httpcomponents-client-4.3.6.pom
[INFO] Downloaded: http://localhost:8192/maven2/org/apache/httpcomponents/httpcomponents-client/4.3.6/httpcomponents-client-4.3.6.pom
(16 KB at 1112.3 KB/sec)
[INFO] Downloading: http://localhost:8192/maven2/org/apache/httpcomponents/httpcore/4.3.3/httpcore-4.3.3.pom
[INFO] Downloaded: http://localhost:8192/maven2/org/apache/httpcomponents/httpcore/4.3.3/httpcore-4.3.3.pom
(5 KB at 299.3 KB/sec)
[INFO] Downloading: http://localhost:8192/maven2/org/apache/httpcomponents/httpcomponents-core/4.3.3/httpcomponents-core-4.3.3.pom
[INFO] Downloaded: http://localhost:8192/maven2/org/apache/httpcomponents/httpcomponents-core/4.3.3/httpcomponents-core-4.3.3.pom
(13 KB at 613.3 KB/sec)
[INFO] Downloading: http://localhost:8192/maven2/commons-logging/commons-logging/1.1.3/commons-logging-1.1.3.pom
[INFO] Downloaded: http://localhost:8192/maven2/commons-logging/commons-logging/1.1.3/commons-logging-1.1.3.pom
(18 KB at 1629.4 KB/sec)
[INFO] Downloading: http://localhost:8192/maven2/org/slf4j/slf4j-api/1.7.2/slf4j-api-1.7.2.pom
[INFO] Downloaded: http://localhost:8192/maven2/org/slf4j/slf4j-api/1.7.2/slf4j-api-1.7.2.pom
(3 KB at 218.8 KB/sec)
[INFO] Downloading: http://localhost:8192/maven2/org/slf4j/slf4j-parent/1.7.2/slf4j-parent-1.7.2.pom
[INFO] Downloaded: http://localhost:8192/maven2/org/slf4j/slf4j-parent/1.7.2/slf4j-parent-1.7.2.pom
(12 KB at 823.4 KB/sec)
[INFO] Downloading: http://localhost:8192/maven2/org/slf4j/slf4j-simple/1.7.25/slf4j-simple-1.7.25.pom
[INFO] Downloaded: http://localhost:8192/maven2/org/slf4j/slf4j-simple/1.7.25/slf4j-simple-1.7.25.pom
(1015 B at 76.2 KB/sec)
[INFO] Downloading: http://localhost:8192/maven2/org/slf4j/slf4j-parent/1.7.25/slf4j-parent-1.7.25.pom
[INFO] Downloaded: http://localhost:8192/maven2/org/slf4j/slf4j-parent/1.7.25/slf4j-parent-1.7.25.pom
(14 KB at 1099.4 KB/sec)
[INFO] Downloading: http://localhost:8192/maven2/org/slf4j/slf4j-api/1.7.25/slf4j-api-1.7.25.pom
[INFO] Downloaded: http://localhost:8192/maven2/org/slf4j/slf4j-api/1.7.25/slf4j-api-1.7.25.pom
(4 KB at 340.3 KB/sec)
[INFO] Downloading: http://localhost:8192/maven2/org/jacoco/org.jacoco.agent/0.7.9/org.jacoco.agent-0.7.9.pom
[INFO] Downloaded: http://localhost:8192/maven2/org/jacoco/org.jacoco.agent/0.7.9/org.jacoco.agent-0.7.9.pom
(4 KB at 287.3 KB/sec)
[INFO] Downloading: http://localhost:8192/maven2/org/jacoco/org.jacoco.build/0.7.9/org.jacoco.build-0.7.9.pom
[INFO] Downloaded: http://localhost:8192/maven2/org/jacoco/org.jacoco.build/0.7.9/org.jacoco.build-0.7.9.pom
(34 KB at 2600.9 KB/sec)
[INFO] ------------------------------------------------------------------------
[INFO] BUILD FAILURE
[INFO] ------------------------------------------------------------------------
[INFO] Total time: 25.931 s
[INFO] Finished at: 2017-05-24T07:15:21+00:00
[INFO] Final Memory: 18M/162M
[INFO] ------------------------------------------------------------------------
[ERROR] Failed to execute goal on project checkstyle: Could not resolve dependencies for project
com.puppycrawl.tools:checkstyle:jar:7.8-SNAPSHOT: Failed to collect dependencies at com.google.guava:guava:jar:21.0:
Failed to read artifact descriptor for com.google.guava:guava:jar:21.0: Could not find artifact
com.google.guava:guava-parent:pom:23.0-SNAPSHOT in gump-sonatype-nexus-snapshots (http://localhost:8192/content/repositories/snapshots)
-> [Help 1]
[ERROR] 
[ERROR] To see the full stack trace of the errors, re-run Maven with the -e switch.
[ERROR] Re-run Maven using the -X switch to enable full debug logging.
[ERROR] 
[ERROR] For more information about the errors and possible solutions, please read the following
articles:
[ERROR] [Help 1] http://cwiki.apache.org/confluence/display/MAVEN/DependencyResolutionException
---------------------------------------------

To subscribe to this information via syndicated feeds:
- RSS: http://vmgump-vm3.apache.org/checkstyle/checkstyle/rss.xml
- Atom: http://vmgump-vm3.apache.org/checkstyle/checkstyle/atom.xml

============================== Gump Tracking Only ===
Produced by Apache Gump(TM) version 2.3.
Gump Run 20170524060006, vmgump-vm3.apache.org:vmgump:20170524060006
Gump E-mail Identifier (unique within run) #2.


--
Apache Gump
http://gump.apache.org/ [Instance: vmgump-vm3]

---------------------------------------------------------------------
To unsubscribe, e-mail: general-unsubscribe@gump.apache.org
For additional commands, e-mail: general-help@gump.apache.org


Mime
View raw message