gump-general mailing list archives

Site index · List index
Message view « Date » · « Thread »
Top « Date » · « Thread »
From g...@vmgump-vm3.apache.org
Subject BATCH: All dressed up, with nowhere to go...
Date Fri, 24 Feb 2017 16:27:08 GMT
Dear Gumpmeisters,
            
The following 1 notifys should have been sent

*********************************************************** G U M P
[GUMP@vmgump-vm3]: Project checkstyle (in module checkstyle) failed
*********************************************************** G U M P
[GUMP@vmgump-vm3]: Project checkstyle (in module checkstyle) failed
To whom it may engage...
        
This is an automated request, but not an unsolicited one. For 
more information please visit http://gump.apache.org/nagged.html, 
and/or contact the folk at general@gump.apache.org.

Project checkstyle has an issue affecting its community integration.
This issue affects 5 projects.
The current state of this project is 'Failed', with reason 'Build Failed'.
For reference only, the following projects are affected by this:
    - checkstyle :  Java style checker
    - tomcat-tc7.0.x-validate :  Tomcat 7.x, a web server implementing Java Servlet 3.0,
    ...
    - tomcat-tc8.0.x-validate :  Tomcat 8.x, a web server implementing the Java Servlet 3.1,
...
    - tomcat-trunk-validate :  Tomcat 9.x, a web server implementing the Java Servlet 4.0,
...
    - xmlgraphics-commons-test :  Apache XML Graphics Commons - Common Components for Batik
an...


Full details are available at:
    http://vmgump-vm3.apache.org/checkstyle/checkstyle/index.html

That said, some information snippets are provided here.

The following annotations (debug/informational/warning/error messages) were provided:
 -DEBUG- (Apache Gump generated) Apache Maven Settings in: /srv/gump/public/workspace/checkstyle/gump_mvn_settings.xml
 -INFO- Failed with reason build failed
 -DEBUG- Maven POM in: /srv/gump/public/workspace/checkstyle/pom.xml
 -INFO- Failed to extract fallback artifacts from Gump Repository



The following work was performed:
http://vmgump-vm3.apache.org/checkstyle/checkstyle/gump_work/build_checkstyle_checkstyle.html
Work Name: build_checkstyle_checkstyle (Type: Build)
Work ended in a state of : Failed
Elapsed: 4 mins 45 secs
Command Line: /opt/maven3/bin/mvn --batch-mode -Dcobertura.skip=true -DskipTests=true -Dfindbugs.skip=true
--settings /srv/gump/public/workspace/checkstyle/gump_mvn_settings.xml install 
[Working Directory: /srv/gump/public/workspace/checkstyle]
M2_HOME: /opt/maven3
---------------------------------------------
[INFO] --- maven-checkstyle-plugin:2.17:check (sevntu-checkstyle-check) @ checkstyle ---
[INFO] Downloading: https://oss.sonatype.org/content/repositories/codehaus-snapshots/com/github/sevntu/checkstyle/sevntu-checkstyle-maven-plugin/1.23.0/sevntu-checkstyle-maven-plugin-1.23.0.pom
[INFO] Downloading: http://sevntu-checkstyle.github.io/sevntu.checkstyle/maven2/com/github/sevntu/checkstyle/sevntu-checkstyle-maven-plugin/1.23.0/sevntu-checkstyle-maven-plugin-1.23.0.pom
[INFO] Downloaded: http://sevntu-checkstyle.github.io/sevntu.checkstyle/maven2/com/github/sevntu/checkstyle/sevntu-checkstyle-maven-plugin/1.23.0/sevntu-checkstyle-maven-plugin-1.23.0.pom
(2 KB at 5.1 KB/sec)
[INFO] Downloading: https://oss.sonatype.org/content/repositories/codehaus-snapshots/com/github/sevntu/checkstyle/sevntu-checks/1.23.0/sevntu-checks-1.23.0.pom
[INFO] Downloading: http://sevntu-checkstyle.github.io/sevntu.checkstyle/maven2/com/github/sevntu/checkstyle/sevntu-checks/1.23.0/sevntu-checks-1.23.0.pom
[INFO] Downloaded: http://sevntu-checkstyle.github.io/sevntu.checkstyle/maven2/com/github/sevntu/checkstyle/sevntu-checks/1.23.0/sevntu-checks-1.23.0.pom
(11 KB at 52.3 KB/sec)
[INFO] Downloading: https://oss.sonatype.org/content/repositories/codehaus-snapshots/com/puppycrawl/tools/checkstyle/7.2/checkstyle-7.2.pom
[INFO] Downloading: http://sevntu-checkstyle.github.io/sevntu.checkstyle/maven2/com/puppycrawl/tools/checkstyle/7.2/checkstyle-7.2.pom
[INFO] Downloading: http://localhost:8192/maven2/com/puppycrawl/tools/checkstyle/7.2/checkstyle-7.2.pom
[INFO] Downloaded: http://localhost:8192/maven2/com/puppycrawl/tools/checkstyle/7.2/checkstyle-7.2.pom
(71 KB at 3718.8 KB/sec)
[INFO] Downloading: https://oss.sonatype.org/content/repositories/codehaus-snapshots/org/antlr/antlr4-runtime/4.5.3/antlr4-runtime-4.5.3.pom
[INFO] Downloading: http://sevntu-checkstyle.github.io/sevntu.checkstyle/maven2/org/antlr/antlr4-runtime/4.5.3/antlr4-runtime-4.5.3.pom
[INFO] Downloading: http://localhost:8192/maven2/org/antlr/antlr4-runtime/4.5.3/antlr4-runtime-4.5.3.pom
[INFO] Downloaded: http://localhost:8192/maven2/org/antlr/antlr4-runtime/4.5.3/antlr4-runtime-4.5.3.pom
(3 KB at 188.0 KB/sec)
[INFO] Downloading: https://oss.sonatype.org/content/repositories/codehaus-snapshots/org/antlr/antlr4-master/4.5.3/antlr4-master-4.5.3.pom
[INFO] Downloading: http://sevntu-checkstyle.github.io/sevntu.checkstyle/maven2/org/antlr/antlr4-master/4.5.3/antlr4-master-4.5.3.pom
[INFO] Downloading: http://localhost:8192/maven2/org/antlr/antlr4-master/4.5.3/antlr4-master-4.5.3.pom
[INFO] Downloaded: http://localhost:8192/maven2/org/antlr/antlr4-master/4.5.3/antlr4-master-4.5.3.pom
(4 KB at 239.8 KB/sec)
[INFO] Downloading: https://oss.sonatype.org/content/repositories/codehaus-snapshots/com/puppycrawl/tools/checkstyle/7.5.1/checkstyle-7.5.1.pom
[INFO] Downloading: http://sevntu-checkstyle.github.io/sevntu.checkstyle/maven2/com/puppycrawl/tools/checkstyle/7.5.1/checkstyle-7.5.1.pom
[INFO] Downloading: http://localhost:8192/maven2/com/puppycrawl/tools/checkstyle/7.5.1/checkstyle-7.5.1.pom
[INFO] Downloaded: http://localhost:8192/maven2/com/puppycrawl/tools/checkstyle/7.5.1/checkstyle-7.5.1.pom
(68 KB at 4796.2 KB/sec)
[INFO] Downloading: https://oss.sonatype.org/content/repositories/codehaus-snapshots/com/github/sevntu/checkstyle/sevntu-checkstyle-maven-plugin/1.23.0/sevntu-checkstyle-maven-plugin-1.23.0.jar
[INFO] Downloading: https://oss.sonatype.org/content/repositories/codehaus-snapshots/com/github/sevntu/checkstyle/sevntu-checks/1.23.0/sevntu-checks-1.23.0.jar
[INFO] Downloading: https://oss.sonatype.org/content/repositories/codehaus-snapshots/com/puppycrawl/tools/checkstyle/7.5.1/checkstyle-7.5.1.jar
[INFO] Downloading: https://oss.sonatype.org/content/repositories/codehaus-snapshots/org/codehaus/plexus/plexus-interpolation/1.21/plexus-interpolation-1.21.jar
[INFO] Downloading: http://sevntu-checkstyle.github.io/sevntu.checkstyle/maven2/com/github/sevntu/checkstyle/sevntu-checkstyle-maven-plugin/1.23.0/sevntu-checkstyle-maven-plugin-1.23.0.jar
[INFO] Downloading: http://sevntu-checkstyle.github.io/sevntu.checkstyle/maven2/com/github/sevntu/checkstyle/sevntu-checks/1.23.0/sevntu-checks-1.23.0.jar
[INFO] Downloading: http://sevntu-checkstyle.github.io/sevntu.checkstyle/maven2/com/puppycrawl/tools/checkstyle/7.5.1/checkstyle-7.5.1.jar
[INFO] Downloading: http://sevntu-checkstyle.github.io/sevntu.checkstyle/maven2/org/codehaus/plexus/plexus-interpolation/1.21/plexus-interpolation-1.21.jar
[INFO] Downloaded: http://sevntu-checkstyle.github.io/sevntu.checkstyle/maven2/com/github/sevntu/checkstyle/sevntu-checkstyle-maven-plugin/1.23.0/sevntu-checkstyle-maven-plugin-1.23.0.jar
(3 KB at 11.3 KB/sec)
[INFO] Downloaded: http://sevntu-checkstyle.github.io/sevntu.checkstyle/maven2/com/github/sevntu/checkstyle/sevntu-checks/1.23.0/sevntu-checks-1.23.0.jar
(161 KB at 294.2 KB/sec)
[INFO] Downloading: http://localhost:8192/maven2/com/puppycrawl/tools/checkstyle/7.5.1/checkstyle-7.5.1.jar
[INFO] Downloading: http://localhost:8192/maven2/org/codehaus/plexus/plexus-interpolation/1.21/plexus-interpolation-1.21.jar
[INFO] Downloaded: http://localhost:8192/maven2/org/codehaus/plexus/plexus-interpolation/1.21/plexus-interpolation-1.21.jar
(61 KB at 2259.0 KB/sec)
[INFO] ------------------------------------------------------------------------
[INFO] BUILD FAILURE
[INFO] ------------------------------------------------------------------------
[INFO] Total time: 04:43 min
[INFO] Finished at: 2017-02-24T13:18:20+00:00
[INFO] Final Memory: 48M/439M
[INFO] ------------------------------------------------------------------------
[ERROR] Failed to execute goal org.apache.maven.plugins:maven-checkstyle-plugin:2.17:check
(sevntu-checkstyle-check) on project checkstyle: Execution sevntu-checkstyle-check of goal
org.apache.maven.plugins:maven-checkstyle-plugin:2.17:check failed: Plugin org.apache.maven.plugins:maven-checkstyle-plugin:2.17
or one of its dependencies could not be resolved: Could not transfer artifact com.puppycrawl.tools:checkstyle:jar:7.5.1
from/to gump-central (http://localhost:8192/maven2): TransferFailedException: ClientProtocolException:
Status line contains invalid status code: HTTP/1.1 :01 :01 -> [Help 1]
[ERROR] 
[ERROR] To see the full stack trace of the errors, re-run Maven with the -e switch.
[ERROR] Re-run Maven using the -X switch to enable full debug logging.
[ERROR] 
[ERROR] For more information about the errors and possible solutions, please read the following
articles:
[ERROR] [Help 1] http://cwiki.apache.org/confluence/display/MAVEN/PluginResolutionException
---------------------------------------------

To subscribe to this information via syndicated feeds:
- RSS: http://vmgump-vm3.apache.org/checkstyle/checkstyle/rss.xml
- Atom: http://vmgump-vm3.apache.org/checkstyle/checkstyle/atom.xml

============================== Gump Tracking Only ===
Produced by Apache Gump(TM) version 2.3.
Gump Run 20170224120005, vmgump-vm3.apache.org:vmgump:20170224120005
Gump E-mail Identifier (unique within run) #1.


--
Apache Gump
http://gump.apache.org/ [Instance: vmgump-vm3]

---------------------------------------------------------------------
To unsubscribe, e-mail: general-unsubscribe@gump.apache.org
For additional commands, e-mail: general-help@gump.apache.org


Mime
View raw message