gump-general mailing list archives

Site index · List index
Message view « Date » · « Thread »
Top « Date » · « Thread »
From g...@vmgump-vm3.apache.org
Subject BATCH: All dressed up, with nowhere to go...
Date Fri, 24 Feb 2017 04:07:07 GMT
Dear Gumpmeisters,
            
The following 6 notifys should have been sent

*********************************************************** G U M P
[GUMP@vmgump-vm3]: Project logging-log4j-12 (in module logging-log4j-12) failed
[GUMP@vmgump-vm3]: Project google-guava (in module google-guava) failed
[GUMP@vmgump-vm3]: Project compress-antlib-test (in module antlibs-compress) failed
[GUMP@vmgump-vm3]: Project fontbox (in module pdfbox) failed
[GUMP@vmgump-vm3]: Project test-ant (in module ant) failed
[GUMP@vmgump-vm3]: Project commons-bcel (in module apache-commons) failed
*********************************************************** G U M P
[GUMP@vmgump-vm3]: Project logging-log4j-12 (in module logging-log4j-12) failed
To whom it may engage...
        
This is an automated request, but not an unsolicited one. For 
more information please visit http://gump.apache.org/nagged.html, 
and/or contact the folk at general@gump.apache.org.

Project logging-log4j-12 has an issue affecting its community integration.
This issue affects 23 projects,
 and has been outstanding for 466 runs.
The current state of this project is 'Failed', with reason 'Build Failed'.
For reference only, the following projects are affected by this:
    - checkstyle :  Java style checker
    - commons-beanutils :  Bean Utilities
    - commons-digester :  XML to Java Object Configuration
    - commons-logging :  Logging Library Package
    - commons-logging-step-1 :  Logging Library Package
    - commons-modeler :  Modeler MBeans
    - forrest-core :  Apache Forrest software is a publishing framework that trans...
    - forrest-test :  Apache Forrest software is a publishing framework that trans...
    - forrest-test-basic :  Apache Forrest software is a publishing framework that trans...
    - forrest-test-deploy-plugins :  Apache Forrest software is a publishing framework that
trans...
    - jakarta-bsf :  Bean Scripting Framework
    - logging-log4j-12 :  Fast and flexible logging package for Java
    - logging-log4j-12-tests :  Fast and flexible logging package for Java
    - org.apache.poi :  POI
    - poi :  POI
    - poi-test :  POI
    - tomcat-tc6 :  Java Servlet 2.5 & Server Pages JSP 2.1 implementation (for ...
    - tomcat-tc7.0.x-validate :  Tomcat 7.x, a web server implementing Java Servlet 3.0,
    ...
    - tomcat-tc8.0.x-validate :  Tomcat 8.x, a web server implementing the Java Servlet 3.1,
...
    - tomcat-trunk-validate :  Tomcat 9.x, a web server implementing the Java Servlet 4.0,
...
    - xml-batik :  Scalable Vector Graphics
    - xmlgraphics-commons :  Apache XML Graphics Commons - Common Components for Batik an...
    - xmlgraphics-commons-test :  Apache XML Graphics Commons - Common Components for Batik
an...


Full details are available at:
    http://vmgump-vm3.apache.org/logging-log4j-12/logging-log4j-12/index.html

That said, some information snippets are provided here.

The following annotations (debug/informational/warning/error messages) were provided:
 -DEBUG- (Apache Gump generated) Apache Maven Settings in: /srv/gump/public/workspace/logging-log4j-12/gump_mvn_settings.xml
 -INFO- Failed with reason build failed
 -DEBUG- Maven POM in: /srv/gump/public/workspace/logging-log4j-12/pom.xml
 -DEBUG- Extracted fallback artifacts from Gump Repository



The following work was performed:
http://vmgump-vm3.apache.org/logging-log4j-12/logging-log4j-12/gump_work/build_logging-log4j-12_logging-log4j-12.html
Work Name: build_logging-log4j-12_logging-log4j-12 (Type: Build)
Work ended in a state of : Failed
Elapsed: 6 mins 33 secs
Command Line: /opt/maven2/bin/mvn --batch-mode -DskipTests=true -Dmaven.javadoc.failOnError=false
--settings /srv/gump/public/workspace/logging-log4j-12/gump_mvn_settings.xml package 
[Working Directory: /srv/gump/public/workspace/logging-log4j-12]
M2_HOME: /opt/maven2
---------------------------------------------
Downloading: http://localhost:8192/maven/2/org/slf4j/slf4j-jdk14/1.5.6/slf4j-jdk14-1.5.6.pom
[INFO] Unable to find resource 'org.slf4j:slf4j-jdk14:pom:1.5.6' in repository maven2-repository.dev.java.net
(http://download.java.net/maven/2/)
Downloading: http://localhost:8192/maven2/org/slf4j/slf4j-jdk14/1.5.6/slf4j-jdk14-1.5.6.pom
1K downloaded  (slf4j-jdk14-1.5.6.pom)
Downloading: http://localhost:8192/maven/2/org/slf4j/slf4j-parent/1.5.6/slf4j-parent-1.5.6.pom
[INFO] Unable to find resource 'org.slf4j:slf4j-parent:pom:1.5.6' in repository maven2-repository.dev.java.net
(http://download.java.net/maven/2/)
Downloading: http://localhost:8192/maven2/org/slf4j/slf4j-parent/1.5.6/slf4j-parent-1.5.6.pom
7K downloaded  (slf4j-parent-1.5.6.pom)
Downloading: http://localhost:8192/maven/2/org/slf4j/slf4j-api/1.5.6/slf4j-api-1.5.6.pom
[INFO] Unable to find resource 'org.slf4j:slf4j-api:pom:1.5.6' in repository maven2-repository.dev.java.net
(http://download.java.net/maven/2/)
Downloading: http://localhost:8192/maven2/org/slf4j/slf4j-api/1.5.6/slf4j-api-1.5.6.pom
2K downloaded  (slf4j-api-1.5.6.pom)
Downloading: http://localhost:8192/maven/2/org/slf4j/jcl-over-slf4j/1.5.6/jcl-over-slf4j-1.5.6.pom
[INFO] Unable to find resource 'org.slf4j:jcl-over-slf4j:pom:1.5.6' in repository maven2-repository.dev.java.net
(http://download.java.net/maven/2/)
Downloading: http://localhost:8192/maven2/org/slf4j/jcl-over-slf4j/1.5.6/jcl-over-slf4j-1.5.6.pom
2K downloaded  (jcl-over-slf4j-1.5.6.pom)
Downloading: http://localhost:8192/maven/2/org/apache/maven/reporting/maven-reporting-api/2.2.1/maven-reporting-api-2.2.1.pom
[INFO] Unable to find resource 'org.apache.maven.reporting:maven-reporting-api:pom:2.2.1'
in repository maven2-repository.dev.java.net (http://download.java.net/maven/2/)
Downloading: http://localhost:8192/maven2/org/apache/maven/reporting/maven-reporting-api/2.2.1/maven-reporting-api-2.2.1.pom
1K downloaded  (maven-reporting-api-2.2.1.pom)
Downloading: http://localhost:8192/maven/2/org/apache/maven/reporting/maven-reporting/2.2.1/maven-reporting-2.2.1.pom
[INFO] Unable to find resource 'org.apache.maven.reporting:maven-reporting:pom:2.2.1' in repository
maven2-repository.dev.java.net (http://download.java.net/maven/2/)
Downloading: http://localhost:8192/maven2/org/apache/maven/reporting/maven-reporting/2.2.1/maven-reporting-2.2.1.pom
[WARNING] Unable to get resource 'org.apache.maven.reporting:maven-reporting:pom:2.2.1' from
repository central (http://repo1.maven.org/maven2): Error transferring file: Invalid Http
response
[INFO] ------------------------------------------------------------------------
[ERROR] BUILD ERROR
[INFO] ------------------------------------------------------------------------
[INFO] Failed to resolve artifact.

Unable to get dependency information: Unable to read the metadata file for artifact 'org.apache.maven.reporting:maven-reporting-api:jar':
Cannot find parent: org.apache.maven.reporting:maven-reporting for project: null:maven-reporting-api:jar:null
for project null:maven-reporting-api:jar:null
  org.apache.maven.reporting:maven-reporting-api:jar:2.2.1

from the specified remote repositories:
  central (http://repo1.maven.org/maven2),
  maven2-repository.dev.java.net (http://download.java.net/maven/2/),
  apache.snapshots (http://repository.apache.org/snapshots)

Path to dependency: 
	1) org.apache.maven.plugins:maven-changes-plugin:maven-plugin:2.7
	2) org.apache.maven:maven-core:jar:2.2.1



[INFO] ------------------------------------------------------------------------
[INFO] For more information, run Maven with the -e switch
[INFO] ------------------------------------------------------------------------
[INFO] Total time: 6 minutes 32 seconds
[INFO] Finished at: Fri Feb 24 00:07:10 UTC 2017
[INFO] Final Memory: 71M/371M
[INFO] ------------------------------------------------------------------------
---------------------------------------------

To subscribe to this information via syndicated feeds:
- RSS: http://vmgump-vm3.apache.org/logging-log4j-12/logging-log4j-12/rss.xml
- Atom: http://vmgump-vm3.apache.org/logging-log4j-12/logging-log4j-12/atom.xml

============================== Gump Tracking Only ===
Produced by Apache Gump(TM) version 2.3.
Gump Run 20170224000006, vmgump-vm3.apache.org:vmgump:20170224000006
Gump E-mail Identifier (unique within run) #1.

*********************************************************** G U M P
[GUMP@vmgump-vm3]: Project google-guava (in module google-guava) failed
To whom it may engage...
        
This is an automated request, but not an unsolicited one. For 
more information please visit http://gump.apache.org/nagged.html, 
and/or contact the folk at general@gump.apache.org.

Project google-guava has an issue affecting its community integration.
This issue affects 1 projects,
 and has been outstanding for 466 runs.
The current state of this project is 'Failed', with reason 'Build Failed'.
For reference only, the following projects are affected by this:
    - google-guava :  Guava is a suite of core and expanded libraries that include...


Full details are available at:
    http://vmgump-vm3.apache.org/google-guava/google-guava/index.html

That said, some information snippets are provided here.

The following annotations (debug/informational/warning/error messages) were provided:
 -DEBUG- (Apache Gump generated) Apache Maven Settings in: /srv/gump/public/workspace/google-guava/guava/gump_mvn_settings.xml
 -INFO- Failed with reason build failed
 -DEBUG- Maven POM in: /srv/gump/public/workspace/google-guava/guava/pom.xml
 -INFO- Failed to extract fallback artifacts from Gump Repository



The following work was performed:
http://vmgump-vm3.apache.org/google-guava/google-guava/gump_work/build_google-guava_google-guava.html
Work Name: build_google-guava_google-guava (Type: Build)
Work ended in a state of : Failed
Elapsed: 2 secs
Command Line: /opt/maven3/bin/mvn --batch-mode --settings /srv/gump/public/workspace/google-guava/guava/gump_mvn_settings.xml
package 
[Working Directory: /srv/gump/public/workspace/google-guava/guava]
M2_HOME: /opt/maven3
---------------------------------------------
[INFO] Scanning for projects...
[INFO]                                                                         
[INFO] ------------------------------------------------------------------------
[INFO] Building Guava: Google Core Libraries for Java 22.0-SNAPSHOT
[INFO] ------------------------------------------------------------------------
[INFO] Downloading: http://localhost:8192/maven2/org/apache/maven/plugins/maven-resources-plugin/maven-metadata.xml
[WARNING] Could not transfer metadata org.apache.maven.plugins:maven-resources-plugin/maven-metadata.xml
from/to gump-central (http://localhost:8192/maven2): TransferFailedException
[INFO] ------------------------------------------------------------------------
[INFO] BUILD FAILURE
[INFO] ------------------------------------------------------------------------
[INFO] Total time: 1.277 s
[INFO] Finished at: 2017-02-24T00:32:46+00:00
[INFO] Final Memory: 11M/142M
[INFO] ------------------------------------------------------------------------
[ERROR] Error resolving version for plugin 'org.apache.maven.plugins:maven-resources-plugin'
from the repositories [local (/srv/gump/public/workspace/mvnlocalrepo/shared), gump-central
(http://localhost:8192/maven2)]: Plugin not found in any plugin repository -> [Help 1]
[ERROR] 
[ERROR] To see the full stack trace of the errors, re-run Maven with the -e switch.
[ERROR] Re-run Maven using the -X switch to enable full debug logging.
[ERROR] 
[ERROR] For more information about the errors and possible solutions, please read the following
articles:
[ERROR] [Help 1] http://cwiki.apache.org/confluence/display/MAVEN/PluginVersionResolutionException
---------------------------------------------

To subscribe to this information via syndicated feeds:
- RSS: http://vmgump-vm3.apache.org/google-guava/google-guava/rss.xml
- Atom: http://vmgump-vm3.apache.org/google-guava/google-guava/atom.xml

============================== Gump Tracking Only ===
Produced by Apache Gump(TM) version 2.3.
Gump Run 20170224000006, vmgump-vm3.apache.org:vmgump:20170224000006
Gump E-mail Identifier (unique within run) #3.

*********************************************************** G U M P
[GUMP@vmgump-vm3]: Project compress-antlib-test (in module antlibs-compress) failed
To whom it may engage...
        
This is an automated request, but not an unsolicited one. For 
more information please visit http://gump.apache.org/nagged.html, 
and/or contact the folk at general@gump.apache.org.

Project compress-antlib-test has an issue affecting its community integration.
This issue affects 1 projects,
 and has been outstanding for 89 runs.
The current state of this project is 'Failed', with reason 'Build Failed'.
For reference only, the following projects are affected by this:
    - compress-antlib-test :  The Apache Compress Antlib contains tasks and resources that...


Full details are available at:
    http://vmgump-vm3.apache.org/antlibs-compress/compress-antlib-test/index.html

That said, some information snippets are provided here.

The following annotations (debug/informational/warning/error messages) were provided:
 -DEBUG- Dependency on ant exists, no need to add for property ant.home.
 -INFO- Failed with reason build failed



The following work was performed:
http://vmgump-vm3.apache.org/antlibs-compress/compress-antlib-test/gump_work/build_antlibs-compress_compress-antlib-test.html
Work Name: build_antlibs-compress_compress-antlib-test (Type: Build)
Work ended in a state of : Failed
Elapsed: 3 mins 32 secs
Command Line: /usr/lib/jvm/java-8-oracle/bin/java -Djava.awt.headless=true -Dbuild.sysclasspath=only
-Xbootclasspath/p:/srv/gump/public/workspace/xml-xerces2/build/xercesImpl.jar:/srv/gump/public/workspace/xml-commons/java/external/build/xml-apis.jar
org.apache.tools.ant.Main -Dgump.merge=/srv/gump/public/gump/work/merge.xml -Dant.home=/srv/gump/public/workspace/ant/dist
test 
[Working Directory: /srv/gump/public/workspace/antlibs-compress]
CLASSPATH: /usr/lib/jvm/java-8-oracle/lib/tools.jar:/srv/gump/public/workspace/antlibs-compress/ivy/ivy.jar:/srv/gump/public/workspace/antlibs-compress/build/ant-compress-20170224.jar:/srv/gump/public/workspace/ant/dist/lib/ant.jar:/srv/gump/public/workspace/ant/dist/lib/ant-launcher.jar:/srv/gump/public/workspace/ant/dist/lib/ant-jmf.jar:/srv/gump/public/workspace/ant/dist/lib/ant-junit.jar:/srv/gump/public/workspace/ant/dist/lib/ant-junit4.jar:/srv/gump/public/workspace/ant/dist/lib/ant-swing.jar:/srv/gump/public/workspace/ant/dist/lib/ant-apache-resolver.jar:/srv/gump/public/workspace/ant/dist/lib/ant-apache-xalan2.jar:/srv/gump/public/workspace/commons-compress/target/commons-compress-1.14-SNAPSHOT.jar:/srv/gump/public/workspace/xz-java/build/jar-20170224/xz.jar:/srv/gump/public/workspace/antlibs-antunit/build/ant-antunit-20170224.jar:/srv/gump/public/workspace/xml-commons/java/external/build/xml-apis-ext.jar
---------------------------------------------
[au:antunit] Target: testWithDirectories took 0.009 sec
[au:antunit] Target: testFullpath took 0.008 sec
[au:antunit] Target: testPreserve0Permissions took 0.011 sec
[au:antunit] Target: testForceCreateOfUpToDate took 4.014 sec
[au:antunit] Target: testNoDirectoriesByDefault took 0.009 sec
[au:antunit] Target: testPlainFileSet took 0.008 sec
[au:antunit] Target: testReplaceOfUpToDate took 4.007 sec
[au:antunit] Target: testCoreZipFileSet  FAILED
[au:antunit] 	at line 35, column 24
[au:antunit] 	Message: Assertion failed
[au:antunit] 	took 0.01 sec
[au:antunit] Target: testAntlibTarFileSet took 0.009 sec
[au:antunit] Target: testCreateOfOutOfDate took 4.014 sec
[au:antunit] Target: testFileSetPermissionsWin took 0.009 sec
[au:antunit] Target: testAddDuplicates took 0.004 sec
[au:antunit] Target: testRemoveLeadingSlashes took 0.009 sec
[au:antunit] Target: testPrefixWithSlash took 0.008 sec
[au:antunit] Target: testWithImplicitDirectories took 0.012 sec
[au:antunit] Target: testForceReplaceOfUpToDate took 4.021 sec
[au:antunit] Target: test0PermissionsGetReplaced took 0.009 sec
[au:antunit] Target: testFailDuplicates took 0.002 sec
[au:antunit] Build File: /srv/gump/public/workspace/antlibs-compress/src/tests/antunit/zipentry-test.xml
[au:antunit] Tests run: 3, Failures: 1, Errors: 0, Time elapsed: 0.02 sec
[au:antunit] Target: testResourceProperties  FAILED
[au:antunit] 	at line 59, column 20
[au:antunit] 	Message: Assertion failed
[au:antunit] 	took 0.009 sec
[au:antunit] Target: testUncompressSource took 0.004 sec
[au:antunit] Target: testZipSource took 0.004 sec
[au:antunit] Build File: /srv/gump/public/workspace/antlibs-compress/src/tests/antunit/zipfileset-test.xml
[au:antunit] Tests run: 9, Failures: 0, Errors: 0, Time elapsed: 0.056 sec
[au:antunit] Target: testSkipUnreadableEntries took 0.004 sec
[au:antunit] Target: testMissingArchive took 0.003 sec
[au:antunit] Target: testUncompressSource took 0.004 sec
[au:antunit] Target: test-refid-check-encoding took 0.002 sec
[au:antunit] Target: testZipSource took 0.004 sec
[au:antunit] Target: test-refid-modify took 0.021 sec
[au:antunit] Target: test-refid-check-prefix took 0.002 sec
[au:antunit] Target: testMissingArchiveDoesntMatter took 0.003 sec
[au:antunit] Target: testFailsOnUnreadableEntries took 0.003 sec
[au:antunit] Build File: /srv/gump/public/workspace/antlibs-compress/src/tests/antunit/zresource-test.xml
[au:antunit] Tests run: 1, Failures: 0, Errors: 0, Time elapsed: 0.013 sec
[au:antunit] Target: testNativeZ took 0.005 sec

test:

BUILD FAILED
/srv/gump/public/workspace/antlibs-compress/common/build.xml:209: At least one AntUnit test
has failed.

Total time: 3 minutes 32 seconds
---------------------------------------------

To subscribe to this information via syndicated feeds:
- RSS: http://vmgump-vm3.apache.org/antlibs-compress/compress-antlib-test/rss.xml
- Atom: http://vmgump-vm3.apache.org/antlibs-compress/compress-antlib-test/atom.xml

============================== Gump Tracking Only ===
Produced by Apache Gump(TM) version 2.3.
Gump Run 20170224000006, vmgump-vm3.apache.org:vmgump:20170224000006
Gump E-mail Identifier (unique within run) #4.

*********************************************************** G U M P
[GUMP@vmgump-vm3]: Project fontbox (in module pdfbox) failed
To whom it may engage...
        
This is an automated request, but not an unsolicited one. For 
more information please visit http://gump.apache.org/nagged.html, 
and/or contact the folk at general@gump.apache.org.

Project fontbox has an issue affecting its community integration.
This issue affects 1 projects,
 and has been outstanding for 7 runs.
The current state of this project is 'Failed', with reason 'Build Failed'.
For reference only, the following projects are affected by this:
    - fontbox :  Apache PDFBox is an open source Java PDF library for working...


Full details are available at:
    http://vmgump-vm3.apache.org/pdfbox/fontbox/index.html

That said, some information snippets are provided here.

The following annotations (debug/informational/warning/error messages) were provided:
 -DEBUG- Sole jar output [fontbox-*[0-9T].jar] identifier set to project name
 -INFO- Optional dependency commons-logging prerequisite failed with reason build failed
 -DEBUG- (Apache Gump generated) Apache Maven Settings in: /srv/gump/public/workspace/pdfbox/fontbox/gump_mvn_settings.xml
 -INFO- Failed with reason build failed
 -DEBUG- Maven POM in: /srv/gump/public/workspace/pdfbox/fontbox/pom.xml
 -DEBUG- Extracted fallback artifacts from Gump Repository



The following work was performed:
http://vmgump-vm3.apache.org/pdfbox/fontbox/gump_work/build_pdfbox_fontbox.html
Work Name: build_pdfbox_fontbox (Type: Build)
Work ended in a state of : Failed
Elapsed: 1 sec
Command Line: /opt/maven3/bin/mvn --batch-mode --settings /srv/gump/public/workspace/pdfbox/fontbox/gump_mvn_settings.xml
package 
[Working Directory: /srv/gump/public/workspace/pdfbox/fontbox]
M2_HOME: /opt/maven3
---------------------------------------------
[INFO] Scanning for projects...
[INFO] Downloading: http://localhost:8192/maven2/org/apache/felix/maven-bundle-plugin/2.5.4/maven-bundle-plugin-2.5.4.pom
[ERROR] [ERROR] Some problems were encountered while processing the POMs:
[ERROR] Unresolveable build extension: Plugin org.apache.felix:maven-bundle-plugin:2.5.4 or
one of its dependencies could not be resolved: Failed to read artifact descriptor for org.apache.felix:maven-bundle-plugin:jar:2.5.4
@ 
[ERROR] Unknown packaging: bundle @ org.apache.pdfbox:fontbox:[unknown-version], /srv/gump/public/workspace/pdfbox/fontbox/pom.xml,
line 29, column 14
 @ 
[ERROR] The build could not read 1 project -> [Help 1]
[ERROR]   
[ERROR]   The project org.apache.pdfbox:fontbox:2.1.0-SNAPSHOT (/srv/gump/public/workspace/pdfbox/fontbox/pom.xml)
has 2 errors
[ERROR]     Unresolveable build extension: Plugin org.apache.felix:maven-bundle-plugin:2.5.4
or one of its dependencies could not be resolved: Failed to read artifact descriptor for org.apache.felix:maven-bundle-plugin:jar:2.5.4:
Could not transfer artifact org.apache.felix:maven-bundle-plugin:pom:2.5.4 from/to gump-central
(http://localhost:8192/maven2): TransferFailedException: ClientProtocolException: Status line
contains invalid status code: HTTP/1.1 :01 :01 -> [Help 2]
[ERROR]     Unknown packaging: bundle @ org.apache.pdfbox:fontbox:[unknown-version], /srv/gump/public/workspace/pdfbox/fontbox/pom.xml,
line 29, column 14
[ERROR] 
[ERROR] To see the full stack trace of the errors, re-run Maven with the -e switch.
[ERROR] Re-run Maven using the -X switch to enable full debug logging.
[ERROR] 
[ERROR] For more information about the errors and possible solutions, please read the following
articles:
[ERROR] [Help 1] http://cwiki.apache.org/confluence/display/MAVEN/ProjectBuildingException
[ERROR] [Help 2] http://cwiki.apache.org/confluence/display/MAVEN/PluginManagerException
---------------------------------------------

To subscribe to this information via syndicated feeds:
- RSS: http://vmgump-vm3.apache.org/pdfbox/fontbox/rss.xml
- Atom: http://vmgump-vm3.apache.org/pdfbox/fontbox/atom.xml

============================== Gump Tracking Only ===
Produced by Apache Gump(TM) version 2.3.
Gump Run 20170224000006, vmgump-vm3.apache.org:vmgump:20170224000006
Gump E-mail Identifier (unique within run) #5.

*********************************************************** G U M P
[GUMP@vmgump-vm3]: Project test-ant (in module ant) failed
To whom it may engage...
        
This is an automated request, but not an unsolicited one. For 
more information please visit http://gump.apache.org/nagged.html, 
and/or contact the folk at general@gump.apache.org.

Project test-ant has an issue affecting its community integration.
This issue affects 1 projects,
 and has been outstanding for 88 runs.
The current state of this project is 'Failed', with reason 'Build Failed'.
For reference only, the following projects are affected by this:
    - test-ant :  Java based build tool


Full details are available at:
    http://vmgump-vm3.apache.org/ant/test-ant/index.html

That said, some information snippets are provided here.

The following annotations (debug/informational/warning/error messages) were provided:
 -WARNING- Bad *Optional* Dependency. Project: bsh : unknown to *this* workspace
 -INFO- Failed with reason build failed



The following work was performed:
http://vmgump-vm3.apache.org/ant/test-ant/gump_work/build_ant_test-ant.html
Work Name: build_ant_test-ant (Type: Build)
Work ended in a state of : Failed
Elapsed: 7 mins 31 secs
Command Line: /usr/lib/jvm/java-8-oracle/bin/java -Djava.awt.headless=true -Dbuild.sysclasspath=only
-Xbootclasspath/p:/srv/gump/public/workspace/xml-xerces2/build/xercesImpl.jar:/srv/gump/public/workspace/xml-commons/java/external/build/xml-apis.jar:/srv/gump/public/workspace/xml-xalan/build/xalan-unbundled.jar:/srv/gump/public/workspace/xml-xalan/build/serializer.jar
org.apache.tools.ant.Main -Dgump.merge=/srv/gump/public/gump/work/merge.xml -Dtest.haltonfailure=false
-Dant.home=/srv/gump/public/workspace/ant/dist run-tests 
[Working Directory: /srv/gump/public/workspace/ant]
CLASSPATH: /usr/lib/jvm/java-8-oracle/lib/tools.jar:/srv/gump/public/workspace/ant/build/testcases:/srv/gump/public/workspace/ant/src/tests/junit:/srv/gump/public/workspace/ant/src/etc/testcases:/srv/gump/public/workspace/ant/src/etc/testcases/taskdefs/optional/out:/srv/gump/public/workspace/ant/src/tests/antunit/filters:/srv/gump/public/workspace/ant/src/tests/antunit/taskdefs/importtests:/srv/gump/public/workspace/ant/src/tests/antunit/filters/foo:/srv/gump/public/workspace/ant/src/tests/antunit/taskdefs/foo:/srv/gump/public/workspace/ant/build/antunit/tmp/testinput/build:/srv/gump/public/workspace/ant/build/antunit/tmp/testoutput:/srv/gump/public/workspace/ant/build/antunit/tmp/test.jar:/srv/gump/public/workspace/ant/build/antunit/tmp/test1.jar:/srv/gump/public/workspace/ant/build/antunit/tmp/test2.jar:/srv/gump/public/workspace/ant/build/antunit/tmp/test3.jar:/srv/gump/public/workspace/ant/build/antunit/tmp/test4.jar:/srv/gump/public/workspace/ant/build/antunit/tmp/test5.jar:/srv
 /gump/public/workspace/ant/build/antunit/tmp/resources:/srv/gump/public/workspace/ant/build/lib/ant.jar:/srv/gump/public/workspace/ant/build/lib/ant-launcher.jar:/srv/gump/public/workspace/ant/build/lib/ant-antlr.jar:/srv/gump/public/workspace/ant/build/lib/ant-apache-bcel.jar:/srv/gump/public/workspace/ant/build/lib/ant-apache-bsf.jar:/srv/gump/public/workspace/ant/build/lib/ant-apache-log4j.jar:/srv/gump/public/workspace/ant/build/lib/ant-apache-oro.jar:/srv/gump/public/workspace/ant/build/lib/ant-apache-regexp.jar:/srv/gump/public/workspace/ant/build/lib/ant-apache-resolver.jar:/srv/gump/public/workspace/ant/build/lib/ant-apache-xalan2.jar:/srv/gump/public/workspace/ant/build/lib/ant-commons-logging.jar:/srv/gump/public/workspace/ant/build/lib/ant-commons-net.jar:/srv/gump/public/workspace/ant/build/lib/ant-jai.jar:/srv/gump/public/workspace/ant/build/lib/ant-javamail.jar:/srv/gump/public/workspace/ant/build/lib/ant-jdepend.jar:/srv/gump/public/workspace/ant/build/lib/ant-jmf.jar
 :/srv/gump/public/workspace/ant/build/lib/ant-jsch.jar:/srv/gump/public/workspace/ant/build/lib/ant-junit.jar:/srv/gump/public/workspace/ant/build/lib/ant-junit4.jar:/srv/gump/public/workspace/ant/build/lib/ant-swing.jar:/srv/gump/public/workspace/ant/build/lib/ant-xz.jar:/srv/gump/packages/antlr/antlr-3.1.3.jar:/srv/gump/public/workspace/ant-contrib/lib/bcel/jars/bcel-5.1.jar:commons-logging-gump-20170223.jar:commons-logging-api-gump-20170223.jar:/srv/gump/public/workspace/apache-commons/net/target/commons-net-3.7-SNAPSHOT.jar:/srv/gump/public/workspace/apache-commons/net/target/commons-net-ftp-3.7-SNAPSHOT.jar:/srv/gump/packages/jaf-1.1ea/activation.jar:bsf-gump-20170223.jar:/srv/gump/packages/apache-attic/jakarta-regexp-1.5.jar:/srv/gump/public/workspace/jakarta-servletapi-5/jsr154/dist/lib/servlet-api.jar:/srv/gump/packages/javamail-1.4/mail.jar:/srv/gump/packages/javamail-1.4/lib/mailapi.jar:/srv/gump/packages/jdepend-2.6/lib/jdepend.jar:/srv/gump/packages/jsch/jsch-0.1.45.jar:
 log4j-gump-20170223.jar:/srv/gump/packages/apache-attic/oro-2.0.8.jar:/srv/gump/public/workspace/xz-java/build/jar-20170224/xz.jar:/srv/gump/public/workspace/antlibs-antunit/build/ant-antunit-20170224.jar:/srv/gump/packages/hamcrest/hamcrest-core-1.3.jar:/srv/gump/public/workspace/junit/target/junit-4.13-SNAPSHOT.jar:/srv/gump/public/workspace/xml-commons/java/external/build/xml-apis-ext.jar:/srv/gump/public/workspace/commons-codec-1.x/dist/commons-codec-20170224.jar
---------------------------------------------
[au:antunit] Build File: /srv/gump/public/workspace/ant/src/tests/antunit/types/selectors/modified-test.xml
[au:antunit] Tests run: 1, Failures: 0, Errors: 0, Time elapsed: 0.006 sec
[au:antunit] Target: testUpdate took 0.005 sec
[au:antunit] Build File: /srv/gump/public/workspace/ant/src/tests/antunit/types/selectors/ownedby-test.xml
[au:antunit] Tests run: 3, Failures: 0, Errors: 0, Time elapsed: 0.007 sec
[au:antunit] Target: testOwnedBy took 0.002 sec
[au:antunit] Target: testAsTrueConditions took 0.001 sec
[au:antunit] Target: testRequiresOwner took 0.001 sec
[au:antunit] Build File: /srv/gump/public/workspace/ant/src/tests/antunit/types/selectors/present-test.xml
[au:antunit] Tests run: 1, Failures: 0, Errors: 0, Time elapsed: 0.002 sec
[au:antunit] Target: testMapperByTypedef took 0.001 sec
[au:antunit] Build File: /srv/gump/public/workspace/ant/src/tests/antunit/types/selectors/readwrite-test.xml
[au:antunit] Tests run: 4, Failures: 0, Errors: 0, Time elapsed: 0.011 sec
[au:antunit] Target: testWritable took 0.003 sec
[au:antunit] Target: testAsConditions took 0 sec
[au:antunit] Target: testReadable took 0.001 sec
[au:antunit] Target: testUnwritable took 0 sec
[au:antunit] Build File: /srv/gump/public/workspace/ant/src/tests/antunit/types/selectors/select-test.xml
[au:antunit] Tests run: 4, Failures: 0, Errors: 0, Time elapsed: 0.015 sec
[au:antunit] Target: testIfFalse took 0.004 sec
[au:antunit] Target: testIfNotSet took 0.002 sec
[au:antunit] Target: testIfTrue took 0.002 sec
[au:antunit] Target: testIfSet took 0.001 sec
[au:antunit] Build File: /srv/gump/public/workspace/ant/src/tests/antunit/types/selectors/symlink-test.xml
[au:antunit] Tests run: 4, Failures: 0, Errors: 0, Time elapsed: 0.013 sec
[au:antunit] Target: testAsFalseConditions took 0.001 sec
[au:antunit] Target: testAsTrueConditions took 0.002 sec
[au:antunit] Target: testNoSymlink took 0 sec
[au:antunit] Target: testSymlink took 0.002 sec
[au:antunit] Build File: /srv/gump/public/workspace/ant/src/tests/antunit/types/tarfileset-test.xml
[au:antunit] Tests run: 3, Failures: 0, Errors: 0, Time elapsed: 0.005 sec
[au:antunit] Target: test-refid-check-encoding took 0.001 sec
[au:antunit] Target: testMissingArchive took 0.001 sec
[au:antunit] Target: testMissingArchiveDoesntMatter took 0 sec
[au:antunit] Build File: /srv/gump/public/workspace/ant/src/tests/antunit/types/zipfileset-test.xml
[au:antunit] Tests run: 5, Failures: 0, Errors: 0, Time elapsed: 0.014 sec
[au:antunit] Target: testMissingArchive took 0 sec
[au:antunit] Target: test-refid-check-encoding took 0.001 sec
[au:antunit] Target: test-refid-modify took 0.006 sec
[au:antunit] Target: test-refid-check-prefix took 0 sec
[au:antunit] Target: testMissingArchiveDoesntMatter took 0 sec

check-failed:

run-tests:

BUILD FAILED
/srv/gump/public/workspace/ant/build.xml:1618: Unit tests failed

Total time: 7 minutes 31 seconds
---------------------------------------------

To subscribe to this information via syndicated feeds:
- RSS: http://vmgump-vm3.apache.org/ant/test-ant/rss.xml
- Atom: http://vmgump-vm3.apache.org/ant/test-ant/atom.xml

============================== Gump Tracking Only ===
Produced by Apache Gump(TM) version 2.3.
Gump Run 20170224000006, vmgump-vm3.apache.org:vmgump:20170224000006
Gump E-mail Identifier (unique within run) #6.

*********************************************************** G U M P
[GUMP@vmgump-vm3]: Project commons-bcel (in module apache-commons) failed
To whom it may engage...
        
This is an automated request, but not an unsolicited one. For 
more information please visit http://gump.apache.org/nagged.html, 
and/or contact the folk at general@gump.apache.org.

Project commons-bcel has an issue affecting its community integration.
This issue affects 1 projects,
 and has been outstanding for 63 runs.
The current state of this project is 'Failed', with reason 'Build Failed'.
For reference only, the following projects are affected by this:
    - commons-bcel :  Byte Code Engineering Library


Full details are available at:
    http://vmgump-vm3.apache.org/apache-commons/commons-bcel/index.html

That said, some information snippets are provided here.

The following annotations (debug/informational/warning/error messages) were provided:
 -DEBUG- Sole jar output [bcel-[0-9]*[0-9T].jar] identifier set to project name
 -INFO- Optional dependency commons-logging prerequisite failed with reason build failed
 -DEBUG- (Apache Gump generated) Apache Maven Settings in: /srv/gump/public/workspace/apache-commons/bcel/gump_mvn_settings.xml
 -INFO- Failed with reason build failed
 -DEBUG- Maven POM in: /srv/gump/public/workspace/apache-commons/bcel/pom.xml
 -INFO- Failed to extract fallback artifacts from Gump Repository



The following work was performed:
http://vmgump-vm3.apache.org/apache-commons/commons-bcel/gump_work/build_apache-commons_commons-bcel.html
Work Name: build_apache-commons_commons-bcel (Type: Build)
Work ended in a state of : Failed
Elapsed: 2 secs
Command Line: /opt/maven3/bin/mvn --batch-mode --settings /srv/gump/public/workspace/apache-commons/bcel/gump_mvn_settings.xml
package 
[Working Directory: /srv/gump/public/workspace/apache-commons/bcel]
M2_HOME: /opt/maven3
---------------------------------------------
[INFO] Scanning for projects...
[WARNING] 
[WARNING] Some problems were encountered while building the effective model for org.apache.bcel:bcel:jar:6.1-SNAPSHOT
[WARNING] 'parent.relativePath' of POM org.apache.bcel:bcel:6.1-SNAPSHOT (/srv/gump/public/workspace/apache-commons/bcel/pom.xml)
points at org.apache.commons:commons-proper-aggregator instead of org.apache.commons:commons-parent,
please verify your project structure @ line 27, column 11
[WARNING] 
[WARNING] It is highly recommended to fix these problems because they threaten the stability
of your build.
[WARNING] 
[WARNING] For this reason, future Maven versions might no longer support building such malformed
projects.
[WARNING] 
[INFO]                                                                         
[INFO] ------------------------------------------------------------------------
[INFO] Building Apache Commons BCEL 6.1-SNAPSHOT
[INFO] ------------------------------------------------------------------------
[INFO] Downloading: http://localhost:8192/maven2/org/apache/maven/plugins/maven-source-plugin/3.0.0/maven-source-plugin-3.0.0.pom
[INFO] Downloaded: http://localhost:8192/maven2/org/apache/maven/plugins/maven-source-plugin/3.0.0/maven-source-plugin-3.0.0.pom
(6 KB at 68.6 KB/sec)
[INFO] Downloading: http://localhost:8192/maven2/org/apache/maven/plugins/maven-source-plugin/3.0.0/maven-source-plugin-3.0.0.jar
[INFO] Downloaded: http://localhost:8192/maven2/org/apache/maven/plugins/maven-source-plugin/3.0.0/maven-source-plugin-3.0.0.jar
(31 KB at 1617.9 KB/sec)
[INFO] Downloading: http://localhost:8192/maven2/net/java/dev/jna/jna/4.2.2/jna-4.2.2.pom
[INFO] Downloaded: http://localhost:8192/maven2/net/java/dev/jna/jna/4.2.2/jna-4.2.2.pom (2
KB at 100.9 KB/sec)
[INFO] Downloading: http://localhost:8192/maven2/net/java/dev/jna/jna-platform/4.2.2/jna-platform-4.2.2.pom
[INFO] Downloaded: http://localhost:8192/maven2/net/java/dev/jna/jna-platform/4.2.2/jna-platform-4.2.2.pom
(2 KB at 109.1 KB/sec)
[INFO] Downloading: http://localhost:8192/maven2/net/java/dev/jna/jna/4.2.2/jna-4.2.2.jar
[INFO] Downloading: http://localhost:8192/maven2/net/java/dev/jna/jna-platform/4.2.2/jna-platform-4.2.2.jar
[INFO] Downloaded: http://localhost:8192/maven2/net/java/dev/jna/jna/4.2.2/jna-4.2.2.jar (1111
KB at 22212.6 KB/sec)
[INFO] ------------------------------------------------------------------------
[INFO] BUILD FAILURE
[INFO] ------------------------------------------------------------------------
[INFO] Total time: 0.998 s
[INFO] Finished at: 2017-02-24T01:00:26+00:00
[INFO] Final Memory: 17M/106M
[INFO] ------------------------------------------------------------------------
[ERROR] Failed to execute goal on project bcel: Could not resolve dependencies for project
org.apache.bcel:bcel:jar:6.1-SNAPSHOT: Could not transfer artifact net.java.dev.jna:jna-platform:jar:4.2.2
from/to gump-central (http://localhost:8192/maven2): TransferFailedException: ClientProtocolException:
Status line contains invalid status code: HTTP/1.1 :01 :01 -> [Help 1]
[ERROR] 
[ERROR] To see the full stack trace of the errors, re-run Maven with the -e switch.
[ERROR] Re-run Maven using the -X switch to enable full debug logging.
[ERROR] 
[ERROR] For more information about the errors and possible solutions, please read the following
articles:
[ERROR] [Help 1] http://cwiki.apache.org/confluence/display/MAVEN/DependencyResolutionException
---------------------------------------------

To subscribe to this information via syndicated feeds:
- RSS: http://vmgump-vm3.apache.org/apache-commons/commons-bcel/rss.xml
- Atom: http://vmgump-vm3.apache.org/apache-commons/commons-bcel/atom.xml

============================== Gump Tracking Only ===
Produced by Apache Gump(TM) version 2.3.
Gump Run 20170224000006, vmgump-vm3.apache.org:vmgump:20170224000006
Gump E-mail Identifier (unique within run) #7.


--
Apache Gump
http://gump.apache.org/ [Instance: vmgump-vm3]

---------------------------------------------------------------------
To unsubscribe, e-mail: general-unsubscribe@gump.apache.org
For additional commands, e-mail: general-help@gump.apache.org


Mime
View raw message