gump-general mailing list archives

Site index · List index
Message view « Date » · « Thread »
Top « Date » · « Thread »
From g...@vmgump.apache.org
Subject BATCH: All dressed up, with nowhere to go...
Date Fri, 05 Aug 2016 01:19:50 GMT
Dear Gumpmeisters,
            
The following 18 notifys should have been sent

*********************************************************** G U M P
[GUMP@vmgump]: Module apache-commons failed
[GUMP@vmgump]: Project commons-daemon-native-buildconf (in module apache-commons) failed
[GUMP@vmgump]: Project commons-daemon-native (in module apache-commons) failed
[GUMP@vmgump]: Project commons-io (in module apache-commons) failed
[GUMP@vmgump]: Project commons-fileupload (in module apache-commons) failed
[GUMP@vmgump]: Project commons-net (in module apache-commons) failed
[GUMP@vmgump]: Project apache-httpd-make (in module apache-httpd) failed
[GUMP@vmgump]: Project commons-daemon (in module apache-commons) failed
[GUMP@vmgump]: Project commons-pool2 (in module apache-commons) failed
[GUMP@vmgump]: Project commons-launcher (in module apache-commons) failed
[GUMP@vmgump]: Project commons-logging-step-1 (in module apache-commons) failed
[GUMP@vmgump]: Project commons-logging (in module apache-commons) failed
[GUMP@vmgump]: Project compress-antlib-test (in module antlibs-compress) failed
[GUMP@vmgump]: Project commons-cli (in module apache-commons) failed
[GUMP@vmgump]: Project commons-jxpath (in module apache-commons) failed
[GUMP@vmgump]: Project test-ant (in module ant) failed
[GUMP@vmgump]: Project commons-bcel6 (in module apache-commons) failed
[GUMP@vmgump]: Project commons-exec (in module apache-commons) failed
*********************************************************** G U M P
[GUMP@vmgump]: Module apache-commons failed
To whom it may engage...
        
This is an automated request, but not an unsolicited one. For 
more information please visit http://gump.apache.org/nagged.html, 
and/or contact the folk at general@gump.apache.org.

Module apache-commons has an issue affecting its community integration,
 and has been outstanding for 17 runs.
The current state of this module is 'Failed', with reason 'Update Failed'.

Full details are available at:
    http://vmgump.apache.org/gump/public/apache-commons/index.html

That said, some information snippets are provided here.

The following annotations (debug/informational/warning/error messages) were provided:
 -INFO- Failed with reason update failed



The following work was performed:
http://vmgump.apache.org/gump/public/apache-commons/gump_work/update_apache-commons.html
Work Name: update_apache-commons (Type: Update)
Work ended in a state of : Failed
Elapsed: 33 secs
Command Line: svn --quiet update --non-interactive apache-commons 
[Working Directory: /srv/gump/public/workspace/cvs]
---------------------------------------------
svn: E205011: Failure occurred processing one or more externals definitions
---------------------------------------------

To subscribe to this information via syndicated feeds:
- RSS: http://vmgump.apache.org/gump/public/apache-commons/rss.xml
- Atom: http://vmgump.apache.org/gump/public/apache-commons/atom.xml

============================== Gump Tracking Only ===
Produced by Apache Gump(TM) version 2.3.
Gump Run 20160805000006, vmgump.apache.org:vmgump:20160805000006
Gump E-mail Identifier (unique within run) #1.

*********************************************************** G U M P
[GUMP@vmgump]: Project commons-daemon-native-buildconf (in module apache-commons) failed
To whom it may engage...
        
This is an automated request, but not an unsolicited one. For 
more information please visit http://gump.apache.org/nagged.html, 
and/or contact the folk at general@gump.apache.org.

Project commons-daemon-native-buildconf has an issue affecting its community integration,
 and has been outstanding for 17 runs.
The current state of this project is 'Failed', with reason 'Update Failed'.

Full details are available at:
    http://vmgump.apache.org/gump/public/apache-commons/commons-daemon-native-buildconf/index.html

That said, some information snippets are provided here.

The following annotations (debug/informational/warning/error messages) were provided:
 -INFO- Failed with reason update failed

To subscribe to this information via syndicated feeds:
- RSS: http://vmgump.apache.org/gump/public/apache-commons/commons-daemon-native-buildconf/rss.xml
- Atom: http://vmgump.apache.org/gump/public/apache-commons/commons-daemon-native-buildconf/atom.xml

============================== Gump Tracking Only ===
Produced by Apache Gump(TM) version 2.3.
Gump Run 20160805000006, vmgump.apache.org:vmgump:20160805000006
Gump E-mail Identifier (unique within run) #2.

*********************************************************** G U M P
[GUMP@vmgump]: Project commons-daemon-native (in module apache-commons) failed
To whom it may engage...
        
This is an automated request, but not an unsolicited one. For 
more information please visit http://gump.apache.org/nagged.html, 
and/or contact the folk at general@gump.apache.org.

Project commons-daemon-native has an issue affecting its community integration,
 and has been outstanding for 17 runs.
The current state of this project is 'Failed', with reason 'Update Failed'.

Full details are available at:
    http://vmgump.apache.org/gump/public/apache-commons/commons-daemon-native/index.html

That said, some information snippets are provided here.

The following annotations (debug/informational/warning/error messages) were provided:
 -INFO- Failed with reason update failed

To subscribe to this information via syndicated feeds:
- RSS: http://vmgump.apache.org/gump/public/apache-commons/commons-daemon-native/rss.xml
- Atom: http://vmgump.apache.org/gump/public/apache-commons/commons-daemon-native/atom.xml

============================== Gump Tracking Only ===
Produced by Apache Gump(TM) version 2.3.
Gump Run 20160805000006, vmgump.apache.org:vmgump:20160805000006
Gump E-mail Identifier (unique within run) #3.

*********************************************************** G U M P
[GUMP@vmgump]: Project commons-io (in module apache-commons) failed
To whom it may engage...
        
This is an automated request, but not an unsolicited one. For 
more information please visit http://gump.apache.org/nagged.html, 
and/or contact the folk at general@gump.apache.org.

Project commons-io has an issue affecting its community integration,
 and has been outstanding for 17 runs.
The current state of this project is 'Failed', with reason 'Update Failed'.

Full details are available at:
    http://vmgump.apache.org/gump/public/apache-commons/commons-io/index.html

That said, some information snippets are provided here.

The following annotations (debug/informational/warning/error messages) were provided:
 -DEBUG- Sole jar output [commons-io-*[0-9T].jar] identifier set to project name
 -INFO- Failed with reason update failed
 -INFO- Failed to extract fallback artifacts from Gump Repository

To subscribe to this information via syndicated feeds:
- RSS: http://vmgump.apache.org/gump/public/apache-commons/commons-io/rss.xml
- Atom: http://vmgump.apache.org/gump/public/apache-commons/commons-io/atom.xml

============================== Gump Tracking Only ===
Produced by Apache Gump(TM) version 2.3.
Gump Run 20160805000006, vmgump.apache.org:vmgump:20160805000006
Gump E-mail Identifier (unique within run) #4.

*********************************************************** G U M P
[GUMP@vmgump]: Project commons-fileupload (in module apache-commons) failed
To whom it may engage...
        
This is an automated request, but not an unsolicited one. For 
more information please visit http://gump.apache.org/nagged.html, 
and/or contact the folk at general@gump.apache.org.

Project commons-fileupload has an issue affecting its community integration,
 and has been outstanding for 17 runs.
The current state of this project is 'Failed', with reason 'Update Failed'.

Full details are available at:
    http://vmgump.apache.org/gump/public/apache-commons/commons-fileupload/index.html

That said, some information snippets are provided here.

The following annotations (debug/informational/warning/error messages) were provided:
 -DEBUG- Sole jar output [commons-fileupload-*[0-9T].jar] identifier set to project name
 -INFO- Failed with reason update failed
 -INFO- Optional dependency commons-io failed with reason update failed
 -INFO- Failed to extract fallback artifacts from Gump Repository

To subscribe to this information via syndicated feeds:
- RSS: http://vmgump.apache.org/gump/public/apache-commons/commons-fileupload/rss.xml
- Atom: http://vmgump.apache.org/gump/public/apache-commons/commons-fileupload/atom.xml

============================== Gump Tracking Only ===
Produced by Apache Gump(TM) version 2.3.
Gump Run 20160805000006, vmgump.apache.org:vmgump:20160805000006
Gump E-mail Identifier (unique within run) #5.

*********************************************************** G U M P
[GUMP@vmgump]: Project commons-net (in module apache-commons) failed
To whom it may engage...
        
This is an automated request, but not an unsolicited one. For 
more information please visit http://gump.apache.org/nagged.html, 
and/or contact the folk at general@gump.apache.org.

Project commons-net has an issue affecting its community integration,
 and has been outstanding for 17 runs.
The current state of this project is 'Failed', with reason 'Update Failed'.

Full details are available at:
    http://vmgump.apache.org/gump/public/apache-commons/commons-net/index.html

That said, some information snippets are provided here.

The following annotations (debug/informational/warning/error messages) were provided:
 -INFO- Failed with reason update failed
 -INFO- Failed to extract fallback artifacts from Gump Repository

To subscribe to this information via syndicated feeds:
- RSS: http://vmgump.apache.org/gump/public/apache-commons/commons-net/rss.xml
- Atom: http://vmgump.apache.org/gump/public/apache-commons/commons-net/atom.xml

============================== Gump Tracking Only ===
Produced by Apache Gump(TM) version 2.3.
Gump Run 20160805000006, vmgump.apache.org:vmgump:20160805000006
Gump E-mail Identifier (unique within run) #6.

*********************************************************** G U M P
[GUMP@vmgump]: Project apache-httpd-make (in module apache-httpd) failed
To whom it may engage...
        
This is an automated request, but not an unsolicited one. For 
more information please visit http://gump.apache.org/nagged.html, 
and/or contact the folk at general@gump.apache.org.

Project apache-httpd-make has an issue affecting its community integration.
This issue affects 5 projects,
 and has been outstanding for 31 runs.
The current state of this project is 'Failed', with reason 'Build Failed'.
For reference only, the following projects are affected by this:
    - apache-httpd-make :  Apache HTTP Server
    - apache-httpd-make-install :  Apache HTTP Server
    - tomcat-jk-native :  Connectors to various web servers
    - tomcat-jk-native-buildconf :  Connectors to various web servers
    - tomcat-jk-native-configure :  Connectors to various web servers


Full details are available at:
    http://vmgump.apache.org/gump/public/apache-httpd/apache-httpd-make/index.html

That said, some information snippets are provided here.

The following annotations (debug/informational/warning/error messages) were provided:
 -INFO- Failed with reason build failed



The following work was performed:
http://vmgump.apache.org/gump/public/apache-httpd/apache-httpd-make/gump_work/build_apache-httpd_apache-httpd-make.html
Work Name: build_apache-httpd_apache-httpd-make (Type: Build)
Work ended in a state of : Failed
Elapsed: 2 mins 10 secs
Command Line: make 
[Working Directory: /srv/gump/public/workspace/apache-httpd]
---------------------------------------------
make[3]: Leaving directory `/srv/gump/public/workspace/apache-httpd/modules/proxy'
make[3]: Entering directory `/srv/gump/public/workspace/apache-httpd/modules/session'
Building shared: mod_session.la mod_session_cookie.la mod_session_dbd.la
make[4]: Entering directory `/srv/gump/public/workspace/apache-httpd/modules/session'
/srv/gump/public/workspace/apr/dest-20160805/build-2/libtool --silent --mode=compile gcc -std=gnu99  -g -O2 -pthread      -DLINUX -D_REENTRANT -D_GNU_SOURCE     -I. -I/srv/gump/public/workspace/apache-httpd/os/unix -I/srv/gump/public/workspace/apache-httpd/include -I/srv/gump/public/workspace/apr/dest-20160805/include/apr-2 -I/srv/gump/public/workspace/pcre/dest-20160805/include -I/srv/gump/public/workspace/apache-httpd/modules/aaa -I/srv/gump/public/workspace/apache-httpd/modules/cache -I/srv/gump/public/workspace/apache-httpd/modules/core -I/srv/gump/public/workspace/apache-httpd/modules/database -I/srv/gump/public/workspace/apache-httpd/modules/filters -I/srv/gump/public/workspace/apache-httpd/modules/ldap -I/srv/gump/public/workspace/apache-httpd/modules/loggers -I/srv/gump/public/workspace/apache-httpd/modules/lua -I/srv/gump/public/workspace/apache-httpd/modules/proxy -I/srv/gump/public/workspace/apache-httpd/modules/session -I/srv/gump/public/workspace/apache-httpd/modules/ssl
  -I/srv/gump/public/workspace/apache-httpd/modules/test -I/srv/gump/public/workspace/apache-httpd/server -I/srv/gump/public/workspace/apache-httpd/modules/arch/unix -I/srv/gump/public/workspace/apache-httpd/modules/dav/main -I/srv/gump/public/workspace/apache-httpd/modules/generators -I/srv/gump/public/workspace/apache-httpd/modules/mappers -prefer-pic -c mod_session.c && touch mod_session.slo
/srv/gump/public/workspace/apr/dest-20160805/build-2/libtool --silent --mode=link gcc -std=gnu99  -g -O2 -pthread           -o mod_session.la -rpath /srv/gump/public/workspace/apache-httpd/dest-20160805/modules -module -avoid-version  mod_session.lo 
/srv/gump/public/workspace/apr/dest-20160805/build-2/libtool --silent --mode=compile gcc -std=gnu99  -g -O2 -pthread      -DLINUX -D_REENTRANT -D_GNU_SOURCE     -I. -I/srv/gump/public/workspace/apache-httpd/os/unix -I/srv/gump/public/workspace/apache-httpd/include -I/srv/gump/public/workspace/apr/dest-20160805/include/apr-2 -I/srv/gump/public/workspace/pcre/dest-20160805/include -I/srv/gump/public/workspace/apache-httpd/modules/aaa -I/srv/gump/public/workspace/apache-httpd/modules/cache -I/srv/gump/public/workspace/apache-httpd/modules/core -I/srv/gump/public/workspace/apache-httpd/modules/database -I/srv/gump/public/workspace/apache-httpd/modules/filters -I/srv/gump/public/workspace/apache-httpd/modules/ldap -I/srv/gump/public/workspace/apache-httpd/modules/loggers -I/srv/gump/public/workspace/apache-httpd/modules/lua -I/srv/gump/public/workspace/apache-httpd/modules/proxy -I/srv/gump/public/workspace/apache-httpd/modules/session -I/srv/gump/public/workspace/apache-httpd/modules/ssl
  -I/srv/gump/public/workspace/apache-httpd/modules/test -I/srv/gump/public/workspace/apache-httpd/server -I/srv/gump/public/workspace/apache-httpd/modules/arch/unix -I/srv/gump/public/workspace/apache-httpd/modules/dav/main -I/srv/gump/public/workspace/apache-httpd/modules/generators -I/srv/gump/public/workspace/apache-httpd/modules/mappers -prefer-pic -c mod_session_cookie.c && touch mod_session_cookie.slo
/srv/gump/public/workspace/apr/dest-20160805/build-2/libtool --silent --mode=link gcc -std=gnu99  -g -O2 -pthread           -o mod_session_cookie.la -rpath /srv/gump/public/workspace/apache-httpd/dest-20160805/modules -module -avoid-version  mod_session_cookie.lo 
/srv/gump/public/workspace/apr/dest-20160805/build-2/libtool --silent --mode=compile gcc -std=gnu99  -g -O2 -pthread      -DLINUX -D_REENTRANT -D_GNU_SOURCE     -I. -I/srv/gump/public/workspace/apache-httpd/os/unix -I/srv/gump/public/workspace/apache-httpd/include -I/srv/gump/public/workspace/apr/dest-20160805/include/apr-2 -I/srv/gump/public/workspace/pcre/dest-20160805/include -I/srv/gump/public/workspace/apache-httpd/modules/aaa -I/srv/gump/public/workspace/apache-httpd/modules/cache -I/srv/gump/public/workspace/apache-httpd/modules/core -I/srv/gump/public/workspace/apache-httpd/modules/database -I/srv/gump/public/workspace/apache-httpd/modules/filters -I/srv/gump/public/workspace/apache-httpd/modules/ldap -I/srv/gump/public/workspace/apache-httpd/modules/loggers -I/srv/gump/public/workspace/apache-httpd/modules/lua -I/srv/gump/public/workspace/apache-httpd/modules/proxy -I/srv/gump/public/workspace/apache-httpd/modules/session -I/srv/gump/public/workspace/apache-httpd/modules/ssl
  -I/srv/gump/public/workspace/apache-httpd/modules/test -I/srv/gump/public/workspace/apache-httpd/server -I/srv/gump/public/workspace/apache-httpd/modules/arch/unix -I/srv/gump/public/workspace/apache-httpd/modules/dav/main -I/srv/gump/public/workspace/apache-httpd/modules/generators -I/srv/gump/public/workspace/apache-httpd/modules/mappers -prefer-pic -c mod_session_dbd.c && touch mod_session_dbd.slo
/srv/gump/public/workspace/apr/dest-20160805/build-2/libtool --silent --mode=link gcc -std=gnu99  -g -O2 -pthread           -o mod_session_dbd.la -rpath /srv/gump/public/workspace/apache-httpd/dest-20160805/modules -module -avoid-version  mod_session_dbd.lo 
make[4]: Leaving directory `/srv/gump/public/workspace/apache-httpd/modules/session'
make[3]: Leaving directory `/srv/gump/public/workspace/apache-httpd/modules/session'
make[3]: Entering directory `/srv/gump/public/workspace/apache-httpd/modules/slotmem'
Building shared: mod_slotmem_shm.la
make[4]: Entering directory `/srv/gump/public/workspace/apache-httpd/modules/slotmem'
/srv/gump/public/workspace/apr/dest-20160805/build-2/libtool --silent --mode=compile gcc -std=gnu99  -g -O2 -pthread      -DLINUX -D_REENTRANT -D_GNU_SOURCE     -I. -I/srv/gump/public/workspace/apache-httpd/os/unix -I/srv/gump/public/workspace/apache-httpd/include -I/srv/gump/public/workspace/apr/dest-20160805/include/apr-2 -I/srv/gump/public/workspace/pcre/dest-20160805/include -I/srv/gump/public/workspace/apache-httpd/modules/aaa -I/srv/gump/public/workspace/apache-httpd/modules/cache -I/srv/gump/public/workspace/apache-httpd/modules/core -I/srv/gump/public/workspace/apache-httpd/modules/database -I/srv/gump/public/workspace/apache-httpd/modules/filters -I/srv/gump/public/workspace/apache-httpd/modules/ldap -I/srv/gump/public/workspace/apache-httpd/modules/loggers -I/srv/gump/public/workspace/apache-httpd/modules/lua -I/srv/gump/public/workspace/apache-httpd/modules/proxy -I/srv/gump/public/workspace/apache-httpd/modules/session -I/srv/gump/public/workspace/apache-httpd/modules/ssl
  -I/srv/gump/public/workspace/apache-httpd/modules/test -I/srv/gump/public/workspace/apache-httpd/server -I/srv/gump/public/workspace/apache-httpd/modules/arch/unix -I/srv/gump/public/workspace/apache-httpd/modules/dav/main -I/srv/gump/public/workspace/apache-httpd/modules/generators -I/srv/gump/public/workspace/apache-httpd/modules/mappers -prefer-pic -c mod_slotmem_shm.c && touch mod_slotmem_shm.slo
/srv/gump/public/workspace/apr/dest-20160805/build-2/libtool --silent --mode=link gcc -std=gnu99  -g -O2 -pthread           -o mod_slotmem_shm.la -rpath /srv/gump/public/workspace/apache-httpd/dest-20160805/modules -module -avoid-version  mod_slotmem_shm.lo 
make[4]: Leaving directory `/srv/gump/public/workspace/apache-httpd/modules/slotmem'
make[3]: Leaving directory `/srv/gump/public/workspace/apache-httpd/modules/slotmem'
make[3]: Entering directory `/srv/gump/public/workspace/apache-httpd/modules/ssl'
Building shared: mod_ssl.la
make[4]: Entering directory `/srv/gump/public/workspace/apache-httpd/modules/ssl'
/srv/gump/public/workspace/apr/dest-20160805/build-2/libtool --silent --mode=compile gcc -std=gnu99 -I/srv/gump/public/workspace/openssl-master/dest-20160805/include   -g -O2 -pthread      -DLINUX -D_REENTRANT -D_GNU_SOURCE     -I. -I/srv/gump/public/workspace/apache-httpd/os/unix -I/srv/gump/public/workspace/apache-httpd/include -I/srv/gump/public/workspace/apr/dest-20160805/include/apr-2 -I/srv/gump/public/workspace/pcre/dest-20160805/include -I/srv/gump/public/workspace/apache-httpd/modules/aaa -I/srv/gump/public/workspace/apache-httpd/modules/cache -I/srv/gump/public/workspace/apache-httpd/modules/core -I/srv/gump/public/workspace/apache-httpd/modules/database -I/srv/gump/public/workspace/apache-httpd/modules/filters -I/srv/gump/public/workspace/apache-httpd/modules/ldap -I/srv/gump/public/workspace/apache-httpd/modules/loggers -I/srv/gump/public/workspace/apache-httpd/modules/lua -I/srv/gump/public/workspace/apache-httpd/modules/proxy -I/srv/gump/public/workspace/apache-httpd/mo
 dules/session -I/srv/gump/public/workspace/apache-httpd/modules/ssl -I/srv/gump/public/workspace/apache-httpd/modules/test -I/srv/gump/public/workspace/apache-httpd/server -I/srv/gump/public/workspace/apache-httpd/modules/arch/unix -I/srv/gump/public/workspace/apache-httpd/modules/dav/main -I/srv/gump/public/workspace/apache-httpd/modules/generators -I/srv/gump/public/workspace/apache-httpd/modules/mappers -prefer-pic -c mod_ssl.c && touch mod_ssl.slo
mod_ssl.c: In function 'ssl_cleanup_pre_config':
mod_ssl.c:330:5: warning: 'ERR_remove_thread_state' is deprecated (declared at /srv/gump/public/workspace/openssl-master/dest-20160805/include/openssl/err.h:244) [-Wdeprecated-declarations]
     ERR_remove_thread_state();
     ^
mod_ssl.c:330:5: error: too few arguments to function 'ERR_remove_thread_state'
In file included from /srv/gump/public/workspace/openssl-master/dest-20160805/include/openssl/ct.h:13:0,
                 from /srv/gump/public/workspace/openssl-master/dest-20160805/include/openssl/ssl.h:61,
                 from ssl_private.h:90,
                 from mod_ssl.c:27:
/srv/gump/public/workspace/openssl-master/dest-20160805/include/openssl/err.h:244:25: note: declared here
 DEPRECATEDIN_1_1_0(void ERR_remove_thread_state(void *))
                         ^
/srv/gump/public/workspace/openssl-master/dest-20160805/include/openssl/opensslconf.h:102:35: note: in definition of macro 'DECLARE_DEPRECATED'
 # define DECLARE_DEPRECATED(f)    f __attribute__ ((deprecated));
                                   ^
/srv/gump/public/workspace/openssl-master/dest-20160805/include/openssl/err.h:244:1: note: in expansion of macro 'DEPRECATEDIN_1_1_0'
 DEPRECATEDIN_1_1_0(void ERR_remove_thread_state(void *))
 ^
make[4]: *** [mod_ssl.slo] Error 1
make[4]: Leaving directory `/srv/gump/public/workspace/apache-httpd/modules/ssl'
make[3]: *** [shared-build-recursive] Error 1
make[3]: Leaving directory `/srv/gump/public/workspace/apache-httpd/modules/ssl'
make[2]: *** [shared-build-recursive] Error 1
make[2]: Leaving directory `/srv/gump/public/workspace/apache-httpd/modules'
make[1]: *** [shared-build-recursive] Error 1
make[1]: Leaving directory `/srv/gump/public/workspace/apache-httpd'
make: *** [all-recursive] Error 1
---------------------------------------------

To subscribe to this information via syndicated feeds:
- RSS: http://vmgump.apache.org/gump/public/apache-httpd/apache-httpd-make/rss.xml
- Atom: http://vmgump.apache.org/gump/public/apache-httpd/apache-httpd-make/atom.xml

============================== Gump Tracking Only ===
Produced by Apache Gump(TM) version 2.3.
Gump Run 20160805000006, vmgump.apache.org:vmgump:20160805000006
Gump E-mail Identifier (unique within run) #7.

*********************************************************** G U M P
[GUMP@vmgump]: Project commons-daemon (in module apache-commons) failed
To whom it may engage...
        
This is an automated request, but not an unsolicited one. For 
more information please visit http://gump.apache.org/nagged.html, 
and/or contact the folk at general@gump.apache.org.

Project commons-daemon has an issue affecting its community integration,
 and has been outstanding for 17 runs.
The current state of this project is 'Failed', with reason 'Update Failed'.

Full details are available at:
    http://vmgump.apache.org/gump/public/apache-commons/commons-daemon/index.html

That said, some information snippets are provided here.

The following annotations (debug/informational/warning/error messages) were provided:
 -INFO- Failed with reason update failed
 -INFO- Failed to extract fallback artifacts from Gump Repository

To subscribe to this information via syndicated feeds:
- RSS: http://vmgump.apache.org/gump/public/apache-commons/commons-daemon/rss.xml
- Atom: http://vmgump.apache.org/gump/public/apache-commons/commons-daemon/atom.xml

============================== Gump Tracking Only ===
Produced by Apache Gump(TM) version 2.3.
Gump Run 20160805000006, vmgump.apache.org:vmgump:20160805000006
Gump E-mail Identifier (unique within run) #8.

*********************************************************** G U M P
[GUMP@vmgump]: Project commons-pool2 (in module apache-commons) failed
To whom it may engage...
        
This is an automated request, but not an unsolicited one. For 
more information please visit http://gump.apache.org/nagged.html, 
and/or contact the folk at general@gump.apache.org.

Project commons-pool2 has an issue affecting its community integration,
 and has been outstanding for 17 runs.
The current state of this project is 'Failed', with reason 'Update Failed'.

Full details are available at:
    http://vmgump.apache.org/gump/public/apache-commons/commons-pool2/index.html

That said, some information snippets are provided here.

The following annotations (debug/informational/warning/error messages) were provided:
 -DEBUG- Sole jar output [commons-pool?-*[0-9T].jar] identifier set to project name
 -INFO- Failed with reason update failed
 -INFO- Failed to extract fallback artifacts from Gump Repository

To subscribe to this information via syndicated feeds:
- RSS: http://vmgump.apache.org/gump/public/apache-commons/commons-pool2/rss.xml
- Atom: http://vmgump.apache.org/gump/public/apache-commons/commons-pool2/atom.xml

============================== Gump Tracking Only ===
Produced by Apache Gump(TM) version 2.3.
Gump Run 20160805000006, vmgump.apache.org:vmgump:20160805000006
Gump E-mail Identifier (unique within run) #9.

*********************************************************** G U M P
[GUMP@vmgump]: Project commons-launcher (in module apache-commons) failed
To whom it may engage...
        
This is an automated request, but not an unsolicited one. For 
more information please visit http://gump.apache.org/nagged.html, 
and/or contact the folk at general@gump.apache.org.

Project commons-launcher has an issue affecting its community integration,
 and has been outstanding for 17 runs.
The current state of this project is 'Failed', with reason 'Update Failed'.

Full details are available at:
    http://vmgump.apache.org/gump/public/apache-commons/commons-launcher/index.html

That said, some information snippets are provided here.

The following annotations (debug/informational/warning/error messages) were provided:
 -DEBUG- Sole jar output [commons-launcher-20160805.jar] identifier set to project name
 -DEBUG- Dependency on ant exists, no need to add for property ant.home.
 -INFO- Failed with reason update failed
 -INFO- Failed to extract fallback artifacts from Gump Repository

To subscribe to this information via syndicated feeds:
- RSS: http://vmgump.apache.org/gump/public/apache-commons/commons-launcher/rss.xml
- Atom: http://vmgump.apache.org/gump/public/apache-commons/commons-launcher/atom.xml

============================== Gump Tracking Only ===
Produced by Apache Gump(TM) version 2.3.
Gump Run 20160805000006, vmgump.apache.org:vmgump:20160805000006
Gump E-mail Identifier (unique within run) #10.

*********************************************************** G U M P
[GUMP@vmgump]: Project commons-logging-step-1 (in module apache-commons) failed
To whom it may engage...
        
This is an automated request, but not an unsolicited one. For 
more information please visit http://gump.apache.org/nagged.html, 
and/or contact the folk at general@gump.apache.org.

Project commons-logging-step-1 has an issue affecting its community integration,
 and has been outstanding for 17 runs.
The current state of this project is 'Failed', with reason 'Update Failed'.

Full details are available at:
    http://vmgump.apache.org/gump/public/apache-commons/commons-logging-step-1/index.html

That said, some information snippets are provided here.

The following annotations (debug/informational/warning/error messages) were provided:
 -DEBUG- Dependency on logging-log4j-12 exists, no need to add for property log4j12.jar.
 -DEBUG- Dependency on avalon-logkit exists, no need to add for property logkit.jar.
 -DEBUG- Dependency on avalon-framework-api exists, no need to add for property avalon-framework.jar.
 -INFO- Failed with reason update failed

To subscribe to this information via syndicated feeds:
- RSS: http://vmgump.apache.org/gump/public/apache-commons/commons-logging-step-1/rss.xml
- Atom: http://vmgump.apache.org/gump/public/apache-commons/commons-logging-step-1/atom.xml

============================== Gump Tracking Only ===
Produced by Apache Gump(TM) version 2.3.
Gump Run 20160805000006, vmgump.apache.org:vmgump:20160805000006
Gump E-mail Identifier (unique within run) #11.

*********************************************************** G U M P
[GUMP@vmgump]: Project commons-logging (in module apache-commons) failed
To whom it may engage...
        
This is an automated request, but not an unsolicited one. For 
more information please visit http://gump.apache.org/nagged.html, 
and/or contact the folk at general@gump.apache.org.

Project commons-logging has an issue affecting its community integration,
 and has been outstanding for 17 runs.
The current state of this project is 'Failed', with reason 'Update Failed'.

Full details are available at:
    http://vmgump.apache.org/gump/public/apache-commons/commons-logging/index.html

That said, some information snippets are provided here.

The following annotations (debug/informational/warning/error messages) were provided:
 -DEBUG- Dependency on logging-log4j-12 exists, no need to add for property log4j13.jar.
 -DEBUG- Dependency on avalon-logkit exists, no need to add for property logkit.jar.
 -DEBUG- Dependency on avalon-framework-api exists, no need to add for property avalon-framework.jar.
 -INFO- Failed with reason update failed
 -INFO- Failed to extract fallback artifacts from Gump Repository

To subscribe to this information via syndicated feeds:
- RSS: http://vmgump.apache.org/gump/public/apache-commons/commons-logging/rss.xml
- Atom: http://vmgump.apache.org/gump/public/apache-commons/commons-logging/atom.xml

============================== Gump Tracking Only ===
Produced by Apache Gump(TM) version 2.3.
Gump Run 20160805000006, vmgump.apache.org:vmgump:20160805000006
Gump E-mail Identifier (unique within run) #12.

*********************************************************** G U M P
[GUMP@vmgump]: Project compress-antlib-test (in module antlibs-compress) failed
To whom it may engage...
        
This is an automated request, but not an unsolicited one. For 
more information please visit http://gump.apache.org/nagged.html, 
and/or contact the folk at general@gump.apache.org.

Project compress-antlib-test has an issue affecting its community integration.
This issue affects 1 projects,
 and has been outstanding for 52 runs.
The current state of this project is 'Failed', with reason 'Build Failed'.
For reference only, the following projects are affected by this:
    - compress-antlib-test :  The Apache Compress Antlib contains tasks and resources that...


Full details are available at:
    http://vmgump.apache.org/gump/public/antlibs-compress/compress-antlib-test/index.html

That said, some information snippets are provided here.

The following annotations (debug/informational/warning/error messages) were provided:
 -DEBUG- Dependency on ant exists, no need to add for property ant.home.
 -INFO- Failed with reason build failed



The following work was performed:
http://vmgump.apache.org/gump/public/antlibs-compress/compress-antlib-test/gump_work/build_antlibs-compress_compress-antlib-test.html
Work Name: build_antlibs-compress_compress-antlib-test (Type: Build)
Work ended in a state of : Failed
Elapsed: 4 mins 22 secs
Command Line: /usr/lib/jvm/java-8-oracle/bin/java -Djava.awt.headless=true -Dbuild.sysclasspath=only -Xbootclasspath/p:/srv/gump/public/workspace/xml-xerces2/build/xercesImpl.jar:/srv/gump/public/workspace/xml-commons/java/external/build/xml-apis.jar org.apache.tools.ant.Main -Dgump.merge=/srv/gump/public/gump/work/merge.xml -Dant.home=/srv/gump/public/workspace/ant/dist test 
[Working Directory: /srv/gump/public/workspace/antlibs-compress]
CLASSPATH: /usr/lib/jvm/java-8-oracle/lib/tools.jar:/srv/gump/public/workspace/antlibs-compress/ivy/ivy.jar:/srv/gump/public/workspace/antlibs-compress/build/ant-compress-20160805.jar:/srv/gump/public/workspace/ant/dist/lib/ant.jar:/srv/gump/public/workspace/ant/dist/lib/ant-launcher.jar:/srv/gump/public/workspace/ant/dist/lib/ant-jmf.jar:/srv/gump/public/workspace/ant/dist/lib/ant-junit.jar:/srv/gump/public/workspace/ant/dist/lib/ant-junit4.jar:/srv/gump/public/workspace/ant/dist/lib/ant-swing.jar:/srv/gump/public/workspace/ant/dist/lib/ant-apache-resolver.jar:/srv/gump/public/workspace/ant/dist/lib/ant-apache-xalan2.jar:/srv/gump/public/workspace/commons-compress/target/commons-compress-1.13-SNAPSHOT.jar:/srv/gump/public/workspace/xz-java/build/jar-20160805/xz.jar:/srv/gump/public/workspace/antlibs-antunit/build/ant-antunit-20160805.jar:/srv/gump/public/workspace/xml-commons/java/external/build/xml-apis-ext.jar
---------------------------------------------
[au:antunit] Target: testWithDirectories took 0.028 sec
[au:antunit] Target: testFullpath took 0.021 sec
[au:antunit] Target: testPreserve0Permissions took 0.025 sec
[au:antunit] Target: testForceCreateOfUpToDate took 4.035 sec
[au:antunit] Target: testNoDirectoriesByDefault took 0.022 sec
[au:antunit] Target: testPlainFileSet took 0.024 sec
[au:antunit] Target: testReplaceOfUpToDate took 4.019 sec
[au:antunit] Target: testCoreZipFileSet  FAILED
[au:antunit] 	at line 35, column 24
[au:antunit] 	Message: Assertion failed
[au:antunit] 	took 0.015 sec
[au:antunit] Target: testAntlibTarFileSet took 0.013 sec
[au:antunit] Target: testCreateOfOutOfDate took 4.019 sec
[au:antunit] Target: testFileSetPermissionsWin took 0.028 sec
[au:antunit] Target: testAddDuplicates took 0.016 sec
[au:antunit] Target: testRemoveLeadingSlashes took 0.016 sec
[au:antunit] Target: testPrefixWithSlash took 0.019 sec
[au:antunit] Target: testWithImplicitDirectories took 0.016 sec
[au:antunit] Target: testForceReplaceOfUpToDate took 4.022 sec
[au:antunit] Target: test0PermissionsGetReplaced took 0.013 sec
[au:antunit] Target: testFailDuplicates took 0.008 sec
[au:antunit] Build File: /srv/gump/public/workspace/antlibs-compress/src/tests/antunit/zipentry-test.xml
[au:antunit] Tests run: 3, Failures: 1, Errors: 0, Time elapsed: 0.046 sec
[au:antunit] Target: testResourceProperties  FAILED
[au:antunit] 	at line 59, column 20
[au:antunit] 	Message: Assertion failed
[au:antunit] 	took 0.02 sec
[au:antunit] Target: testUncompressSource took 0.009 sec
[au:antunit] Target: testZipSource took 0.007 sec
[au:antunit] Build File: /srv/gump/public/workspace/antlibs-compress/src/tests/antunit/zipfileset-test.xml
[au:antunit] Tests run: 9, Failures: 0, Errors: 0, Time elapsed: 0.166 sec
[au:antunit] Target: testSkipUnreadableEntries took 0.009 sec
[au:antunit] Target: testMissingArchive took 0.003 sec
[au:antunit] Target: testUncompressSource took 0.01 sec
[au:antunit] Target: test-refid-check-encoding took 0.003 sec
[au:antunit] Target: testZipSource took 0.008 sec
[au:antunit] Target: test-refid-modify took 0.068 sec
[au:antunit] Target: test-refid-check-prefix took 0.006 sec
[au:antunit] Target: testMissingArchiveDoesntMatter took 0.007 sec
[au:antunit] Target: testFailsOnUnreadableEntries took 0.008 sec
[au:antunit] Build File: /srv/gump/public/workspace/antlibs-compress/src/tests/antunit/zresource-test.xml
[au:antunit] Tests run: 1, Failures: 0, Errors: 0, Time elapsed: 0.031 sec
[au:antunit] Target: testNativeZ took 0.016 sec

test:

BUILD FAILED
/srv/gump/public/workspace/antlibs-compress/common/build.xml:209: At least one AntUnit test has failed.

Total time: 4 minutes 22 seconds
---------------------------------------------

To subscribe to this information via syndicated feeds:
- RSS: http://vmgump.apache.org/gump/public/antlibs-compress/compress-antlib-test/rss.xml
- Atom: http://vmgump.apache.org/gump/public/antlibs-compress/compress-antlib-test/atom.xml

============================== Gump Tracking Only ===
Produced by Apache Gump(TM) version 2.3.
Gump Run 20160805000006, vmgump.apache.org:vmgump:20160805000006
Gump E-mail Identifier (unique within run) #13.

*********************************************************** G U M P
[GUMP@vmgump]: Project commons-cli (in module apache-commons) failed
To whom it may engage...
        
This is an automated request, but not an unsolicited one. For 
more information please visit http://gump.apache.org/nagged.html, 
and/or contact the folk at general@gump.apache.org.

Project commons-cli has an issue affecting its community integration,
 and has been outstanding for 17 runs.
The current state of this project is 'Failed', with reason 'Update Failed'.

Full details are available at:
    http://vmgump.apache.org/gump/public/apache-commons/commons-cli/index.html

That said, some information snippets are provided here.

The following annotations (debug/informational/warning/error messages) were provided:
 -DEBUG- Sole jar output [commons-cli-*[0-9T].jar] identifier set to project name
 -INFO- Failed with reason update failed
 -INFO- Failed to extract fallback artifacts from Gump Repository

To subscribe to this information via syndicated feeds:
- RSS: http://vmgump.apache.org/gump/public/apache-commons/commons-cli/rss.xml
- Atom: http://vmgump.apache.org/gump/public/apache-commons/commons-cli/atom.xml

============================== Gump Tracking Only ===
Produced by Apache Gump(TM) version 2.3.
Gump Run 20160805000006, vmgump.apache.org:vmgump:20160805000006
Gump E-mail Identifier (unique within run) #14.

*********************************************************** G U M P
[GUMP@vmgump]: Project commons-jxpath (in module apache-commons) failed
To whom it may engage...
        
This is an automated request, but not an unsolicited one. For 
more information please visit http://gump.apache.org/nagged.html, 
and/or contact the folk at general@gump.apache.org.

Project commons-jxpath has an issue affecting its community integration,
 and has been outstanding for 17 runs.
The current state of this project is 'Failed', with reason 'Update Failed'.

Full details are available at:
    http://vmgump.apache.org/gump/public/apache-commons/commons-jxpath/index.html

That said, some information snippets are provided here.

The following annotations (debug/informational/warning/error messages) were provided:
 -DEBUG- Sole jar output [commons-jxpath-*[0-9T].jar] identifier set to project name
 -INFO- Optional dependency commons-beanutils prerequisite failed with reason update failed
 -INFO- Failed with reason update failed
 -INFO- Failed to extract fallback artifacts from Gump Repository

To subscribe to this information via syndicated feeds:
- RSS: http://vmgump.apache.org/gump/public/apache-commons/commons-jxpath/rss.xml
- Atom: http://vmgump.apache.org/gump/public/apache-commons/commons-jxpath/atom.xml

============================== Gump Tracking Only ===
Produced by Apache Gump(TM) version 2.3.
Gump Run 20160805000006, vmgump.apache.org:vmgump:20160805000006
Gump E-mail Identifier (unique within run) #15.

*********************************************************** G U M P
[GUMP@vmgump]: Project test-ant (in module ant) failed
To whom it may engage...
        
This is an automated request, but not an unsolicited one. For 
more information please visit http://gump.apache.org/nagged.html, 
and/or contact the folk at general@gump.apache.org.

Project test-ant has an issue affecting its community integration.
This issue affects 1 projects,
 and has been outstanding for 58 runs.
The current state of this project is 'Failed', with reason 'Build Failed'.
For reference only, the following projects are affected by this:
    - test-ant :  Java based build tool


Full details are available at:
    http://vmgump.apache.org/gump/public/ant/test-ant/index.html

That said, some information snippets are provided here.

The following annotations (debug/informational/warning/error messages) were provided:
 -WARNING- Bad *Optional* Dependency. Project: bsh : unknown to *this* workspace
 -INFO- Failed with reason build failed



The following work was performed:
http://vmgump.apache.org/gump/public/ant/test-ant/gump_work/build_ant_test-ant.html
Work Name: build_ant_test-ant (Type: Build)
Work ended in a state of : Failed
Elapsed: 10 mins 27 secs
Command Line: /usr/lib/jvm/java-8-oracle/bin/java -Djava.awt.headless=true -Dbuild.sysclasspath=only -Xbootclasspath/p:/srv/gump/public/workspace/xml-xerces2/build/xercesImpl.jar:/srv/gump/public/workspace/xml-commons/java/external/build/xml-apis.jar:/srv/gump/public/workspace/xml-xalan/build/xalan-unbundled.jar:/srv/gump/public/workspace/xml-xalan/build/serializer.jar org.apache.tools.ant.Main -Dgump.merge=/srv/gump/public/gump/work/merge.xml -Dtest.haltonfailure=false -Dant.home=/srv/gump/public/workspace/ant/dist run-tests 
[Working Directory: /srv/gump/public/workspace/ant]
CLASSPATH: /usr/lib/jvm/java-8-oracle/lib/tools.jar:/srv/gump/public/workspace/ant/build/testcases:/srv/gump/public/workspace/ant/src/tests/junit:/srv/gump/public/workspace/ant/src/etc/testcases:/srv/gump/public/workspace/ant/src/etc/testcases/taskdefs/optional/out:/srv/gump/public/workspace/ant/src/tests/antunit/filters:/srv/gump/public/workspace/ant/src/tests/antunit/taskdefs/importtests:/srv/gump/public/workspace/ant/src/tests/antunit/filters/foo:/srv/gump/public/workspace/ant/src/tests/antunit/taskdefs/foo:/srv/gump/public/workspace/ant/build/antunit/tmp/testinput/build:/srv/gump/public/workspace/ant/build/antunit/tmp/testoutput:/srv/gump/public/workspace/ant/build/antunit/tmp/test.jar:/srv/gump/public/workspace/ant/build/antunit/tmp/test1.jar:/srv/gump/public/workspace/ant/build/antunit/tmp/test2.jar:/srv/gump/public/workspace/ant/build/antunit/tmp/test3.jar:/srv/gump/public/workspace/ant/build/antunit/tmp/test4.jar:/srv/gump/public/workspace/ant/build/antunit/tmp/test5.jar:/srv
 /gump/public/workspace/ant/build/antunit/tmp/resources:/srv/gump/public/workspace/ant/build/lib/ant.jar:/srv/gump/public/workspace/ant/build/lib/ant-launcher.jar:/srv/gump/public/workspace/ant/build/lib/ant-antlr.jar:/srv/gump/public/workspace/ant/build/lib/ant-apache-bcel.jar:/srv/gump/public/workspace/ant/build/lib/ant-apache-bsf.jar:/srv/gump/public/workspace/ant/build/lib/ant-apache-log4j.jar:/srv/gump/public/workspace/ant/build/lib/ant-apache-oro.jar:/srv/gump/public/workspace/ant/build/lib/ant-apache-regexp.jar:/srv/gump/public/workspace/ant/build/lib/ant-apache-resolver.jar:/srv/gump/public/workspace/ant/build/lib/ant-apache-xalan2.jar:/srv/gump/public/workspace/ant/build/lib/ant-commons-logging.jar:/srv/gump/public/workspace/ant/build/lib/ant-commons-net.jar:/srv/gump/public/workspace/ant/build/lib/ant-jai.jar:/srv/gump/public/workspace/ant/build/lib/ant-javamail.jar:/srv/gump/public/workspace/ant/build/lib/ant-jdepend.jar:/srv/gump/public/workspace/ant/build/lib/ant-jmf.jar
 :/srv/gump/public/workspace/ant/build/lib/ant-jsch.jar:/srv/gump/public/workspace/ant/build/lib/ant-junit.jar:/srv/gump/public/workspace/ant/build/lib/ant-junit4.jar:/srv/gump/public/workspace/ant/build/lib/ant-swing.jar:/srv/gump/packages/antlr/antlr-3.1.3.jar:/srv/gump/public/workspace/ant-contrib/lib/bcel/jars/bcel-5.1.jar:/srv/gump/public/workspace/apache-commons/logging/target/commons-logging-20160805.jar:/srv/gump/public/workspace/apache-commons/logging/target/commons-logging-api-20160805.jar:/srv/gump/public/workspace/apache-commons/net/target/commons-net-[0-9T]*[0-9T].jar:/srv/gump/public/workspace/apache-commons/net/target/commons-net-ftp-*[0-9T].jar:/srv/gump/packages/jaf-1.1ea/activation.jar:/srv/gump/public/workspace/jakarta-bsf/build/lib/bsf.jar:/srv/gump/packages/apache-attic/jakarta-regexp-1.5.jar:/srv/gump/public/workspace/jakarta-servletapi-5/jsr154/dist/lib/servlet-api.jar:/srv/gump/packages/javamail-1.4/mail.jar:/srv/gump/packages/javamail-1.4/lib/mailapi.jar:/srv
 /gump/packages/jdepend-2.6/lib/jdepend.jar:/srv/gump/packages/jsch/jsch-0.1.45.jar:/srv/gump/public/workspace/logging-log4j-12/target/log4j-1.2.18-SNAPSHOT.jar:/srv/gump/packages/apache-attic/oro-2.0.8.jar:/srv/gump/public/workspace/antlibs-antunit/build/ant-antunit-20160805.jar:/srv/gump/packages/hamcrest/hamcrest-core-1.3.jar:/srv/gump/public/workspace/junit/target/junit-4.13-SNAPSHOT.jar:/srv/gump/public/workspace/xml-commons/java/external/build/xml-apis-ext.jar:/srv/gump/public/workspace/commons-codec-1.x/dist/commons-codec-20160805.jar
---------------------------------------------
[au:antunit] Build File: /srv/gump/public/workspace/ant/src/tests/antunit/types/selectors/modified-test.xml
[au:antunit] Tests run: 1, Failures: 0, Errors: 0, Time elapsed: 0.04 sec
[au:antunit] Target: testUpdate took 0.036 sec
[au:antunit] Build File: /srv/gump/public/workspace/ant/src/tests/antunit/types/selectors/ownedby-test.xml
[au:antunit] Tests run: 3, Failures: 0, Errors: 0, Time elapsed: 0.053 sec
[au:antunit] Target: testOwnedBy took 0.014 sec
[au:antunit] Target: testAsTrueConditions took 0.001 sec
[au:antunit] Target: testRequiresOwner took 0.002 sec
[au:antunit] Build File: /srv/gump/public/workspace/ant/src/tests/antunit/types/selectors/present-test.xml
[au:antunit] Tests run: 1, Failures: 0, Errors: 0, Time elapsed: 0.013 sec
[au:antunit] Target: testMapperByTypedef took 0.009 sec
[au:antunit] Build File: /srv/gump/public/workspace/ant/src/tests/antunit/types/selectors/readwrite-test.xml
[au:antunit] Tests run: 4, Failures: 0, Errors: 0, Time elapsed: 0.126 sec
[au:antunit] Target: testWritable took 0.015 sec
[au:antunit] Target: testAsConditions took 0.006 sec
[au:antunit] Target: testReadable took 0.002 sec
[au:antunit] Target: testUnwritable took 0.002 sec
[au:antunit] Build File: /srv/gump/public/workspace/ant/src/tests/antunit/types/selectors/select-test.xml
[au:antunit] Tests run: 4, Failures: 0, Errors: 0, Time elapsed: 0.098 sec
[au:antunit] Target: testIfFalse took 0.016 sec
[au:antunit] Target: testIfNotSet took 0.009 sec
[au:antunit] Target: testIfTrue took 0.007 sec
[au:antunit] Target: testIfSet took 0.01 sec
[au:antunit] Build File: /srv/gump/public/workspace/ant/src/tests/antunit/types/selectors/symlink-test.xml
[au:antunit] Tests run: 4, Failures: 0, Errors: 0, Time elapsed: 0.09 sec
[au:antunit] Target: testAsFalseConditions took 0.007 sec
[au:antunit] Target: testAsTrueConditions took 0.022 sec
[au:antunit] Target: testNoSymlink took 0.002 sec
[au:antunit] Target: testSymlink took 0.02 sec
[au:antunit] Build File: /srv/gump/public/workspace/ant/src/tests/antunit/types/tarfileset-test.xml
[au:antunit] Tests run: 3, Failures: 0, Errors: 0, Time elapsed: 0.033 sec
[au:antunit] Target: test-refid-check-encoding took 0.001 sec
[au:antunit] Target: testMissingArchive took 0.002 sec
[au:antunit] Target: testMissingArchiveDoesntMatter took 0 sec
[au:antunit] Build File: /srv/gump/public/workspace/ant/src/tests/antunit/types/zipfileset-test.xml
[au:antunit] Tests run: 5, Failures: 0, Errors: 0, Time elapsed: 0.1 sec
[au:antunit] Target: testMissingArchive took 0.001 sec
[au:antunit] Target: test-refid-check-encoding took 0.003 sec
[au:antunit] Target: test-refid-modify took 0.036 sec
[au:antunit] Target: test-refid-check-prefix took 0.001 sec
[au:antunit] Target: testMissingArchiveDoesntMatter took 0.001 sec

check-failed:

run-tests:

BUILD FAILED
/srv/gump/public/workspace/ant/build.xml:1598: Unit tests failed

Total time: 10 minutes 26 seconds
---------------------------------------------

To subscribe to this information via syndicated feeds:
- RSS: http://vmgump.apache.org/gump/public/ant/test-ant/rss.xml
- Atom: http://vmgump.apache.org/gump/public/ant/test-ant/atom.xml

============================== Gump Tracking Only ===
Produced by Apache Gump(TM) version 2.3.
Gump Run 20160805000006, vmgump.apache.org:vmgump:20160805000006
Gump E-mail Identifier (unique within run) #16.

*********************************************************** G U M P
[GUMP@vmgump]: Project commons-bcel6 (in module apache-commons) failed
To whom it may engage...
        
This is an automated request, but not an unsolicited one. For 
more information please visit http://gump.apache.org/nagged.html, 
and/or contact the folk at general@gump.apache.org.

Project commons-bcel6 has an issue affecting its community integration,
 and has been outstanding for 121 runs.
The current state of this project is 'Failed', with reason 'Update Failed'.

Full details are available at:
    http://vmgump.apache.org/gump/public/apache-commons/commons-bcel6/index.html

That said, some information snippets are provided here.

The following annotations (debug/informational/warning/error messages) were provided:
 -DEBUG- Sole jar output [commons-bcel6-[0-9]*[0-9T].jar] identifier set to project name
 -INFO- Optional dependency commons-logging failed with reason update failed
 -INFO- Optional dependency commons-cli failed with reason update failed
 -INFO- Failed with reason update failed
 -INFO- Optional dependency commons-io failed with reason update failed
 -INFO- Failed to extract fallback artifacts from Gump Repository

To subscribe to this information via syndicated feeds:
- RSS: http://vmgump.apache.org/gump/public/apache-commons/commons-bcel6/rss.xml
- Atom: http://vmgump.apache.org/gump/public/apache-commons/commons-bcel6/atom.xml

============================== Gump Tracking Only ===
Produced by Apache Gump(TM) version 2.3.
Gump Run 20160805000006, vmgump.apache.org:vmgump:20160805000006
Gump E-mail Identifier (unique within run) #17.

*********************************************************** G U M P
[GUMP@vmgump]: Project commons-exec (in module apache-commons) failed
To whom it may engage...
        
This is an automated request, but not an unsolicited one. For 
more information please visit http://gump.apache.org/nagged.html, 
and/or contact the folk at general@gump.apache.org.

Project commons-exec has an issue affecting its community integration,
 and has been outstanding for 17 runs.
The current state of this project is 'Failed', with reason 'Update Failed'.

Full details are available at:
    http://vmgump.apache.org/gump/public/apache-commons/commons-exec/index.html

That said, some information snippets are provided here.

The following annotations (debug/informational/warning/error messages) were provided:
 -DEBUG- Sole jar output [commons-exec-*[0-9T].jar] identifier set to project name
 -INFO- Optional dependency commons-cli failed with reason update failed
 -INFO- Failed with reason update failed
 -INFO- Failed to extract fallback artifacts from Gump Repository

To subscribe to this information via syndicated feeds:
- RSS: http://vmgump.apache.org/gump/public/apache-commons/commons-exec/rss.xml
- Atom: http://vmgump.apache.org/gump/public/apache-commons/commons-exec/atom.xml

============================== Gump Tracking Only ===
Produced by Apache Gump(TM) version 2.3.
Gump Run 20160805000006, vmgump.apache.org:vmgump:20160805000006
Gump E-mail Identifier (unique within run) #18.


--
Apache Gump
http://gump.apache.org/ [Instance: vmgump]

---------------------------------------------------------------------
To unsubscribe, e-mail: general-unsubscribe@gump.apache.org
For additional commands, e-mail: general-help@gump.apache.org


Mime
View raw message