gump-general mailing list archives

Site index · List index
Message view « Date » · « Thread »
Top « Date » · « Thread »
From g...@vmgump.apache.org
Subject BATCH: All dressed up, with nowhere to go...
Date Mon, 18 Jul 2016 06:10:16 GMT
Dear Gumpmeisters,
            
The following 4 notifys should have been sent

*********************************************************** G U M P
[GUMP@vmgump]: Project openssl-make-install (in module openssl-master) failed
[GUMP@vmgump]: Project compress-antlib-test (in module antlibs-compress) failed
[GUMP@vmgump]: Project test-ant (in module ant) failed
[GUMP@vmgump]: Project commons-bcel6 (in module apache-commons) failed
*********************************************************** G U M P
[GUMP@vmgump]: Project openssl-make-install (in module openssl-master) failed
To whom it may engage...
        
This is an automated request, but not an unsolicited one. For 
more information please visit http://gump.apache.org/nagged.html, 
and/or contact the folk at general@gump.apache.org.

Project openssl-make-install has an issue affecting its community integration.
This issue affects 13 projects,
 and has been outstanding for 20 runs.
The current state of this project is 'Failed', with reason 'Build Failed'.
For reference only, the following projects are affected by this:
    - apache-httpd-configure :  Apache HTTP Server
    - apache-httpd-make :  Apache HTTP Server
    - apache-httpd-make-install :  Apache HTTP Server
    - openssl-make-install :  OpenSSL Encryption Library
    - tomcat-jk-native :  Connectors to various web servers
    - tomcat-jk-native-buildconf :  Connectors to various web servers
    - tomcat-jk-native-configure :  Connectors to various web servers
    - tomcat-native-trunk-configure :  Tomcat native library using Apache Portable Runtime
    - tomcat-native-trunk-make :  Tomcat native library using Apache Portable Runtime
    - tomcat-native-trunk-make-install :  Tomcat native library using Apache Portable Runtime
    - tomcat-trunk-test-apr :  Tomcat 9.x, a web server implementing the Java Servlet 4.0,
...
    - tomcat-trunk-test-nio :  Tomcat 9.x, a web server implementing the Java Servlet 4.0,
...
    - tomcat-trunk-test-nio2 :  Tomcat 9.x, a web server implementing the Java Servlet 4.0,
...


Full details are available at:
    http://vmgump.apache.org/gump/public/openssl-master/openssl-make-install/index.html

That said, some information snippets are provided here.

The following annotations (debug/informational/warning/error messages) were provided:
 -INFO- Failed with reason build failed
 -INFO- Failed to extract fallback artifacts from Gump Repository



The following work was performed:
http://vmgump.apache.org/gump/public/openssl-master/openssl-make-install/gump_work/build_openssl-master_openssl-make-install.html
Work Name: build_openssl-master_openssl-make-install (Type: Build)
Work ended in a state of : Failed
Elapsed: 22 secs
Command Line: make install 
[Working Directory: /srv/gump/public/workspace/openssl-master]
---------------------------------------------
BIO_get_conn_port.3 => BIO_s_connect.3
link /srv/gump/public/workspace/openssl-master/dest-20160718/share/man/man3/BIO_set_nbio.3
-> /srv/gump/public/workspace/openssl-master/dest-20160718/share/man/man3/BIO_s_connect.3
BIO_set_nbio.3 => BIO_s_connect.3
link /srv/gump/public/workspace/openssl-master/dest-20160718/share/man/man3/BIO_do_connect.3
-> /srv/gump/public/workspace/openssl-master/dest-20160718/share/man/man3/BIO_s_connect.3
BIO_do_connect.3 => BIO_s_connect.3
install ./doc/crypto/BIO_s_fd.pod -> /srv/gump/public/workspace/openssl-master/dest-20160718/share/man/man3/BIO_s_fd.3
link /srv/gump/public/workspace/openssl-master/dest-20160718/share/man/man3/BIO_set_fd.3 ->
/srv/gump/public/workspace/openssl-master/dest-20160718/share/man/man3/BIO_s_fd.3
BIO_set_fd.3 => BIO_s_fd.3
link /srv/gump/public/workspace/openssl-master/dest-20160718/share/man/man3/BIO_get_fd.3 ->
/srv/gump/public/workspace/openssl-master/dest-20160718/share/man/man3/BIO_s_fd.3
BIO_get_fd.3 => BIO_s_fd.3
link /srv/gump/public/workspace/openssl-master/dest-20160718/share/man/man3/BIO_new_fd.3 ->
/srv/gump/public/workspace/openssl-master/dest-20160718/share/man/man3/BIO_s_fd.3
BIO_new_fd.3 => BIO_s_fd.3
install ./doc/crypto/BIO_s_file.pod -> /srv/gump/public/workspace/openssl-master/dest-20160718/share/man/man3/BIO_s_file.3
link /srv/gump/public/workspace/openssl-master/dest-20160718/share/man/man3/BIO_new_file.3
-> /srv/gump/public/workspace/openssl-master/dest-20160718/share/man/man3/BIO_s_file.3
BIO_new_file.3 => BIO_s_file.3
link /srv/gump/public/workspace/openssl-master/dest-20160718/share/man/man3/BIO_new_fp.3 ->
/srv/gump/public/workspace/openssl-master/dest-20160718/share/man/man3/BIO_s_file.3
BIO_new_fp.3 => BIO_s_file.3
link /srv/gump/public/workspace/openssl-master/dest-20160718/share/man/man3/BIO_set_fp.3 ->
/srv/gump/public/workspace/openssl-master/dest-20160718/share/man/man3/BIO_s_file.3
BIO_set_fp.3 => BIO_s_file.3
link /srv/gump/public/workspace/openssl-master/dest-20160718/share/man/man3/BIO_get_fp.3 ->
/srv/gump/public/workspace/openssl-master/dest-20160718/share/man/man3/BIO_s_file.3
BIO_get_fp.3 => BIO_s_file.3
link /srv/gump/public/workspace/openssl-master/dest-20160718/share/man/man3/BIO_read_filename.3
-> /srv/gump/public/workspace/openssl-master/dest-20160718/share/man/man3/BIO_s_file.3
BIO_read_filename.3 => BIO_s_file.3
link /srv/gump/public/workspace/openssl-master/dest-20160718/share/man/man3/BIO_write_filename.3
-> /srv/gump/public/workspace/openssl-master/dest-20160718/share/man/man3/BIO_s_file.3
BIO_write_filename.3 => BIO_s_file.3
link /srv/gump/public/workspace/openssl-master/dest-20160718/share/man/man3/BIO_append_filename.3
-> /srv/gump/public/workspace/openssl-master/dest-20160718/share/man/man3/BIO_s_file.3
BIO_append_filename.3 => BIO_s_file.3
link /srv/gump/public/workspace/openssl-master/dest-20160718/share/man/man3/BIO_rw_filename.3
-> /srv/gump/public/workspace/openssl-master/dest-20160718/share/man/man3/BIO_s_file.3
BIO_rw_filename.3 => BIO_s_file.3
install ./doc/crypto/BIO_s_mem.pod -> /srv/gump/public/workspace/openssl-master/dest-20160718/share/man/man3/BIO_s_mem.3
link /srv/gump/public/workspace/openssl-master/dest-20160718/share/man/man3/BIO_s_secmem.3
-> /srv/gump/public/workspace/openssl-master/dest-20160718/share/man/man3/BIO_s_mem.3
BIO_s_secmem.3 => BIO_s_mem.3
link /srv/gump/public/workspace/openssl-master/dest-20160718/share/man/man3/BIO_set_mem_eof_return.3
-> /srv/gump/public/workspace/openssl-master/dest-20160718/share/man/man3/BIO_s_mem.3
BIO_set_mem_eof_return.3 => BIO_s_mem.3
link /srv/gump/public/workspace/openssl-master/dest-20160718/share/man/man3/BIO_get_mem_data.3
-> /srv/gump/public/workspace/openssl-master/dest-20160718/share/man/man3/BIO_s_mem.3
BIO_get_mem_data.3 => BIO_s_mem.3
link /srv/gump/public/workspace/openssl-master/dest-20160718/share/man/man3/BIO_set_mem_buf.3
-> /srv/gump/public/workspace/openssl-master/dest-20160718/share/man/man3/BIO_s_mem.3
BIO_set_mem_buf.3 => BIO_s_mem.3
link /srv/gump/public/workspace/openssl-master/dest-20160718/share/man/man3/BIO_get_mem_ptr.3
-> /srv/gump/public/workspace/openssl-master/dest-20160718/share/man/man3/BIO_s_mem.3
BIO_get_mem_ptr.3 => BIO_s_mem.3
link /srv/gump/public/workspace/openssl-master/dest-20160718/share/man/man3/BIO_new_mem_buf.3
-> /srv/gump/public/workspace/openssl-master/dest-20160718/share/man/man3/BIO_s_mem.3
BIO_new_mem_buf.3 => BIO_s_mem.3
install ./doc/crypto/BIO_s_null.pod -> /srv/gump/public/workspace/openssl-master/dest-20160718/share/man/man3/BIO_s_null.3
install ./doc/crypto/BIO_s_socket.pod -> /srv/gump/public/workspace/openssl-master/dest-20160718/share/man/man3/BIO_s_socket.3
link /srv/gump/public/workspace/openssl-master/dest-20160718/share/man/man3/BIO_new_socket.3
-> /srv/gump/public/workspace/openssl-master/dest-20160718/share/man/man3/BIO_s_socket.3
BIO_new_socket.3 => BIO_s_socket.3
install ./doc/crypto/BIO_set_callback.pod -> /srv/gump/public/workspace/openssl-master/dest-20160718/share/man/man3/BIO_set_callback.3
IO::File=IO(0xf0c090) around line 42: =over should be: '=over' or '=over positive_number'
POD document had syntax errors at /usr/bin/pod2man line 71.
make: *** [install_man_docs] Error 255
---------------------------------------------

To subscribe to this information via syndicated feeds:
- RSS: http://vmgump.apache.org/gump/public/openssl-master/openssl-make-install/rss.xml
- Atom: http://vmgump.apache.org/gump/public/openssl-master/openssl-make-install/atom.xml

============================== Gump Tracking Only ===
Produced by Apache Gump(TM) version 2.3.
Gump Run 20160718000006, vmgump.apache.org:vmgump:20160718000006
Gump E-mail Identifier (unique within run) #1.

*********************************************************** G U M P
[GUMP@vmgump]: Project compress-antlib-test (in module antlibs-compress) failed
To whom it may engage...
        
This is an automated request, but not an unsolicited one. For 
more information please visit http://gump.apache.org/nagged.html, 
and/or contact the folk at general@gump.apache.org.

Project compress-antlib-test has an issue affecting its community integration.
This issue affects 1 projects,
 and has been outstanding for 3 runs.
The current state of this project is 'Failed', with reason 'Build Failed'.
For reference only, the following projects are affected by this:
    - compress-antlib-test :  The Apache Compress Antlib contains tasks and resources that...


Full details are available at:
    http://vmgump.apache.org/gump/public/antlibs-compress/compress-antlib-test/index.html

That said, some information snippets are provided here.

The following annotations (debug/informational/warning/error messages) were provided:
 -DEBUG- Dependency on ant exists, no need to add for property ant.home.
 -INFO- Failed with reason build failed



The following work was performed:
http://vmgump.apache.org/gump/public/antlibs-compress/compress-antlib-test/gump_work/build_antlibs-compress_compress-antlib-test.html
Work Name: build_antlibs-compress_compress-antlib-test (Type: Build)
Work ended in a state of : Failed
Elapsed: 4 mins 31 secs
Command Line: /usr/lib/jvm/java-8-oracle/bin/java -Djava.awt.headless=true -Dbuild.sysclasspath=only
-Xbootclasspath/p:/srv/gump/public/workspace/xml-xerces2/build/xercesImpl.jar:/srv/gump/public/workspace/xml-commons/java/external/build/xml-apis.jar
org.apache.tools.ant.Main -Dgump.merge=/srv/gump/public/gump/work/merge.xml -Dant.home=/srv/gump/public/workspace/ant/dist
test 
[Working Directory: /srv/gump/public/workspace/antlibs-compress]
CLASSPATH: /usr/lib/jvm/java-8-oracle/lib/tools.jar:/srv/gump/public/workspace/antlibs-compress/ivy/ivy.jar:/srv/gump/public/workspace/antlibs-compress/build/ant-compress-20160718.jar:/srv/gump/public/workspace/ant/dist/lib/ant.jar:/srv/gump/public/workspace/ant/dist/lib/ant-launcher.jar:/srv/gump/public/workspace/ant/dist/lib/ant-jmf.jar:/srv/gump/public/workspace/ant/dist/lib/ant-junit.jar:/srv/gump/public/workspace/ant/dist/lib/ant-junit4.jar:/srv/gump/public/workspace/ant/dist/lib/ant-swing.jar:/srv/gump/public/workspace/ant/dist/lib/ant-apache-resolver.jar:/srv/gump/public/workspace/ant/dist/lib/ant-apache-xalan2.jar:/srv/gump/public/workspace/commons-compress/target/commons-compress-1.13-SNAPSHOT.jar:/srv/gump/public/workspace/xz-java/build/jar-20160718/xz.jar:/srv/gump/public/workspace/antlibs-antunit/build/ant-antunit-20160718.jar:/srv/gump/public/workspace/xml-commons/java/external/build/xml-apis-ext.jar
---------------------------------------------
[au:antunit] Target: testWithDirectories took 0.047 sec
[au:antunit] Target: testFullpath took 0.05 sec
[au:antunit] Target: testPreserve0Permissions took 0.055 sec
[au:antunit] Target: testForceCreateOfUpToDate took 4.118 sec
[au:antunit] Target: testNoDirectoriesByDefault took 0.03 sec
[au:antunit] Target: testPlainFileSet took 0.029 sec
[au:antunit] Target: testReplaceOfUpToDate took 4.018 sec
[au:antunit] Target: testCoreZipFileSet  FAILED
[au:antunit] 	at line 35, column 24
[au:antunit] 	Message: Assertion failed
[au:antunit] 	took 0.018 sec
[au:antunit] Target: testAntlibTarFileSet took 0.011 sec
[au:antunit] Target: testCreateOfOutOfDate took 4.033 sec
[au:antunit] Target: testFileSetPermissionsWin took 0.025 sec
[au:antunit] Target: testAddDuplicates took 0.015 sec
[au:antunit] Target: testRemoveLeadingSlashes took 0.02 sec
[au:antunit] Target: testPrefixWithSlash took 0.017 sec
[au:antunit] Target: testWithImplicitDirectories took 0.014 sec
[au:antunit] Target: testForceReplaceOfUpToDate took 4.029 sec
[au:antunit] Target: test0PermissionsGetReplaced took 0.013 sec
[au:antunit] Target: testFailDuplicates took 0.003 sec
[au:antunit] Build File: /srv/gump/public/workspace/antlibs-compress/src/tests/antunit/zipentry-test.xml
[au:antunit] Tests run: 3, Failures: 1, Errors: 0, Time elapsed: 0.033 sec
[au:antunit] Target: testResourceProperties  FAILED
[au:antunit] 	at line 59, column 20
[au:antunit] 	Message: Assertion failed
[au:antunit] 	took 0.01 sec
[au:antunit] Target: testUncompressSource took 0.008 sec
[au:antunit] Target: testZipSource took 0.005 sec
[au:antunit] Build File: /srv/gump/public/workspace/antlibs-compress/src/tests/antunit/zipfileset-test.xml
[au:antunit] Tests run: 9, Failures: 0, Errors: 0, Time elapsed: 0.322 sec
[au:antunit] Target: testSkipUnreadableEntries took 0.008 sec
[au:antunit] Target: testMissingArchive took 0.002 sec
[au:antunit] Target: testUncompressSource took 0.011 sec
[au:antunit] Target: test-refid-check-encoding took 0.008 sec
[au:antunit] Target: testZipSource took 0.007 sec
[au:antunit] Target: test-refid-modify took 0.242 sec
[au:antunit] Target: test-refid-check-prefix took 0.004 sec
[au:antunit] Target: testMissingArchiveDoesntMatter took 0.003 sec
[au:antunit] Target: testFailsOnUnreadableEntries took 0.008 sec
[au:antunit] Build File: /srv/gump/public/workspace/antlibs-compress/src/tests/antunit/zresource-test.xml
[au:antunit] Tests run: 1, Failures: 0, Errors: 0, Time elapsed: 0.026 sec
[au:antunit] Target: testNativeZ took 0.015 sec

test:

BUILD FAILED
/srv/gump/public/workspace/antlibs-compress/common/build.xml:209: At least one AntUnit test
has failed.

Total time: 4 minutes 30 seconds
---------------------------------------------

To subscribe to this information via syndicated feeds:
- RSS: http://vmgump.apache.org/gump/public/antlibs-compress/compress-antlib-test/rss.xml
- Atom: http://vmgump.apache.org/gump/public/antlibs-compress/compress-antlib-test/atom.xml

============================== Gump Tracking Only ===
Produced by Apache Gump(TM) version 2.3.
Gump Run 20160718000006, vmgump.apache.org:vmgump:20160718000006
Gump E-mail Identifier (unique within run) #3.

*********************************************************** G U M P
[GUMP@vmgump]: Project test-ant (in module ant) failed
To whom it may engage...
        
This is an automated request, but not an unsolicited one. For 
more information please visit http://gump.apache.org/nagged.html, 
and/or contact the folk at general@gump.apache.org.

Project test-ant has an issue affecting its community integration.
This issue affects 1 projects,
 and has been outstanding for 9 runs.
The current state of this project is 'Failed', with reason 'Build Failed'.
For reference only, the following projects are affected by this:
    - test-ant :  Java based build tool


Full details are available at:
    http://vmgump.apache.org/gump/public/ant/test-ant/index.html

That said, some information snippets are provided here.

The following annotations (debug/informational/warning/error messages) were provided:
 -WARNING- Bad *Optional* Dependency. Project: bsh : unknown to *this* workspace
 -INFO- Failed with reason build failed



The following work was performed:
http://vmgump.apache.org/gump/public/ant/test-ant/gump_work/build_ant_test-ant.html
Work Name: build_ant_test-ant (Type: Build)
Work ended in a state of : Failed
Elapsed: 11 mins 6 secs
Command Line: /usr/lib/jvm/java-8-oracle/bin/java -Djava.awt.headless=true -Dbuild.sysclasspath=only
-Xbootclasspath/p:/srv/gump/public/workspace/xml-xerces2/build/xercesImpl.jar:/srv/gump/public/workspace/xml-commons/java/external/build/xml-apis.jar:/srv/gump/public/workspace/xml-xalan/build/xalan-unbundled.jar:/srv/gump/public/workspace/xml-xalan/build/serializer.jar
org.apache.tools.ant.Main -Dgump.merge=/srv/gump/public/gump/work/merge.xml -Dtest.haltonfailure=false
-Dant.home=/srv/gump/public/workspace/ant/dist run-tests 
[Working Directory: /srv/gump/public/workspace/ant]
CLASSPATH: /usr/lib/jvm/java-8-oracle/lib/tools.jar:/srv/gump/public/workspace/ant/build/testcases:/srv/gump/public/workspace/ant/src/tests/junit:/srv/gump/public/workspace/ant/src/etc/testcases:/srv/gump/public/workspace/ant/src/etc/testcases/taskdefs/optional/out:/srv/gump/public/workspace/ant/src/tests/antunit/filters:/srv/gump/public/workspace/ant/src/tests/antunit/taskdefs/importtests:/srv/gump/public/workspace/ant/src/tests/antunit/filters/foo:/srv/gump/public/workspace/ant/src/tests/antunit/taskdefs/foo:/srv/gump/public/workspace/ant/build/antunit/tmp/testinput/build:/srv/gump/public/workspace/ant/build/antunit/tmp/testoutput:/srv/gump/public/workspace/ant/build/antunit/tmp/test.jar:/srv/gump/public/workspace/ant/build/antunit/tmp/test1.jar:/srv/gump/public/workspace/ant/build/antunit/tmp/test2.jar:/srv/gump/public/workspace/ant/build/antunit/tmp/test3.jar:/srv/gump/public/workspace/ant/build/antunit/tmp/test4.jar:/srv/gump/public/workspace/ant/build/antunit/tmp/test5.jar:/srv
 /gump/public/workspace/ant/build/antunit/tmp/resources:/srv/gump/public/workspace/ant/build/lib/ant.jar:/srv/gump/public/workspace/ant/build/lib/ant-launcher.jar:/srv/gump/public/workspace/ant/build/lib/ant-antlr.jar:/srv/gump/public/workspace/ant/build/lib/ant-apache-bcel.jar:/srv/gump/public/workspace/ant/build/lib/ant-apache-bsf.jar:/srv/gump/public/workspace/ant/build/lib/ant-apache-log4j.jar:/srv/gump/public/workspace/ant/build/lib/ant-apache-oro.jar:/srv/gump/public/workspace/ant/build/lib/ant-apache-regexp.jar:/srv/gump/public/workspace/ant/build/lib/ant-apache-resolver.jar:/srv/gump/public/workspace/ant/build/lib/ant-apache-xalan2.jar:/srv/gump/public/workspace/ant/build/lib/ant-commons-logging.jar:/srv/gump/public/workspace/ant/build/lib/ant-commons-net.jar:/srv/gump/public/workspace/ant/build/lib/ant-jai.jar:/srv/gump/public/workspace/ant/build/lib/ant-javamail.jar:/srv/gump/public/workspace/ant/build/lib/ant-jdepend.jar:/srv/gump/public/workspace/ant/build/lib/ant-jmf.jar
 :/srv/gump/public/workspace/ant/build/lib/ant-jsch.jar:/srv/gump/public/workspace/ant/build/lib/ant-junit.jar:/srv/gump/public/workspace/ant/build/lib/ant-junit4.jar:/srv/gump/public/workspace/ant/build/lib/ant-swing.jar:/srv/gump/packages/antlr/antlr-3.1.3.jar:/srv/gump/public/workspace/ant-contrib/lib/bcel/jars/bcel-5.1.jar:/srv/gump/public/workspace/apache-commons/logging/target/commons-logging-20160718.jar:/srv/gump/public/workspace/apache-commons/logging/target/commons-logging-api-20160718.jar:/srv/gump/public/workspace/apache-commons/net/target/commons-net-3.6-SNAPSHOT.jar:/srv/gump/public/workspace/apache-commons/net/target/commons-net-ftp-3.6-SNAPSHOT.jar:/srv/gump/packages/jaf-1.1ea/activation.jar:/srv/gump/public/workspace/jakarta-bsf/build/lib/bsf.jar:/srv/gump/packages/apache-attic/jakarta-regexp-1.5.jar:/srv/gump/public/workspace/jakarta-servletapi-5/jsr154/dist/lib/servlet-api.jar:/srv/gump/packages/javamail-1.4/mail.jar:/srv/gump/packages/javamail-1.4/lib/mailapi.jar:
 /srv/gump/packages/jdepend-2.6/lib/jdepend.jar:/srv/gump/packages/jsch/jsch-0.1.45.jar:/srv/gump/public/workspace/logging-log4j-12/target/log4j-1.2.18-SNAPSHOT.jar:/srv/gump/packages/apache-attic/oro-2.0.8.jar:/srv/gump/public/workspace/antlibs-antunit/build/ant-antunit-20160718.jar:/srv/gump/packages/hamcrest/hamcrest-core-1.3.jar:/srv/gump/public/workspace/junit/target/junit-4.13-SNAPSHOT.jar:/srv/gump/public/workspace/xml-commons/java/external/build/xml-apis-ext.jar:/srv/gump/public/workspace/commons-codec-1.x/dist/commons-codec-20160718.jar
---------------------------------------------
[au:antunit] Build File: /srv/gump/public/workspace/ant/src/tests/antunit/types/selectors/modified-test.xml
[au:antunit] Tests run: 1, Failures: 0, Errors: 0, Time elapsed: 0.02 sec
[au:antunit] Target: testUpdate took 0.018 sec
[au:antunit] Build File: /srv/gump/public/workspace/ant/src/tests/antunit/types/selectors/ownedby-test.xml
[au:antunit] Tests run: 3, Failures: 0, Errors: 0, Time elapsed: 0.015 sec
[au:antunit] Target: testOwnedBy took 0.003 sec
[au:antunit] Target: testAsTrueConditions took 0.001 sec
[au:antunit] Target: testRequiresOwner took 0 sec
[au:antunit] Build File: /srv/gump/public/workspace/ant/src/tests/antunit/types/selectors/present-test.xml
[au:antunit] Tests run: 1, Failures: 0, Errors: 0, Time elapsed: 0.003 sec
[au:antunit] Target: testMapperByTypedef took 0.001 sec
[au:antunit] Build File: /srv/gump/public/workspace/ant/src/tests/antunit/types/selectors/readwrite-test.xml
[au:antunit] Tests run: 4, Failures: 0, Errors: 0, Time elapsed: 0.048 sec
[au:antunit] Target: testWritable took 0.002 sec
[au:antunit] Target: testAsConditions took 0.009 sec
[au:antunit] Target: testReadable took 0.005 sec
[au:antunit] Target: testUnwritable took 0.001 sec
[au:antunit] Build File: /srv/gump/public/workspace/ant/src/tests/antunit/types/selectors/select-test.xml
[au:antunit] Tests run: 4, Failures: 0, Errors: 0, Time elapsed: 0.03 sec
[au:antunit] Target: testIfFalse took 0.006 sec
[au:antunit] Target: testIfNotSet took 0.006 sec
[au:antunit] Target: testIfTrue took 0.003 sec
[au:antunit] Target: testIfSet took 0.002 sec
[au:antunit] Build File: /srv/gump/public/workspace/ant/src/tests/antunit/types/selectors/symlink-test.xml
[au:antunit] Tests run: 4, Failures: 0, Errors: 0, Time elapsed: 0.065 sec
[au:antunit] Target: testAsFalseConditions took 0.005 sec
[au:antunit] Target: testAsTrueConditions took 0.035 sec
[au:antunit] Target: testNoSymlink took 0.001 sec
[au:antunit] Target: testSymlink took 0.005 sec
[au:antunit] Build File: /srv/gump/public/workspace/ant/src/tests/antunit/types/tarfileset-test.xml
[au:antunit] Tests run: 3, Failures: 0, Errors: 0, Time elapsed: 0.014 sec
[au:antunit] Target: test-refid-check-encoding took 0.001 sec
[au:antunit] Target: testMissingArchive took 0 sec
[au:antunit] Target: testMissingArchiveDoesntMatter took 0 sec
[au:antunit] Build File: /srv/gump/public/workspace/ant/src/tests/antunit/types/zipfileset-test.xml
[au:antunit] Tests run: 5, Failures: 0, Errors: 0, Time elapsed: 0.053 sec
[au:antunit] Target: testMissingArchive took 0 sec
[au:antunit] Target: test-refid-check-encoding took 0 sec
[au:antunit] Target: test-refid-modify took 0.027 sec
[au:antunit] Target: test-refid-check-prefix took 0.002 sec
[au:antunit] Target: testMissingArchiveDoesntMatter took 0 sec

check-failed:

run-tests:

BUILD FAILED
/srv/gump/public/workspace/ant/build.xml:1600: Unit tests failed

Total time: 11 minutes 5 seconds
---------------------------------------------

To subscribe to this information via syndicated feeds:
- RSS: http://vmgump.apache.org/gump/public/ant/test-ant/rss.xml
- Atom: http://vmgump.apache.org/gump/public/ant/test-ant/atom.xml

============================== Gump Tracking Only ===
Produced by Apache Gump(TM) version 2.3.
Gump Run 20160718000006, vmgump.apache.org:vmgump:20160718000006
Gump E-mail Identifier (unique within run) #4.

*********************************************************** G U M P
[GUMP@vmgump]: Project commons-bcel6 (in module apache-commons) failed
To whom it may engage...
        
This is an automated request, but not an unsolicited one. For 
more information please visit http://gump.apache.org/nagged.html, 
and/or contact the folk at general@gump.apache.org.

Project commons-bcel6 has an issue affecting its community integration.
This issue affects 1 projects,
 and has been outstanding for 72 runs.
The current state of this project is 'Failed', with reason 'Missing Build Outputs'.
For reference only, the following projects are affected by this:
    - commons-bcel6 :  Byte Code Engineering Library


Full details are available at:
    http://vmgump.apache.org/gump/public/apache-commons/commons-bcel6/index.html

That said, some information snippets are provided here.

The following annotations (debug/informational/warning/error messages) were provided:
 -DEBUG- Sole jar output [commons-bcel6-[0-9]*[0-9T].jar] identifier set to project name
 -DEBUG- (Apache Gump generated) Apache Maven Settings in: /srv/gump/public/workspace/apache-commons/bcel/gump_mvn_settings.xml
 -DEBUG- Maven POM in: /srv/gump/public/workspace/apache-commons/bcel/pom.xml
 -INFO- Failed with reason missing build outputs
 -ERROR- Missing Output: /srv/gump/public/workspace/apache-commons/bcel/target/commons-bcel6-[0-9]*[0-9T].jar
 -ERROR- See Directory Listing Work for Missing Outputs
 -INFO- Failed to extract fallback artifacts from Gump Repository



The following work was performed:
http://vmgump.apache.org/gump/public/apache-commons/commons-bcel6/gump_work/build_apache-commons_commons-bcel6.html
Work Name: build_apache-commons_commons-bcel6 (Type: Build)
Work ended in a state of : Success
Elapsed: 1 min 39 secs
Command Line: /opt/maven3/bin/mvn --batch-mode --settings /srv/gump/public/workspace/apache-commons/bcel/gump_mvn_settings.xml
package 
[Working Directory: /srv/gump/public/workspace/apache-commons/bcel]
M2_HOME: /opt/maven3
---------------------------------------------
[INFO] Building jar: /srv/gump/public/workspace/apache-commons/bcel/target/bcel-6.1-SNAPSHOT.jar
[INFO] 
[INFO] --- maven-site-plugin:3.4:attach-descriptor (attach-descriptor) @ bcel ---
[INFO] 
[INFO] --- maven-jar-plugin:2.6:test-jar (default) @ bcel ---
[INFO] Building jar: /srv/gump/public/workspace/apache-commons/bcel/target/bcel-6.1-SNAPSHOT-tests.jar
[INFO] 
[INFO] >>> maven-source-plugin:3.0.0:jar (attach-sources) > generate-sources @
bcel >>>
[INFO] 
[INFO] --- maven-enforcer-plugin:1.4.1:enforce (enforce-maven-3) @ bcel ---
[INFO] 
[INFO] --- build-helper-maven-plugin:1.10:parse-version (parse-version) @ bcel ---
[INFO] 
[INFO] --- maven-antrun-plugin:1.8:run (javadoc.resources) @ bcel ---
[INFO] Executing tasks

main:
[INFO] Executed tasks
[INFO] 
[INFO] <<< maven-source-plugin:3.0.0:jar (attach-sources) < generate-sources @
bcel <<<
[INFO] 
[INFO] --- maven-source-plugin:3.0.0:jar (attach-sources) @ bcel ---
[INFO] Downloading: http://localhost:8192/maven2/org/apache/maven/maven-archiver/3.0.0/maven-archiver-3.0.0.pom
[INFO] Downloaded: http://localhost:8192/maven2/org/apache/maven/maven-archiver/3.0.0/maven-archiver-3.0.0.pom
(5 KB at 31.6 KB/sec)
[INFO] Downloading: http://localhost:8192/maven2/org/codehaus/plexus/plexus-archiver/2.9.1/plexus-archiver-2.9.1.pom
[INFO] Downloaded: http://localhost:8192/maven2/org/codehaus/plexus/plexus-archiver/2.9.1/plexus-archiver-2.9.1.pom
(5 KB at 54.1 KB/sec)
[INFO] Downloading: http://localhost:8192/maven2/org/codehaus/plexus/plexus-io/2.4.1/plexus-io-2.4.1.pom
[INFO] Downloaded: http://localhost:8192/maven2/org/codehaus/plexus/plexus-io/2.4.1/plexus-io-2.4.1.pom
(4 KB at 29.2 KB/sec)
[INFO] Downloading: http://localhost:8192/maven2/org/codehaus/plexus/plexus-archiver/3.0.3/plexus-archiver-3.0.3.pom
[INFO] Downloaded: http://localhost:8192/maven2/org/codehaus/plexus/plexus-archiver/3.0.3/plexus-archiver-3.0.3.pom
(5 KB at 43.4 KB/sec)
[INFO] Downloading: http://localhost:8192/maven2/org/codehaus/plexus/plexus-io/2.7/plexus-io-2.7.pom
[INFO] Downloaded: http://localhost:8192/maven2/org/codehaus/plexus/plexus-io/2.7/plexus-io-2.7.pom
(5 KB at 61.5 KB/sec)
[INFO] Downloading: http://localhost:8192/maven2/org/iq80/snappy/snappy/0.4/snappy-0.4.pom
[INFO] Downloaded: http://localhost:8192/maven2/org/iq80/snappy/snappy/0.4/snappy-0.4.pom
(15 KB at 165.1 KB/sec)
[INFO] Downloading: http://localhost:8192/maven2/org/apache/maven/maven-archiver/3.0.0/maven-archiver-3.0.0.jar
[INFO] Downloading: http://localhost:8192/maven2/org/codehaus/plexus/plexus-archiver/3.0.3/plexus-archiver-3.0.3.jar
[INFO] Downloading: http://localhost:8192/maven2/org/codehaus/plexus/plexus-io/2.7/plexus-io-2.7.jar
[INFO] Downloading: http://localhost:8192/maven2/org/iq80/snappy/snappy/0.4/snappy-0.4.jar
[INFO] Downloaded: http://localhost:8192/maven2/org/apache/maven/maven-archiver/3.0.0/maven-archiver-3.0.0.jar
(23 KB at 98.3 KB/sec)
[INFO] Downloaded: http://localhost:8192/maven2/org/codehaus/plexus/plexus-io/2.7/plexus-io-2.7.jar
(84 KB at 360.7 KB/sec)
[INFO] Downloaded: http://localhost:8192/maven2/org/iq80/snappy/snappy/0.4/snappy-0.4.jar
(57 KB at 246.1 KB/sec)
[INFO] Downloaded: http://localhost:8192/maven2/org/codehaus/plexus/plexus-archiver/3.0.3/plexus-archiver-3.0.3.jar
(173 KB at 656.0 KB/sec)
[INFO] Building jar: /srv/gump/public/workspace/apache-commons/bcel/target/bcel-6.1-SNAPSHOT-sources.jar
[INFO] ------------------------------------------------------------------------
[INFO] BUILD SUCCESS
[INFO] ------------------------------------------------------------------------
[INFO] Total time: 01:35 min
[INFO] Finished at: 2016-07-18T02:26:23+00:00
[INFO] Final Memory: 30M/150M
[INFO] ------------------------------------------------------------------------
---------------------------------------------

To subscribe to this information via syndicated feeds:
- RSS: http://vmgump.apache.org/gump/public/apache-commons/commons-bcel6/rss.xml
- Atom: http://vmgump.apache.org/gump/public/apache-commons/commons-bcel6/atom.xml

============================== Gump Tracking Only ===
Produced by Apache Gump(TM) version 2.3.
Gump Run 20160718000006, vmgump.apache.org:vmgump:20160718000006
Gump E-mail Identifier (unique within run) #5.


--
Apache Gump
http://gump.apache.org/ [Instance: vmgump]

---------------------------------------------------------------------
To unsubscribe, e-mail: general-unsubscribe@gump.apache.org
For additional commands, e-mail: general-help@gump.apache.org


Mime
View raw message