gump-general mailing list archives

Site index · List index
Message view « Date » · « Thread »
Top « Date » · « Thread »
From g...@vmgump.apache.org
Subject BATCH: All dressed up, with nowhere to go...
Date Tue, 17 May 2016 11:05:40 GMT
Dear Gumpmeisters,
            
The following 2 notifys should have been sent

*********************************************************** G U M P
[GUMP@vmgump]: Project apache-httpd-make (in module apache-httpd) failed
[GUMP@vmgump]: Project compress-antlib-test (in module antlibs-compress) failed
*********************************************************** G U M P
[GUMP@vmgump]: Project apache-httpd-make (in module apache-httpd) failed
To whom it may engage...
        
This is an automated request, but not an unsolicited one. For 
more information please visit http://gump.apache.org/nagged.html, 
and/or contact the folk at general@gump.apache.org.

Project apache-httpd-make has an issue affecting its community integration.
This issue affects 5 projects,
 and has been outstanding for 10 runs.
The current state of this project is 'Failed', with reason 'Build Failed'.
For reference only, the following projects are affected by this:
    - apache-httpd-make :  Apache HTTP Server
    - apache-httpd-make-install :  Apache HTTP Server
    - tomcat-jk-native :  Connectors to various web servers
    - tomcat-jk-native-buildconf :  Connectors to various web servers
    - tomcat-jk-native-configure :  Connectors to various web servers


Full details are available at:
    http://vmgump.apache.org/gump/public/apache-httpd/apache-httpd-make/index.html

That said, some information snippets are provided here.

The following annotations (debug/informational/warning/error messages) were provided:
 -INFO- Failed with reason build failed



The following work was performed:
http://vmgump.apache.org/gump/public/apache-httpd/apache-httpd-make/gump_work/build_apache-httpd_apache-httpd-make.html
Work Name: build_apache-httpd_apache-httpd-make (Type: Build)
Work ended in a state of : Failed
Elapsed: 5 mins 18 secs
Command Line: make 
[Working Directory: /srv/gump/public/workspace/apache-httpd]
---------------------------------------------
make[3]: Leaving directory `/srv/gump/public/workspace/apache-httpd/modules/proxy'
make[3]: Entering directory `/srv/gump/public/workspace/apache-httpd/modules/session'
Building shared: mod_session.la mod_session_cookie.la mod_session_dbd.la
make[4]: Entering directory `/srv/gump/public/workspace/apache-httpd/modules/session'
/srv/gump/public/workspace/apr/dest-20160517/build-2/libtool --silent --mode=compile gcc -std=gnu99
 -g -O2 -pthread      -DLINUX -D_REENTRANT -D_GNU_SOURCE     -I. -I/srv/gump/public/workspace/apache-httpd/os/unix
-I/srv/gump/public/workspace/apache-httpd/include -I/srv/gump/public/workspace/apr/dest-20160517/include/apr-2
-I/srv/gump/public/workspace/pcre/dest-20160517/include -I/srv/gump/public/workspace/apache-httpd/modules/aaa
-I/srv/gump/public/workspace/apache-httpd/modules/cache -I/srv/gump/public/workspace/apache-httpd/modules/core
-I/srv/gump/public/workspace/apache-httpd/modules/database -I/srv/gump/public/workspace/apache-httpd/modules/filters
-I/srv/gump/public/workspace/apache-httpd/modules/ldap -I/srv/gump/public/workspace/apache-httpd/modules/loggers
-I/srv/gump/public/workspace/apache-httpd/modules/lua -I/srv/gump/public/workspace/apache-httpd/modules/proxy
-I/srv/gump/public/workspace/apache-httpd/modules/session -I/srv/gump/public/workspace/apache-httpd/modules/ssl
  -I/srv/gump/public/workspace/apache-httpd/modules/test -I/srv/gump/public/workspace/apache-httpd/server
-I/srv/gump/public/workspace/apache-httpd/modules/arch/unix -I/srv/gump/public/workspace/apache-httpd/modules/dav/main
-I/srv/gump/public/workspace/apache-httpd/modules/generators -I/srv/gump/public/workspace/apache-httpd/modules/mappers
-prefer-pic -c mod_session.c && touch mod_session.slo
/srv/gump/public/workspace/apr/dest-20160517/build-2/libtool --silent --mode=link gcc -std=gnu99
 -g -O2 -pthread           -o mod_session.la -rpath /srv/gump/public/workspace/apache-httpd/dest-20160517/modules
-module -avoid-version  mod_session.lo 
/srv/gump/public/workspace/apr/dest-20160517/build-2/libtool --silent --mode=compile gcc -std=gnu99
 -g -O2 -pthread      -DLINUX -D_REENTRANT -D_GNU_SOURCE     -I. -I/srv/gump/public/workspace/apache-httpd/os/unix
-I/srv/gump/public/workspace/apache-httpd/include -I/srv/gump/public/workspace/apr/dest-20160517/include/apr-2
-I/srv/gump/public/workspace/pcre/dest-20160517/include -I/srv/gump/public/workspace/apache-httpd/modules/aaa
-I/srv/gump/public/workspace/apache-httpd/modules/cache -I/srv/gump/public/workspace/apache-httpd/modules/core
-I/srv/gump/public/workspace/apache-httpd/modules/database -I/srv/gump/public/workspace/apache-httpd/modules/filters
-I/srv/gump/public/workspace/apache-httpd/modules/ldap -I/srv/gump/public/workspace/apache-httpd/modules/loggers
-I/srv/gump/public/workspace/apache-httpd/modules/lua -I/srv/gump/public/workspace/apache-httpd/modules/proxy
-I/srv/gump/public/workspace/apache-httpd/modules/session -I/srv/gump/public/workspace/apache-httpd/modules/ssl
  -I/srv/gump/public/workspace/apache-httpd/modules/test -I/srv/gump/public/workspace/apache-httpd/server
-I/srv/gump/public/workspace/apache-httpd/modules/arch/unix -I/srv/gump/public/workspace/apache-httpd/modules/dav/main
-I/srv/gump/public/workspace/apache-httpd/modules/generators -I/srv/gump/public/workspace/apache-httpd/modules/mappers
-prefer-pic -c mod_session_cookie.c && touch mod_session_cookie.slo
/srv/gump/public/workspace/apr/dest-20160517/build-2/libtool --silent --mode=link gcc -std=gnu99
 -g -O2 -pthread           -o mod_session_cookie.la -rpath /srv/gump/public/workspace/apache-httpd/dest-20160517/modules
-module -avoid-version  mod_session_cookie.lo 
/srv/gump/public/workspace/apr/dest-20160517/build-2/libtool --silent --mode=compile gcc -std=gnu99
 -g -O2 -pthread      -DLINUX -D_REENTRANT -D_GNU_SOURCE     -I. -I/srv/gump/public/workspace/apache-httpd/os/unix
-I/srv/gump/public/workspace/apache-httpd/include -I/srv/gump/public/workspace/apr/dest-20160517/include/apr-2
-I/srv/gump/public/workspace/pcre/dest-20160517/include -I/srv/gump/public/workspace/apache-httpd/modules/aaa
-I/srv/gump/public/workspace/apache-httpd/modules/cache -I/srv/gump/public/workspace/apache-httpd/modules/core
-I/srv/gump/public/workspace/apache-httpd/modules/database -I/srv/gump/public/workspace/apache-httpd/modules/filters
-I/srv/gump/public/workspace/apache-httpd/modules/ldap -I/srv/gump/public/workspace/apache-httpd/modules/loggers
-I/srv/gump/public/workspace/apache-httpd/modules/lua -I/srv/gump/public/workspace/apache-httpd/modules/proxy
-I/srv/gump/public/workspace/apache-httpd/modules/session -I/srv/gump/public/workspace/apache-httpd/modules/ssl
  -I/srv/gump/public/workspace/apache-httpd/modules/test -I/srv/gump/public/workspace/apache-httpd/server
-I/srv/gump/public/workspace/apache-httpd/modules/arch/unix -I/srv/gump/public/workspace/apache-httpd/modules/dav/main
-I/srv/gump/public/workspace/apache-httpd/modules/generators -I/srv/gump/public/workspace/apache-httpd/modules/mappers
-prefer-pic -c mod_session_dbd.c && touch mod_session_dbd.slo
/srv/gump/public/workspace/apr/dest-20160517/build-2/libtool --silent --mode=link gcc -std=gnu99
 -g -O2 -pthread           -o mod_session_dbd.la -rpath /srv/gump/public/workspace/apache-httpd/dest-20160517/modules
-module -avoid-version  mod_session_dbd.lo 
make[4]: Leaving directory `/srv/gump/public/workspace/apache-httpd/modules/session'
make[3]: Leaving directory `/srv/gump/public/workspace/apache-httpd/modules/session'
make[3]: Entering directory `/srv/gump/public/workspace/apache-httpd/modules/slotmem'
Building shared: mod_slotmem_shm.la
make[4]: Entering directory `/srv/gump/public/workspace/apache-httpd/modules/slotmem'
/srv/gump/public/workspace/apr/dest-20160517/build-2/libtool --silent --mode=compile gcc -std=gnu99
 -g -O2 -pthread      -DLINUX -D_REENTRANT -D_GNU_SOURCE     -I. -I/srv/gump/public/workspace/apache-httpd/os/unix
-I/srv/gump/public/workspace/apache-httpd/include -I/srv/gump/public/workspace/apr/dest-20160517/include/apr-2
-I/srv/gump/public/workspace/pcre/dest-20160517/include -I/srv/gump/public/workspace/apache-httpd/modules/aaa
-I/srv/gump/public/workspace/apache-httpd/modules/cache -I/srv/gump/public/workspace/apache-httpd/modules/core
-I/srv/gump/public/workspace/apache-httpd/modules/database -I/srv/gump/public/workspace/apache-httpd/modules/filters
-I/srv/gump/public/workspace/apache-httpd/modules/ldap -I/srv/gump/public/workspace/apache-httpd/modules/loggers
-I/srv/gump/public/workspace/apache-httpd/modules/lua -I/srv/gump/public/workspace/apache-httpd/modules/proxy
-I/srv/gump/public/workspace/apache-httpd/modules/session -I/srv/gump/public/workspace/apache-httpd/modules/ssl
  -I/srv/gump/public/workspace/apache-httpd/modules/test -I/srv/gump/public/workspace/apache-httpd/server
-I/srv/gump/public/workspace/apache-httpd/modules/arch/unix -I/srv/gump/public/workspace/apache-httpd/modules/dav/main
-I/srv/gump/public/workspace/apache-httpd/modules/generators -I/srv/gump/public/workspace/apache-httpd/modules/mappers
-prefer-pic -c mod_slotmem_shm.c && touch mod_slotmem_shm.slo
/srv/gump/public/workspace/apr/dest-20160517/build-2/libtool --silent --mode=link gcc -std=gnu99
 -g -O2 -pthread           -o mod_slotmem_shm.la -rpath /srv/gump/public/workspace/apache-httpd/dest-20160517/modules
-module -avoid-version  mod_slotmem_shm.lo 
make[4]: Leaving directory `/srv/gump/public/workspace/apache-httpd/modules/slotmem'
make[3]: Leaving directory `/srv/gump/public/workspace/apache-httpd/modules/slotmem'
make[3]: Entering directory `/srv/gump/public/workspace/apache-httpd/modules/ssl'
Building shared: mod_ssl.la
make[4]: Entering directory `/srv/gump/public/workspace/apache-httpd/modules/ssl'
/srv/gump/public/workspace/apr/dest-20160517/build-2/libtool --silent --mode=compile gcc -std=gnu99
-I/srv/gump/public/workspace/openssl-master/dest-20160517/include   -g -O2 -pthread      -DLINUX
-D_REENTRANT -D_GNU_SOURCE     -I. -I/srv/gump/public/workspace/apache-httpd/os/unix -I/srv/gump/public/workspace/apache-httpd/include
-I/srv/gump/public/workspace/apr/dest-20160517/include/apr-2 -I/srv/gump/public/workspace/pcre/dest-20160517/include
-I/srv/gump/public/workspace/apache-httpd/modules/aaa -I/srv/gump/public/workspace/apache-httpd/modules/cache
-I/srv/gump/public/workspace/apache-httpd/modules/core -I/srv/gump/public/workspace/apache-httpd/modules/database
-I/srv/gump/public/workspace/apache-httpd/modules/filters -I/srv/gump/public/workspace/apache-httpd/modules/ldap
-I/srv/gump/public/workspace/apache-httpd/modules/loggers -I/srv/gump/public/workspace/apache-httpd/modules/lua
-I/srv/gump/public/workspace/apache-httpd/modules/proxy -I/srv/gump/public/workspace/apache-httpd/mo
 dules/session -I/srv/gump/public/workspace/apache-httpd/modules/ssl -I/srv/gump/public/workspace/apache-httpd/modules/test
-I/srv/gump/public/workspace/apache-httpd/server -I/srv/gump/public/workspace/apache-httpd/modules/arch/unix
-I/srv/gump/public/workspace/apache-httpd/modules/dav/main -I/srv/gump/public/workspace/apache-httpd/modules/generators
-I/srv/gump/public/workspace/apache-httpd/modules/mappers -prefer-pic -c mod_ssl.c &&
touch mod_ssl.slo
mod_ssl.c: In function 'ssl_cleanup_pre_config':
mod_ssl.c:330:5: warning: 'ERR_remove_thread_state' is deprecated (declared at /srv/gump/public/workspace/openssl-master/dest-20160517/include/openssl/err.h:362)
[-Wdeprecated-declarations]
     ERR_remove_thread_state();
     ^
mod_ssl.c:330:5: error: too few arguments to function 'ERR_remove_thread_state'
In file included from /srv/gump/public/workspace/openssl-master/dest-20160517/include/openssl/ct.h:57:0,
                 from /srv/gump/public/workspace/openssl-master/dest-20160517/include/openssl/ssl.h:161,
                 from ssl_private.h:90,
                 from mod_ssl.c:27:
/srv/gump/public/workspace/openssl-master/dest-20160517/include/openssl/err.h:362:25: note:
declared here
 DEPRECATEDIN_1_1_0(void ERR_remove_thread_state(void *))
                         ^
/srv/gump/public/workspace/openssl-master/dest-20160517/include/openssl/opensslconf.h:96:35:
note: in definition of macro 'DECLARE_DEPRECATED'
 # define DECLARE_DEPRECATED(f)    f __attribute__ ((deprecated));
                                   ^
/srv/gump/public/workspace/openssl-master/dest-20160517/include/openssl/err.h:362:1: note:
in expansion of macro 'DEPRECATEDIN_1_1_0'
 DEPRECATEDIN_1_1_0(void ERR_remove_thread_state(void *))
 ^
make[4]: *** [mod_ssl.slo] Error 1
make[4]: Leaving directory `/srv/gump/public/workspace/apache-httpd/modules/ssl'
make[3]: *** [shared-build-recursive] Error 1
make[3]: Leaving directory `/srv/gump/public/workspace/apache-httpd/modules/ssl'
make[2]: *** [shared-build-recursive] Error 1
make[2]: Leaving directory `/srv/gump/public/workspace/apache-httpd/modules'
make[1]: *** [shared-build-recursive] Error 1
make[1]: Leaving directory `/srv/gump/public/workspace/apache-httpd'
make: *** [all-recursive] Error 1
---------------------------------------------

To subscribe to this information via syndicated feeds:
- RSS: http://vmgump.apache.org/gump/public/apache-httpd/apache-httpd-make/rss.xml
- Atom: http://vmgump.apache.org/gump/public/apache-httpd/apache-httpd-make/atom.xml

============================== Gump Tracking Only ===
Produced by Apache Gump(TM) version 2.3.
Gump Run 20160517000006, vmgump.apache.org:vmgump:20160517000006
Gump E-mail Identifier (unique within run) #1.

*********************************************************** G U M P
[GUMP@vmgump]: Project compress-antlib-test (in module antlibs-compress) failed
To whom it may engage...
        
This is an automated request, but not an unsolicited one. For 
more information please visit http://gump.apache.org/nagged.html, 
and/or contact the folk at general@gump.apache.org.

Project compress-antlib-test has an issue affecting its community integration.
This issue affects 1 projects,
 and has been outstanding for 50 runs.
The current state of this project is 'Failed', with reason 'Build Failed'.
For reference only, the following projects are affected by this:
    - compress-antlib-test :  The Apache Compress Antlib contains tasks and resources that...


Full details are available at:
    http://vmgump.apache.org/gump/public/antlibs-compress/compress-antlib-test/index.html

That said, some information snippets are provided here.

The following annotations (debug/informational/warning/error messages) were provided:
 -DEBUG- Dependency on ant exists, no need to add for property ant.home.
 -INFO- Failed with reason build failed



The following work was performed:
http://vmgump.apache.org/gump/public/antlibs-compress/compress-antlib-test/gump_work/build_antlibs-compress_compress-antlib-test.html
Work Name: build_antlibs-compress_compress-antlib-test (Type: Build)
Work ended in a state of : Failed
Elapsed: 6 mins 26 secs
Command Line: /usr/lib/jvm/java-8-oracle/bin/java -Djava.awt.headless=true -Dbuild.sysclasspath=only
-Xbootclasspath/p:/srv/gump/public/workspace/xml-xerces2/build/xercesImpl.jar:/srv/gump/public/workspace/xml-commons/java/external/build/xml-apis.jar
org.apache.tools.ant.Main -Dgump.merge=/srv/gump/public/gump/work/merge.xml -Dant.home=/srv/gump/public/workspace/ant/dist
test 
[Working Directory: /srv/gump/public/workspace/antlibs-compress]
CLASSPATH: /usr/lib/jvm/java-8-oracle/lib/tools.jar:/srv/gump/public/workspace/antlibs-compress/ivy/ivy.jar:/srv/gump/public/workspace/antlibs-compress/build/ant-compress-20160517.jar:/srv/gump/public/workspace/ant/dist/lib/ant.jar:/srv/gump/public/workspace/ant/dist/lib/ant-launcher.jar:/srv/gump/public/workspace/ant/dist/lib/ant-jmf.jar:/srv/gump/public/workspace/ant/dist/lib/ant-junit.jar:/srv/gump/public/workspace/ant/dist/lib/ant-junit4.jar:/srv/gump/public/workspace/ant/dist/lib/ant-swing.jar:/srv/gump/public/workspace/ant/dist/lib/ant-apache-resolver.jar:/srv/gump/public/workspace/ant/dist/lib/ant-apache-xalan2.jar:/srv/gump/public/workspace/commons-compress/target/commons-compress-1.12-SNAPSHOT.jar:/srv/gump/public/workspace/xz-java/build/jar-20160517/xz.jar:/srv/gump/public/workspace/antlibs-antunit/build/ant-antunit-20160517.jar:/srv/gump/public/workspace/xml-commons/java/external/build/xml-apis-ext.jar
---------------------------------------------
[au:antunit] Target: testWithDirectories took 0.06 sec
[au:antunit] Target: testFullpath took 0.061 sec
[au:antunit] Target: testPreserve0Permissions took 0.07 sec
[au:antunit] Target: testForceCreateOfUpToDate took 4.067 sec
[au:antunit] Target: testNoDirectoriesByDefault took 0.119 sec
[au:antunit] Target: testPlainFileSet took 0.04 sec
[au:antunit] Target: testReplaceOfUpToDate took 4.031 sec
[au:antunit] Target: testCoreZipFileSet  FAILED
[au:antunit] 	at line 35, column 24
[au:antunit] 	Message: Assertion failed
[au:antunit] 	took 0.23 sec
[au:antunit] Target: testAntlibTarFileSet took 0.038 sec
[au:antunit] Target: testCreateOfOutOfDate took 4.066 sec
[au:antunit] Target: testFileSetPermissionsWin took 0.106 sec
[au:antunit] Target: testAddDuplicates took 0.02 sec
[au:antunit] Target: testRemoveLeadingSlashes took 0.043 sec
[au:antunit] Target: testPrefixWithSlash took 0.06 sec
[au:antunit] Target: testWithImplicitDirectories took 0.061 sec
[au:antunit] Target: testForceReplaceOfUpToDate took 4.064 sec
[au:antunit] Target: test0PermissionsGetReplaced took 0.053 sec
[au:antunit] Target: testFailDuplicates took 0.019 sec
[au:antunit] Build File: /srv/gump/public/workspace/antlibs-compress/src/tests/antunit/zipentry-test.xml
[au:antunit] Tests run: 3, Failures: 1, Errors: 0, Time elapsed: 0.116 sec
[au:antunit] Target: testResourceProperties  FAILED
[au:antunit] 	at line 59, column 20
[au:antunit] 	Message: Assertion failed
[au:antunit] 	took 0.048 sec
[au:antunit] Target: testUncompressSource took 0.025 sec
[au:antunit] Target: testZipSource took 0.031 sec
[au:antunit] Build File: /srv/gump/public/workspace/antlibs-compress/src/tests/antunit/zipfileset-test.xml
[au:antunit] Tests run: 9, Failures: 0, Errors: 0, Time elapsed: 0.193 sec
[au:antunit] Target: testSkipUnreadableEntries took 0.024 sec
[au:antunit] Target: testMissingArchive took 0.016 sec
[au:antunit] Target: testUncompressSource took 0.024 sec
[au:antunit] Target: test-refid-check-encoding took 0.007 sec
[au:antunit] Target: testZipSource took 0.011 sec
[au:antunit] Target: test-refid-modify took 0.058 sec
[au:antunit] Target: test-refid-check-prefix took 0.004 sec
[au:antunit] Target: testMissingArchiveDoesntMatter took 0.008 sec
[au:antunit] Target: testFailsOnUnreadableEntries took 0.011 sec
[au:antunit] Build File: /srv/gump/public/workspace/antlibs-compress/src/tests/antunit/zresource-test.xml
[au:antunit] Tests run: 1, Failures: 0, Errors: 0, Time elapsed: 0.018 sec
[au:antunit] Target: testNativeZ took 0.015 sec

test:

BUILD FAILED
/srv/gump/public/workspace/antlibs-compress/common/build.xml:209: At least one AntUnit test
has failed.

Total time: 6 minutes 26 seconds
---------------------------------------------

To subscribe to this information via syndicated feeds:
- RSS: http://vmgump.apache.org/gump/public/antlibs-compress/compress-antlib-test/rss.xml
- Atom: http://vmgump.apache.org/gump/public/antlibs-compress/compress-antlib-test/atom.xml

============================== Gump Tracking Only ===
Produced by Apache Gump(TM) version 2.3.
Gump Run 20160517000006, vmgump.apache.org:vmgump:20160517000006
Gump E-mail Identifier (unique within run) #2.


--
Apache Gump
http://gump.apache.org/ [Instance: vmgump]

---------------------------------------------------------------------
To unsubscribe, e-mail: general-unsubscribe@gump.apache.org
For additional commands, e-mail: general-help@gump.apache.org


Mime
View raw message