gump-general mailing list archives

Site index · List index
Message view « Date » · « Thread »
Top « Date » · « Thread »
From g...@vmgump.apache.org
Subject BATCH: All dressed up, with nowhere to go...
Date Sat, 30 Apr 2016 10:07:06 GMT
Dear Gumpmeisters,
            
The following 2 notifys should have been sent

*********************************************************** G U M P
[GUMP@vmgump]: Project compress-antlib-test (in module antlibs-compress) failed
[GUMP@vmgump]: Project test-ant (in module ant) failed
*********************************************************** G U M P
[GUMP@vmgump]: Project compress-antlib-test (in module antlibs-compress) failed
To whom it may engage...
        
This is an automated request, but not an unsolicited one. For 
more information please visit http://gump.apache.org/nagged.html, 
and/or contact the folk at general@gump.apache.org.

Project compress-antlib-test has an issue affecting its community integration.
This issue affects 1 projects,
 and has been outstanding for 16 runs.
The current state of this project is 'Failed', with reason 'Build Failed'.
For reference only, the following projects are affected by this:
    - compress-antlib-test :  The Apache Compress Antlib contains tasks and resources that...


Full details are available at:
    http://vmgump.apache.org/gump/public/antlibs-compress/compress-antlib-test/index.html

That said, some information snippets are provided here.

The following annotations (debug/informational/warning/error messages) were provided:
 -DEBUG- Dependency on ant exists, no need to add for property ant.home.
 -INFO- Failed with reason build failed



The following work was performed:
http://vmgump.apache.org/gump/public/antlibs-compress/compress-antlib-test/gump_work/build_antlibs-compress_compress-antlib-test.html
Work Name: build_antlibs-compress_compress-antlib-test (Type: Build)
Work ended in a state of : Failed
Elapsed: 4 mins 51 secs
Command Line: /usr/lib/jvm/java-8-oracle/bin/java -Djava.awt.headless=true -Dbuild.sysclasspath=only
-Xbootclasspath/p:/srv/gump/public/workspace/xml-xerces2/build/xercesImpl.jar:/srv/gump/public/workspace/xml-commons/java/external/build/xml-apis.jar
org.apache.tools.ant.Main -Dgump.merge=/srv/gump/public/gump/work/merge.xml -Dant.home=/srv/gump/public/workspace/ant/dist
test 
[Working Directory: /srv/gump/public/workspace/antlibs-compress]
CLASSPATH: /usr/lib/jvm/java-8-oracle/lib/tools.jar:/srv/gump/public/workspace/antlibs-compress/ivy/ivy.jar:/srv/gump/public/workspace/antlibs-compress/build/ant-compress-20160430.jar:/srv/gump/public/workspace/ant/dist/lib/ant.jar:/srv/gump/public/workspace/ant/dist/lib/ant-launcher.jar:/srv/gump/public/workspace/ant/dist/lib/ant-jmf.jar:/srv/gump/public/workspace/ant/dist/lib/ant-junit.jar:/srv/gump/public/workspace/ant/dist/lib/ant-junit4.jar:/srv/gump/public/workspace/ant/dist/lib/ant-swing.jar:/srv/gump/public/workspace/ant/dist/lib/ant-apache-resolver.jar:/srv/gump/public/workspace/ant/dist/lib/ant-apache-xalan2.jar:/srv/gump/public/workspace/commons-compress/target/commons-compress-1.12-SNAPSHOT.jar:/srv/gump/public/workspace/xz-java/build/jar-20160430/xz.jar:/srv/gump/public/workspace/antlibs-antunit/build/ant-antunit-20160430.jar:/srv/gump/public/workspace/xml-commons/java/external/build/xml-apis-ext.jar
---------------------------------------------
[au:antunit] Target: testWithDirectories took 0.025 sec
[au:antunit] Target: testFullpath took 0.03 sec
[au:antunit] Target: testPreserve0Permissions took 0.02 sec
[au:antunit] Target: testForceCreateOfUpToDate took 4.126 sec
[au:antunit] Target: testNoDirectoriesByDefault took 0.046 sec
[au:antunit] Target: testPlainFileSet took 0.018 sec
[au:antunit] Target: testReplaceOfUpToDate took 4.017 sec
[au:antunit] Target: testCoreZipFileSet  FAILED
[au:antunit] 	at line 35, column 24
[au:antunit] 	Message: Assertion failed
[au:antunit] 	took 0.02 sec
[au:antunit] Target: testAntlibTarFileSet took 0.011 sec
[au:antunit] Target: testCreateOfOutOfDate took 4.041 sec
[au:antunit] Target: testFileSetPermissionsWin took 0.011 sec
[au:antunit] Target: testAddDuplicates took 0.012 sec
[au:antunit] Target: testRemoveLeadingSlashes took 0.013 sec
[au:antunit] Target: testPrefixWithSlash took 0.017 sec
[au:antunit] Target: testWithImplicitDirectories took 0.013 sec
[au:antunit] Target: testForceReplaceOfUpToDate took 4.034 sec
[au:antunit] Target: test0PermissionsGetReplaced took 0.025 sec
[au:antunit] Target: testFailDuplicates took 0.007 sec
[au:antunit] Build File: /srv/gump/public/workspace/antlibs-compress/src/tests/antunit/zipentry-test.xml
[au:antunit] Tests run: 3, Failures: 1, Errors: 0, Time elapsed: 0.047 sec
[au:antunit] Target: testResourceProperties  FAILED
[au:antunit] 	at line 59, column 20
[au:antunit] 	Message: Assertion failed
[au:antunit] 	took 0.02 sec
[au:antunit] Target: testUncompressSource took 0.006 sec
[au:antunit] Target: testZipSource took 0.004 sec
[au:antunit] Build File: /srv/gump/public/workspace/antlibs-compress/src/tests/antunit/zipfileset-test.xml
[au:antunit] Tests run: 9, Failures: 0, Errors: 0, Time elapsed: 0.335 sec
[au:antunit] Target: testSkipUnreadableEntries took 0.02 sec
[au:antunit] Target: testMissingArchive took 0.002 sec
[au:antunit] Target: testUncompressSource took 0.009 sec
[au:antunit] Target: test-refid-check-encoding took 0.006 sec
[au:antunit] Target: testZipSource took 0.007 sec
[au:antunit] Target: test-refid-modify took 0.253 sec
[au:antunit] Target: test-refid-check-prefix took 0.003 sec
[au:antunit] Target: testMissingArchiveDoesntMatter took 0.002 sec
[au:antunit] Target: testFailsOnUnreadableEntries took 0.007 sec
[au:antunit] Build File: /srv/gump/public/workspace/antlibs-compress/src/tests/antunit/zresource-test.xml
[au:antunit] Tests run: 1, Failures: 0, Errors: 0, Time elapsed: 0.016 sec
[au:antunit] Target: testNativeZ took 0.01 sec

test:

BUILD FAILED
/srv/gump/public/workspace/antlibs-compress/common/build.xml:209: At least one AntUnit test
has failed.

Total time: 4 minutes 50 seconds
---------------------------------------------

To subscribe to this information via syndicated feeds:
- RSS: http://vmgump.apache.org/gump/public/antlibs-compress/compress-antlib-test/rss.xml
- Atom: http://vmgump.apache.org/gump/public/antlibs-compress/compress-antlib-test/atom.xml

============================== Gump Tracking Only ===
Produced by Apache Gump(TM) version 2.3.
Gump Run 20160430000005, vmgump.apache.org:vmgump:20160430000005
Gump E-mail Identifier (unique within run) #1.

*********************************************************** G U M P
[GUMP@vmgump]: Project test-ant (in module ant) failed
To whom it may engage...
        
This is an automated request, but not an unsolicited one. For 
more information please visit http://gump.apache.org/nagged.html, 
and/or contact the folk at general@gump.apache.org.

Project test-ant has an issue affecting its community integration.
This issue affects 1 projects.
The current state of this project is 'Failed', with reason 'Build Failed'.
For reference only, the following projects are affected by this:
    - test-ant :  Java based build tool


Full details are available at:
    http://vmgump.apache.org/gump/public/ant/test-ant/index.html

That said, some information snippets are provided here.

The following annotations (debug/informational/warning/error messages) were provided:
 -WARNING- Bad *Optional* Dependency. Project: bsh : unknown to *this* workspace
 -INFO- Failed with reason build failed



The following work was performed:
http://vmgump.apache.org/gump/public/ant/test-ant/gump_work/build_ant_test-ant.html
Work Name: build_ant_test-ant (Type: Build)
Work ended in a state of : Failed
Elapsed: 14 mins 16 secs
Command Line: /usr/lib/jvm/java-8-oracle/bin/java -Djava.awt.headless=true -Dbuild.sysclasspath=only
-Xbootclasspath/p:/srv/gump/public/workspace/xml-xerces2/build/xercesImpl.jar:/srv/gump/public/workspace/xml-commons/java/external/build/xml-apis.jar:/srv/gump/public/workspace/xml-xalan/build/xalan-unbundled.jar:/srv/gump/public/workspace/xml-xalan/build/serializer.jar
org.apache.tools.ant.Main -Dgump.merge=/srv/gump/public/gump/work/merge.xml -Dtest.haltonfailure=false
-Dant.home=/srv/gump/public/workspace/ant/dist run-tests 
[Working Directory: /srv/gump/public/workspace/ant]
CLASSPATH: /usr/lib/jvm/java-8-oracle/lib/tools.jar:/srv/gump/public/workspace/ant/build/testcases:/srv/gump/public/workspace/ant/src/tests/junit:/srv/gump/public/workspace/ant/src/etc/testcases:/srv/gump/public/workspace/ant/src/etc/testcases/taskdefs/optional/out:/srv/gump/public/workspace/ant/src/tests/antunit/filters:/srv/gump/public/workspace/ant/src/tests/antunit/taskdefs/importtests:/srv/gump/public/workspace/ant/src/tests/antunit/filters/foo:/srv/gump/public/workspace/ant/src/tests/antunit/taskdefs/foo:/srv/gump/public/workspace/ant/build/antunit/tmp/testinput/build:/srv/gump/public/workspace/ant/build/antunit/tmp/testoutput:/srv/gump/public/workspace/ant/build/antunit/tmp/test.jar:/srv/gump/public/workspace/ant/build/antunit/tmp/test1.jar:/srv/gump/public/workspace/ant/build/antunit/tmp/test2.jar:/srv/gump/public/workspace/ant/build/antunit/tmp/test3.jar:/srv/gump/public/workspace/ant/build/antunit/tmp/test4.jar:/srv/gump/public/workspace/ant/build/antunit/tmp/test5.jar:/srv
 /gump/public/workspace/ant/build/antunit/tmp/resources:/srv/gump/public/workspace/ant/build/lib/ant.jar:/srv/gump/public/workspace/ant/build/lib/ant-launcher.jar:/srv/gump/public/workspace/ant/build/lib/ant-antlr.jar:/srv/gump/public/workspace/ant/build/lib/ant-apache-bcel.jar:/srv/gump/public/workspace/ant/build/lib/ant-apache-bsf.jar:/srv/gump/public/workspace/ant/build/lib/ant-apache-log4j.jar:/srv/gump/public/workspace/ant/build/lib/ant-apache-oro.jar:/srv/gump/public/workspace/ant/build/lib/ant-apache-regexp.jar:/srv/gump/public/workspace/ant/build/lib/ant-apache-resolver.jar:/srv/gump/public/workspace/ant/build/lib/ant-apache-xalan2.jar:/srv/gump/public/workspace/ant/build/lib/ant-commons-logging.jar:/srv/gump/public/workspace/ant/build/lib/ant-commons-net.jar:/srv/gump/public/workspace/ant/build/lib/ant-jai.jar:/srv/gump/public/workspace/ant/build/lib/ant-javamail.jar:/srv/gump/public/workspace/ant/build/lib/ant-jdepend.jar:/srv/gump/public/workspace/ant/build/lib/ant-jmf.jar
 :/srv/gump/public/workspace/ant/build/lib/ant-jsch.jar:/srv/gump/public/workspace/ant/build/lib/ant-junit.jar:/srv/gump/public/workspace/ant/build/lib/ant-junit4.jar:/srv/gump/public/workspace/ant/build/lib/ant-swing.jar:/srv/gump/packages/antlr/antlr-3.1.3.jar:/srv/gump/public/workspace/ant-contrib/lib/bcel/jars/bcel-5.1.jar:/srv/gump/public/workspace/apache-commons/logging/target/commons-logging-20160430.jar:/srv/gump/public/workspace/apache-commons/logging/target/commons-logging-api-20160430.jar:/srv/gump/public/workspace/apache-commons/net/target/commons-net-3.5-SNAPSHOT.jar:/srv/gump/public/workspace/apache-commons/net/target/commons-net-ftp-3.5-SNAPSHOT.jar:/srv/gump/packages/jaf-1.1ea/activation.jar:/srv/gump/public/workspace/jakarta-bsf/build/lib/bsf.jar:/srv/gump/packages/apache-attic/jakarta-regexp-1.5.jar:/srv/gump/public/workspace/jakarta-servletapi-5/jsr154/dist/lib/servlet-api.jar:/srv/gump/packages/javamail-1.4/mail.jar:/srv/gump/packages/javamail-1.4/lib/mailapi.jar:
 /srv/gump/packages/jdepend-2.6/lib/jdepend.jar:/srv/gump/packages/jsch/jsch-0.1.45.jar:/srv/gump/public/workspace/logging-log4j-12/target/log4j-1.2.18-SNAPSHOT.jar:/srv/gump/packages/apache-attic/oro-2.0.8.jar:/srv/gump/public/workspace/antlibs-antunit/build/ant-antunit-20160430.jar:/srv/gump/packages/hamcrest/hamcrest-core-1.3.jar:/srv/gump/public/workspace/junit/target/junit-4.13-SNAPSHOT.jar:/srv/gump/public/workspace/xml-commons/java/external/build/xml-apis-ext.jar:/srv/gump/public/workspace/commons-codec-1.x/dist/commons-codec-20160430.jar
---------------------------------------------
[au:antunit] Build File: /srv/gump/public/workspace/ant/src/tests/antunit/types/selectors/modified-test.xml
[au:antunit] Tests run: 1, Failures: 0, Errors: 0, Time elapsed: 0.023 sec
[au:antunit] Target: testUpdate took 0.019 sec
[au:antunit] Build File: /srv/gump/public/workspace/ant/src/tests/antunit/types/selectors/ownedby-test.xml
[au:antunit] Tests run: 3, Failures: 0, Errors: 0, Time elapsed: 0.26 sec
[au:antunit] Target: testOwnedBy took 0.013 sec
[au:antunit] Target: testAsTrueConditions took 0.209 sec
[au:antunit] Target: testRequiresOwner took 0.001 sec
[au:antunit] Build File: /srv/gump/public/workspace/ant/src/tests/antunit/types/selectors/present-test.xml
[au:antunit] Tests run: 1, Failures: 0, Errors: 0, Time elapsed: 0.004 sec
[au:antunit] Target: testMapperByTypedef took 0.001 sec
[au:antunit] Build File: /srv/gump/public/workspace/ant/src/tests/antunit/types/selectors/readwrite-test.xml
[au:antunit] Tests run: 4, Failures: 0, Errors: 0, Time elapsed: 0.169 sec
[au:antunit] Target: testWritable took 0.006 sec
[au:antunit] Target: testAsConditions took 0.005 sec
[au:antunit] Target: testReadable took 0.001 sec
[au:antunit] Target: testUnwritable took 0 sec
[au:antunit] Build File: /srv/gump/public/workspace/ant/src/tests/antunit/types/selectors/select-test.xml
[au:antunit] Tests run: 4, Failures: 0, Errors: 0, Time elapsed: 0.158 sec
[au:antunit] Target: testIfFalse took 0.08 sec
[au:antunit] Target: testIfNotSet took 0.006 sec
[au:antunit] Target: testIfTrue took 0.008 sec
[au:antunit] Target: testIfSet took 0.002 sec
[au:antunit] Build File: /srv/gump/public/workspace/ant/src/tests/antunit/types/selectors/symlink-test.xml
[au:antunit] Tests run: 4, Failures: 0, Errors: 0, Time elapsed: 0.152 sec
[au:antunit] Target: testAsFalseConditions took 0.005 sec
[au:antunit] Target: testAsTrueConditions took 0.117 sec
[au:antunit] Target: testNoSymlink took 0.001 sec
[au:antunit] Target: testSymlink took 0.014 sec
[au:antunit] Build File: /srv/gump/public/workspace/ant/src/tests/antunit/types/tarfileset-test.xml
[au:antunit] Tests run: 3, Failures: 0, Errors: 0, Time elapsed: 0.015 sec
[au:antunit] Target: test-refid-check-encoding took 0.001 sec
[au:antunit] Target: testMissingArchive took 0.001 sec
[au:antunit] Target: testMissingArchiveDoesntMatter took 0.004 sec
[au:antunit] Build File: /srv/gump/public/workspace/ant/src/tests/antunit/types/zipfileset-test.xml
[au:antunit] Tests run: 5, Failures: 0, Errors: 0, Time elapsed: 0.139 sec
[au:antunit] Target: testMissingArchive took 0.001 sec
[au:antunit] Target: test-refid-check-encoding took 0 sec
[au:antunit] Target: test-refid-modify took 0.12 sec
[au:antunit] Target: test-refid-check-prefix took 0.001 sec
[au:antunit] Target: testMissingArchiveDoesntMatter took 0.001 sec

check-failed:

run-tests:

BUILD FAILED
/srv/gump/public/workspace/ant/build.xml:1601: Unit tests failed

Total time: 14 minutes 15 seconds
---------------------------------------------

To subscribe to this information via syndicated feeds:
- RSS: http://vmgump.apache.org/gump/public/ant/test-ant/rss.xml
- Atom: http://vmgump.apache.org/gump/public/ant/test-ant/atom.xml

============================== Gump Tracking Only ===
Produced by Apache Gump(TM) version 2.3.
Gump Run 20160430000005, vmgump.apache.org:vmgump:20160430000005
Gump E-mail Identifier (unique within run) #3.


--
Apache Gump
http://gump.apache.org/ [Instance: vmgump]

---------------------------------------------------------------------
To unsubscribe, e-mail: general-unsubscribe@gump.apache.org
For additional commands, e-mail: general-help@gump.apache.org


Mime
View raw message