gump-general mailing list archives

Site index · List index
Message view « Date » · « Thread »
Top « Date » · « Thread »
From g...@vmgump.apache.org
Subject BATCH: All dressed up, with nowhere to go...
Date Thu, 21 Apr 2016 02:53:06 GMT
Dear Gumpmeisters,
            
The following 4 notifys should have been sent

*********************************************************** G U M P
[GUMP@vmgump]: Project apache-httpd-make (in module apache-httpd) failed
[GUMP@vmgump]: Project commons-compress (in module commons-compress) failed
[GUMP@vmgump]: Project test-ant (in module ant) failed
[GUMP@vmgump]: Project easymock (in module easymock) failed
*********************************************************** G U M P
[GUMP@vmgump]: Project apache-httpd-make (in module apache-httpd) failed
To whom it may engage...
        
This is an automated request, but not an unsolicited one. For 
more information please visit http://gump.apache.org/nagged.html, 
and/or contact the folk at general@gump.apache.org.

Project apache-httpd-make has an issue affecting its community integration.
This issue affects 5 projects,
 and has been outstanding for 27 runs.
The current state of this project is 'Failed', with reason 'Build Failed'.
For reference only, the following projects are affected by this:
    - apache-httpd-make :  Apache HTTP Server
    - apache-httpd-make-install :  Apache HTTP Server
    - tomcat-jk-native :  Connectors to various web servers
    - tomcat-jk-native-buildconf :  Connectors to various web servers
    - tomcat-jk-native-configure :  Connectors to various web servers


Full details are available at:
    http://vmgump.apache.org/gump/public/apache-httpd/apache-httpd-make/index.html

That said, some information snippets are provided here.

The following annotations (debug/informational/warning/error messages) were provided:
 -INFO- Failed with reason build failed



The following work was performed:
http://vmgump.apache.org/gump/public/apache-httpd/apache-httpd-make/gump_work/build_apache-httpd_apache-httpd-make.html
Work Name: build_apache-httpd_apache-httpd-make (Type: Build)
Work ended in a state of : Failed
Elapsed: 1 min 10 secs
Command Line: make 
[Working Directory: /srv/gump/public/workspace/apache-httpd]
---------------------------------------------
Making all in dav/fs
make[2]: Entering directory `/srv/gump/public/workspace/apache-httpd/modules/dav/fs'
make[2]: Leaving directory `/srv/gump/public/workspace/apache-httpd/modules/dav/fs'
Making all in mappers
make[2]: Entering directory `/srv/gump/public/workspace/apache-httpd/modules/mappers'
make[2]: Leaving directory `/srv/gump/public/workspace/apache-httpd/modules/mappers'
make[1]: Leaving directory `/srv/gump/public/workspace/apache-httpd/modules'
Making all in support
make[1]: Entering directory `/srv/gump/public/workspace/apache-httpd/support'
make[2]: Entering directory `/srv/gump/public/workspace/apache-httpd/support'
/srv/gump/public/workspace/apr/dest-20160421/build-2/libtool --silent --mode=compile gcc -std=gnu99
 -g -O2 -pthread      -DLINUX -D_REENTRANT -D_GNU_SOURCE     -I. -I/srv/gump/public/workspace/apache-httpd/os/unix
-I/srv/gump/public/workspace/apache-httpd/include -I/srv/gump/public/workspace/apr/dest-20160421/include/apr-2
-I/srv/gump/public/workspace/pcre/dest-20160421/include -I/srv/gump/public/workspace/apache-httpd/modules/aaa
-I/srv/gump/public/workspace/apache-httpd/modules/cache -I/srv/gump/public/workspace/apache-httpd/modules/core
-I/srv/gump/public/workspace/apache-httpd/modules/database -I/srv/gump/public/workspace/apache-httpd/modules/filters
-I/srv/gump/public/workspace/apache-httpd/modules/ldap -I/srv/gump/public/workspace/apache-httpd/modules/loggers
-I/srv/gump/public/workspace/apache-httpd/modules/lua -I/srv/gump/public/workspace/apache-httpd/modules/proxy
-I/srv/gump/public/workspace/apache-httpd/modules/session -I/srv/gump/public/workspace/apache-httpd/modules/ssl
  -I/srv/gump/public/workspace/apache-httpd/modules/test -I/srv/gump/public/workspace/apache-httpd/server
-I/srv/gump/public/workspace/apache-httpd/modules/arch/unix -I/srv/gump/public/workspace/apache-httpd/modules/dav/main
-I/srv/gump/public/workspace/apache-httpd/modules/generators -I/srv/gump/public/workspace/apache-httpd/modules/mappers
 -prefer-non-pic -static -c htpasswd.c && touch htpasswd.lo
/srv/gump/public/workspace/apr/dest-20160421/build-2/libtool --silent --mode=compile gcc -std=gnu99
 -g -O2 -pthread      -DLINUX -D_REENTRANT -D_GNU_SOURCE     -I. -I/srv/gump/public/workspace/apache-httpd/os/unix
-I/srv/gump/public/workspace/apache-httpd/include -I/srv/gump/public/workspace/apr/dest-20160421/include/apr-2
-I/srv/gump/public/workspace/pcre/dest-20160421/include -I/srv/gump/public/workspace/apache-httpd/modules/aaa
-I/srv/gump/public/workspace/apache-httpd/modules/cache -I/srv/gump/public/workspace/apache-httpd/modules/core
-I/srv/gump/public/workspace/apache-httpd/modules/database -I/srv/gump/public/workspace/apache-httpd/modules/filters
-I/srv/gump/public/workspace/apache-httpd/modules/ldap -I/srv/gump/public/workspace/apache-httpd/modules/loggers
-I/srv/gump/public/workspace/apache-httpd/modules/lua -I/srv/gump/public/workspace/apache-httpd/modules/proxy
-I/srv/gump/public/workspace/apache-httpd/modules/session -I/srv/gump/public/workspace/apache-httpd/modules/ssl
  -I/srv/gump/public/workspace/apache-httpd/modules/test -I/srv/gump/public/workspace/apache-httpd/server
-I/srv/gump/public/workspace/apache-httpd/modules/arch/unix -I/srv/gump/public/workspace/apache-httpd/modules/dav/main
-I/srv/gump/public/workspace/apache-httpd/modules/generators -I/srv/gump/public/workspace/apache-httpd/modules/mappers
 -prefer-non-pic -static -c passwd_common.c && touch passwd_common.lo
/srv/gump/public/workspace/apr/dest-20160421/build-2/libtool --silent --mode=link gcc -std=gnu99
 -g -O2 -pthread         -o htpasswd  htpasswd.lo passwd_common.lo       /srv/gump/public/workspace/apr/dest-20160421/lib/libapr-2.la
-lcrypt -lrt -lcrypt -lpthread -ldl -lexpat -lcrypt
/srv/gump/public/workspace/apr/dest-20160421/build-2/libtool --silent --mode=compile gcc -std=gnu99
 -g -O2 -pthread      -DLINUX -D_REENTRANT -D_GNU_SOURCE     -I. -I/srv/gump/public/workspace/apache-httpd/os/unix
-I/srv/gump/public/workspace/apache-httpd/include -I/srv/gump/public/workspace/apr/dest-20160421/include/apr-2
-I/srv/gump/public/workspace/pcre/dest-20160421/include -I/srv/gump/public/workspace/apache-httpd/modules/aaa
-I/srv/gump/public/workspace/apache-httpd/modules/cache -I/srv/gump/public/workspace/apache-httpd/modules/core
-I/srv/gump/public/workspace/apache-httpd/modules/database -I/srv/gump/public/workspace/apache-httpd/modules/filters
-I/srv/gump/public/workspace/apache-httpd/modules/ldap -I/srv/gump/public/workspace/apache-httpd/modules/loggers
-I/srv/gump/public/workspace/apache-httpd/modules/lua -I/srv/gump/public/workspace/apache-httpd/modules/proxy
-I/srv/gump/public/workspace/apache-httpd/modules/session -I/srv/gump/public/workspace/apache-httpd/modules/ssl
  -I/srv/gump/public/workspace/apache-httpd/modules/test -I/srv/gump/public/workspace/apache-httpd/server
-I/srv/gump/public/workspace/apache-httpd/modules/arch/unix -I/srv/gump/public/workspace/apache-httpd/modules/dav/main
-I/srv/gump/public/workspace/apache-httpd/modules/generators -I/srv/gump/public/workspace/apache-httpd/modules/mappers
 -prefer-non-pic -static -c htdigest.c && touch htdigest.lo
/srv/gump/public/workspace/apr/dest-20160421/build-2/libtool --silent --mode=link gcc -std=gnu99
 -g -O2 -pthread         -o htdigest  htdigest.lo       /srv/gump/public/workspace/apr/dest-20160421/lib/libapr-2.la
-lcrypt -lrt -lcrypt -lpthread -ldl -lexpat
/srv/gump/public/workspace/apr/dest-20160421/build-2/libtool --silent --mode=compile gcc -std=gnu99
 -g -O2 -pthread      -DLINUX -D_REENTRANT -D_GNU_SOURCE     -I. -I/srv/gump/public/workspace/apache-httpd/os/unix
-I/srv/gump/public/workspace/apache-httpd/include -I/srv/gump/public/workspace/apr/dest-20160421/include/apr-2
-I/srv/gump/public/workspace/pcre/dest-20160421/include -I/srv/gump/public/workspace/apache-httpd/modules/aaa
-I/srv/gump/public/workspace/apache-httpd/modules/cache -I/srv/gump/public/workspace/apache-httpd/modules/core
-I/srv/gump/public/workspace/apache-httpd/modules/database -I/srv/gump/public/workspace/apache-httpd/modules/filters
-I/srv/gump/public/workspace/apache-httpd/modules/ldap -I/srv/gump/public/workspace/apache-httpd/modules/loggers
-I/srv/gump/public/workspace/apache-httpd/modules/lua -I/srv/gump/public/workspace/apache-httpd/modules/proxy
-I/srv/gump/public/workspace/apache-httpd/modules/session -I/srv/gump/public/workspace/apache-httpd/modules/ssl
  -I/srv/gump/public/workspace/apache-httpd/modules/test -I/srv/gump/public/workspace/apache-httpd/server
-I/srv/gump/public/workspace/apache-httpd/modules/arch/unix -I/srv/gump/public/workspace/apache-httpd/modules/dav/main
-I/srv/gump/public/workspace/apache-httpd/modules/generators -I/srv/gump/public/workspace/apache-httpd/modules/mappers
 -prefer-non-pic -static -c htdbm.c && touch htdbm.lo
/srv/gump/public/workspace/apr/dest-20160421/build-2/libtool --silent --mode=link gcc -std=gnu99
 -g -O2 -pthread         -o htdbm  htdbm.lo passwd_common.lo       /srv/gump/public/workspace/apr/dest-20160421/lib/libapr-2.la
-lcrypt -lrt -lcrypt -lpthread -ldl -lexpat -lcrypt
/srv/gump/public/workspace/apr/dest-20160421/build-2/libtool --silent --mode=compile gcc -std=gnu99
 -g -O2 -pthread      -DLINUX -D_REENTRANT -D_GNU_SOURCE     -I. -I/srv/gump/public/workspace/apache-httpd/os/unix
-I/srv/gump/public/workspace/apache-httpd/include -I/srv/gump/public/workspace/apr/dest-20160421/include/apr-2
-I/srv/gump/public/workspace/pcre/dest-20160421/include -I/srv/gump/public/workspace/apache-httpd/modules/aaa
-I/srv/gump/public/workspace/apache-httpd/modules/cache -I/srv/gump/public/workspace/apache-httpd/modules/core
-I/srv/gump/public/workspace/apache-httpd/modules/database -I/srv/gump/public/workspace/apache-httpd/modules/filters
-I/srv/gump/public/workspace/apache-httpd/modules/ldap -I/srv/gump/public/workspace/apache-httpd/modules/loggers
-I/srv/gump/public/workspace/apache-httpd/modules/lua -I/srv/gump/public/workspace/apache-httpd/modules/proxy
-I/srv/gump/public/workspace/apache-httpd/modules/session -I/srv/gump/public/workspace/apache-httpd/modules/ssl
  -I/srv/gump/public/workspace/apache-httpd/modules/test -I/srv/gump/public/workspace/apache-httpd/server
-I/srv/gump/public/workspace/apache-httpd/modules/arch/unix -I/srv/gump/public/workspace/apache-httpd/modules/dav/main
-I/srv/gump/public/workspace/apache-httpd/modules/generators -I/srv/gump/public/workspace/apache-httpd/modules/mappers
 -prefer-non-pic -static -c firehose.c && touch firehose.lo
/srv/gump/public/workspace/apr/dest-20160421/build-2/libtool --silent --mode=link gcc -std=gnu99
 -g -O2 -pthread         -o firehose  firehose.lo       /srv/gump/public/workspace/apr/dest-20160421/lib/libapr-2.la
-lcrypt -lrt -lcrypt -lpthread -ldl -lexpat
/srv/gump/public/workspace/apr/dest-20160421/build-2/libtool --silent --mode=compile gcc -std=gnu99
-I/srv/gump/public/workspace/openssl-master/dest-20160421/include  -g -O2 -pthread      -DLINUX
-D_REENTRANT -D_GNU_SOURCE   \
	      -I. -I/srv/gump/public/workspace/apache-httpd/os/unix -I/srv/gump/public/workspace/apache-httpd/include
-I/srv/gump/public/workspace/apr/dest-20160421/include/apr-2 -I/srv/gump/public/workspace/pcre/dest-20160421/include
-I/srv/gump/public/workspace/apache-httpd/modules/aaa -I/srv/gump/public/workspace/apache-httpd/modules/cache
-I/srv/gump/public/workspace/apache-httpd/modules/core -I/srv/gump/public/workspace/apache-httpd/modules/database
-I/srv/gump/public/workspace/apache-httpd/modules/filters -I/srv/gump/public/workspace/apache-httpd/modules/ldap
-I/srv/gump/public/workspace/apache-httpd/modules/loggers -I/srv/gump/public/workspace/apache-httpd/modules/lua
-I/srv/gump/public/workspace/apache-httpd/modules/proxy -I/srv/gump/public/workspace/apache-httpd/modules/session
-I/srv/gump/public/workspace/apache-httpd/modules/ssl -I/srv/gump/public/workspace/apache-httpd/modules/test
-I/srv/gump/public/workspace/apache-httpd/server -I/srv/gump/public/workspace/apache-httpd/modules
 /arch/unix -I/srv/gump/public/workspace/apache-httpd/modules/dav/main -I/srv/gump/public/workspace/apache-httpd/modules/generators
-I/srv/gump/public/workspace/apache-httpd/modules/mappers  -prefer-non-pic -static -c ab.c
&& touch ab.lo
ab.c: In function 'main':
ab.c:2447:17: warning: implicit declaration of function 'TLS_client_method' [-Wimplicit-function-declaration]
                 meth = TLS_client_method();
                 ^
ab.c:2447:22: warning: assignment makes pointer from integer without a cast [enabled by default]
                 meth = TLS_client_method();
                      ^
ab.c:2518:5: warning: implicit declaration of function 'OPENSSL_malloc_init' [-Wimplicit-function-declaration]
     OPENSSL_malloc_init();
     ^
ab.c:2533:5: warning: implicit declaration of function 'SSL_CTX_set_max_proto_version' [-Wimplicit-function-declaration]
     SSL_CTX_set_max_proto_version(ssl_ctx, max_prot);
     ^
ab.c:2534:5: warning: implicit declaration of function 'SSL_CTX_set_min_proto_version' [-Wimplicit-function-declaration]
     SSL_CTX_set_min_proto_version(ssl_ctx, min_prot);
     ^
/srv/gump/public/workspace/apr/dest-20160421/build-2/libtool --silent --mode=link gcc -std=gnu99
 -g -O2 -pthread   -L/srv/gump/public/workspace/openssl-master/dest-20160421/lib -lssl -lcrypto
-lcrypt -lrt -lpthread -ldl -lexpat  \
	         -o ab  ab.lo       /srv/gump/public/workspace/apr/dest-20160421/lib/libapr-2.la
-lcrypt -lrt -lcrypt -lpthread -ldl -lexpat -lm
ab.o: In function `main':
/srv/gump/public/workspace/apache-httpd/support/ab.c:2447: undefined reference to `TLS_client_method'
/srv/gump/public/workspace/apache-httpd/support/ab.c:2518: undefined reference to `OPENSSL_malloc_init'
/srv/gump/public/workspace/apache-httpd/support/ab.c:2533: undefined reference to `SSL_CTX_set_max_proto_version'
/srv/gump/public/workspace/apache-httpd/support/ab.c:2534: undefined reference to `SSL_CTX_set_min_proto_version'
collect2: error: ld returned 1 exit status
make[2]: *** [ab] Error 1
make[2]: Leaving directory `/srv/gump/public/workspace/apache-httpd/support'
make[1]: *** [all-recursive] Error 1
make[1]: Leaving directory `/srv/gump/public/workspace/apache-httpd/support'
make: *** [all-recursive] Error 1
---------------------------------------------

To subscribe to this information via syndicated feeds:
- RSS: http://vmgump.apache.org/gump/public/apache-httpd/apache-httpd-make/rss.xml
- Atom: http://vmgump.apache.org/gump/public/apache-httpd/apache-httpd-make/atom.xml

============================== Gump Tracking Only ===
Produced by Apache Gump(TM) version 2.3.
Gump Run 20160421000006, vmgump.apache.org:vmgump:20160421000006
Gump E-mail Identifier (unique within run) #4.

*********************************************************** G U M P
[GUMP@vmgump]: Project commons-compress (in module commons-compress) failed
To whom it may engage...
        
This is an automated request, but not an unsolicited one. For 
more information please visit http://gump.apache.org/nagged.html, 
and/or contact the folk at general@gump.apache.org.

Project commons-compress has an issue affecting its community integration.
This issue affects 4 projects,
 and has been outstanding for 13 runs.
The current state of this project is 'Failed', with reason 'Build Failed'.
For reference only, the following projects are affected by this:
    - commons-compress :  Commons Compression Package
    - commons-compress-test :  Apache Commons Compress
    - compress-antlib :  The Apache Compress Antlib contains tasks and resources that...
    - compress-antlib-test :  The Apache Compress Antlib contains tasks and resources that...


Full details are available at:
    http://vmgump.apache.org/gump/public/commons-compress/commons-compress/index.html

That said, some information snippets are provided here.

The following annotations (debug/informational/warning/error messages) were provided:
 -DEBUG- Sole jar output [commons-compress-*[0-9T].jar] identifier set to project name
 -DEBUG- (Apache Gump generated) Apache Maven Settings in: /srv/gump/public/workspace/commons-compress/gump_mvn_settings.xml
 -INFO- Failed with reason build failed
 -DEBUG- Maven POM in: /srv/gump/public/workspace/commons-compress/pom.xml
 -INFO- Failed to extract fallback artifacts from Gump Repository



The following work was performed:
http://vmgump.apache.org/gump/public/commons-compress/commons-compress/gump_work/build_commons-compress_commons-compress.html
Work Name: build_commons-compress_commons-compress (Type: Build)
Work ended in a state of : Failed
Elapsed: 56 secs
Command Line: /opt/maven3/bin/mvn --batch-mode -DskipTests=true --settings /srv/gump/public/workspace/commons-compress/gump_mvn_settings.xml
package 
[Working Directory: /srv/gump/public/workspace/commons-compress]
M2_HOME: /opt/maven3
---------------------------------------------
[INFO] -------------------------------------------------------------
[ERROR] COMPILATION ERROR : 
[INFO] -------------------------------------------------------------
[ERROR] /srv/gump/public/workspace/commons-compress/src/main/java/org/apache/commons/compress/compressors/lzma/LZMACompressorInputStream.java:[23,22]
cannot find symbol
  symbol:   class LZMAInputStream
  location: package org.tukaani.xz
[ERROR] /srv/gump/public/workspace/commons-compress/src/main/java/org/apache/commons/compress/archivers/sevenz/Coders.java:[41,22]
cannot find symbol
  symbol:   class LZMAInputStream
  location: package org.tukaani.xz
[ERROR] /srv/gump/public/workspace/commons-compress/src/main/java/org/apache/commons/compress/compressors/lzma/LZMACompressorInputStream.java:[48,18]
cannot find symbol
  symbol:   class LZMAInputStream
  location: class org.apache.commons.compress.compressors.lzma.LZMACompressorInputStream
[ERROR] /srv/gump/public/workspace/commons-compress/src/main/java/org/apache/commons/compress/archivers/sevenz/Coders.java:[111,28]
cannot find symbol
  symbol:   variable LZMAInputStream
  location: class org.apache.commons.compress.archivers.sevenz.Coders.LZMADecoder
[ERROR] /srv/gump/public/workspace/commons-compress/src/main/java/org/apache/commons/compress/archivers/sevenz/Coders.java:[114,24]
cannot find symbol
  symbol:   class LZMAInputStream
  location: class org.apache.commons.compress.archivers.sevenz.Coders.LZMADecoder
[INFO] 5 errors 
[INFO] -------------------------------------------------------------
[INFO] ------------------------------------------------------------------------
[INFO] BUILD FAILURE
[INFO] ------------------------------------------------------------------------
[INFO] Total time: 49.180 s
[INFO] Finished at: 2016-04-21T01:17:01+00:00
[INFO] Final Memory: 20M/71M
[INFO] ------------------------------------------------------------------------
[ERROR] Failed to execute goal org.apache.maven.plugins:maven-compiler-plugin:3.2:compile
(default-compile) on project commons-compress: Compilation failure: Compilation failure:
[ERROR] /srv/gump/public/workspace/commons-compress/src/main/java/org/apache/commons/compress/compressors/lzma/LZMACompressorInputStream.java:[23,22]
cannot find symbol
[ERROR] symbol:   class LZMAInputStream
[ERROR] location: package org.tukaani.xz
[ERROR] /srv/gump/public/workspace/commons-compress/src/main/java/org/apache/commons/compress/archivers/sevenz/Coders.java:[41,22]
cannot find symbol
[ERROR] symbol:   class LZMAInputStream
[ERROR] location: package org.tukaani.xz
[ERROR] /srv/gump/public/workspace/commons-compress/src/main/java/org/apache/commons/compress/compressors/lzma/LZMACompressorInputStream.java:[48,18]
cannot find symbol
[ERROR] symbol:   class LZMAInputStream
[ERROR] location: class org.apache.commons.compress.compressors.lzma.LZMACompressorInputStream
[ERROR] /srv/gump/public/workspace/commons-compress/src/main/java/org/apache/commons/compress/archivers/sevenz/Coders.java:[111,28]
cannot find symbol
[ERROR] symbol:   variable LZMAInputStream
[ERROR] location: class org.apache.commons.compress.archivers.sevenz.Coders.LZMADecoder
[ERROR] /srv/gump/public/workspace/commons-compress/src/main/java/org/apache/commons/compress/archivers/sevenz/Coders.java:[114,24]
cannot find symbol
[ERROR] symbol:   class LZMAInputStream
[ERROR] location: class org.apache.commons.compress.archivers.sevenz.Coders.LZMADecoder
[ERROR] -> [Help 1]
[ERROR] 
[ERROR] To see the full stack trace of the errors, re-run Maven with the -e switch.
[ERROR] Re-run Maven using the -X switch to enable full debug logging.
[ERROR] 
[ERROR] For more information about the errors and possible solutions, please read the following
articles:
[ERROR] [Help 1] http://cwiki.apache.org/confluence/display/MAVEN/MojoFailureException
---------------------------------------------

To subscribe to this information via syndicated feeds:
- RSS: http://vmgump.apache.org/gump/public/commons-compress/commons-compress/rss.xml
- Atom: http://vmgump.apache.org/gump/public/commons-compress/commons-compress/atom.xml

============================== Gump Tracking Only ===
Produced by Apache Gump(TM) version 2.3.
Gump Run 20160421000006, vmgump.apache.org:vmgump:20160421000006
Gump E-mail Identifier (unique within run) #5.

*********************************************************** G U M P
[GUMP@vmgump]: Project test-ant (in module ant) failed
To whom it may engage...
        
This is an automated request, but not an unsolicited one. For 
more information please visit http://gump.apache.org/nagged.html, 
and/or contact the folk at general@gump.apache.org.

Project test-ant has an issue affecting its community integration.
This issue affects 1 projects,
 and has been outstanding for 13 runs.
The current state of this project is 'Failed', with reason 'Build Failed'.
For reference only, the following projects are affected by this:
    - test-ant :  Java based build tool


Full details are available at:
    http://vmgump.apache.org/gump/public/ant/test-ant/index.html

That said, some information snippets are provided here.

The following annotations (debug/informational/warning/error messages) were provided:
 -WARNING- Bad *Optional* Dependency. Project: bsh : unknown to *this* workspace
 -INFO- Failed with reason build failed



The following work was performed:
http://vmgump.apache.org/gump/public/ant/test-ant/gump_work/build_ant_test-ant.html
Work Name: build_ant_test-ant (Type: Build)
Work ended in a state of : Failed
Elapsed: 16 mins 51 secs
Command Line: /usr/lib/jvm/java-8-oracle/bin/java -Djava.awt.headless=true -Dbuild.sysclasspath=only
-Xbootclasspath/p:/srv/gump/public/workspace/xml-xerces2/build/xercesImpl.jar:/srv/gump/public/workspace/xml-commons/java/external/build/xml-apis.jar:/srv/gump/public/workspace/xml-xalan/build/xalan-unbundled.jar:/srv/gump/public/workspace/xml-xalan/build/serializer.jar
org.apache.tools.ant.Main -Dgump.merge=/srv/gump/public/gump/work/merge.xml -Dtest.haltonfailure=false
-Dant.home=/srv/gump/public/workspace/ant/dist run-tests 
[Working Directory: /srv/gump/public/workspace/ant]
CLASSPATH: /usr/lib/jvm/java-8-oracle/lib/tools.jar:/srv/gump/public/workspace/ant/build/testcases:/srv/gump/public/workspace/ant/src/tests/junit:/srv/gump/public/workspace/ant/src/etc/testcases:/srv/gump/public/workspace/ant/src/etc/testcases/taskdefs/optional/out:/srv/gump/public/workspace/ant/src/tests/antunit/filters:/srv/gump/public/workspace/ant/src/tests/antunit/taskdefs/importtests:/srv/gump/public/workspace/ant/src/tests/antunit/filters/foo:/srv/gump/public/workspace/ant/src/tests/antunit/taskdefs/foo:/srv/gump/public/workspace/ant/build/antunit/tmp/testinput/build:/srv/gump/public/workspace/ant/build/antunit/tmp/testoutput:/srv/gump/public/workspace/ant/build/antunit/tmp/test.jar:/srv/gump/public/workspace/ant/build/antunit/tmp/test1.jar:/srv/gump/public/workspace/ant/build/antunit/tmp/test2.jar:/srv/gump/public/workspace/ant/build/antunit/tmp/test3.jar:/srv/gump/public/workspace/ant/build/antunit/tmp/test4.jar:/srv/gump/public/workspace/ant/build/antunit/tmp/test5.jar:/srv
 /gump/public/workspace/ant/build/antunit/tmp/resources:/srv/gump/public/workspace/ant/build/lib/ant.jar:/srv/gump/public/workspace/ant/build/lib/ant-launcher.jar:/srv/gump/public/workspace/ant/build/lib/ant-antlr.jar:/srv/gump/public/workspace/ant/build/lib/ant-apache-bcel.jar:/srv/gump/public/workspace/ant/build/lib/ant-apache-bsf.jar:/srv/gump/public/workspace/ant/build/lib/ant-apache-log4j.jar:/srv/gump/public/workspace/ant/build/lib/ant-apache-oro.jar:/srv/gump/public/workspace/ant/build/lib/ant-apache-regexp.jar:/srv/gump/public/workspace/ant/build/lib/ant-apache-resolver.jar:/srv/gump/public/workspace/ant/build/lib/ant-apache-xalan2.jar:/srv/gump/public/workspace/ant/build/lib/ant-commons-logging.jar:/srv/gump/public/workspace/ant/build/lib/ant-commons-net.jar:/srv/gump/public/workspace/ant/build/lib/ant-jai.jar:/srv/gump/public/workspace/ant/build/lib/ant-javamail.jar:/srv/gump/public/workspace/ant/build/lib/ant-jdepend.jar:/srv/gump/public/workspace/ant/build/lib/ant-jmf.jar
 :/srv/gump/public/workspace/ant/build/lib/ant-jsch.jar:/srv/gump/public/workspace/ant/build/lib/ant-junit.jar:/srv/gump/public/workspace/ant/build/lib/ant-junit4.jar:/srv/gump/public/workspace/ant/build/lib/ant-swing.jar:/srv/gump/packages/antlr/antlr-3.1.3.jar:/srv/gump/public/workspace/ant-contrib/lib/bcel/jars/bcel-5.1.jar:/srv/gump/public/workspace/apache-commons/logging/target/commons-logging-20160421.jar:/srv/gump/public/workspace/apache-commons/logging/target/commons-logging-api-20160421.jar:/srv/gump/public/workspace/apache-commons/net/target/commons-net-3.5-SNAPSHOT.jar:/srv/gump/public/workspace/apache-commons/net/target/commons-net-ftp-3.5-SNAPSHOT.jar:/srv/gump/packages/jaf-1.1ea/activation.jar:/srv/gump/public/workspace/jakarta-bsf/build/lib/bsf.jar:/srv/gump/packages/apache-attic/jakarta-regexp-1.5.jar:/srv/gump/public/workspace/jakarta-servletapi-5/jsr154/dist/lib/servlet-api.jar:/srv/gump/packages/javamail-1.4/mail.jar:/srv/gump/packages/javamail-1.4/lib/mailapi.jar:
 /srv/gump/packages/jdepend-2.6/lib/jdepend.jar:/srv/gump/packages/jsch/jsch-0.1.45.jar:/srv/gump/public/workspace/logging-log4j-12/target/log4j-1.2.18-SNAPSHOT.jar:/srv/gump/packages/apache-attic/oro-2.0.8.jar:/srv/gump/public/workspace/antlibs-antunit/build/ant-antunit-20160421.jar:/srv/gump/packages/hamcrest/hamcrest-core-1.3.jar:/srv/gump/public/workspace/junit/target/junit-4.13-SNAPSHOT.jar:/srv/gump/public/workspace/xml-commons/java/external/build/xml-apis-ext.jar:/srv/gump/public/workspace/commons-codec-1.x/dist/commons-codec-20160421.jar
---------------------------------------------
[au:antunit] Target: testStringTokenizer took 0 sec
[au:antunit] Target: testExplicitLines took 0 sec
[au:antunit] Build File: /srv/gump/public/workspace/ant/src/tests/antunit/types/selectors/depend-test.xml
[au:antunit] Tests run: 1, Failures: 0, Errors: 0, Time elapsed: 0.002 sec
[au:antunit] Target: testMapperByTypedef took 0.001 sec
[au:antunit] Build File: /srv/gump/public/workspace/ant/src/tests/antunit/types/selectors/different-test.xml
[au:antunit] Tests run: 1, Failures: 0, Errors: 0, Time elapsed: 0.002 sec
[au:antunit] Target: testMapperByTypedef took 0.001 sec
[au:antunit] Build File: /srv/gump/public/workspace/ant/src/tests/antunit/types/selectors/filename-test.xml
[au:antunit] Tests run: 2, Failures: 0, Errors: 0, Time elapsed: 0.011 sec
[au:antunit] Target: testRegex took 0.002 sec
[au:antunit] Target: testPattern took 0.005 sec
[au:antunit] Build File: /srv/gump/public/workspace/ant/src/tests/antunit/types/selectors/modified-test.xml
[au:antunit] Tests run: 1, Failures: 0, Errors: 0, Time elapsed: 0.016 sec
[au:antunit] Target: testUpdate took 0.013 sec
[au:antunit] Build File: /srv/gump/public/workspace/ant/src/tests/antunit/types/selectors/present-test.xml
[au:antunit] Tests run: 1, Failures: 0, Errors: 0, Time elapsed: 0.002 sec
[au:antunit] Target: testMapperByTypedef took 0.002 sec
[au:antunit] Build File: /srv/gump/public/workspace/ant/src/tests/antunit/types/selectors/readwrite-test.xml
[au:antunit] Tests run: 4, Failures: 0, Errors: 0, Time elapsed: 0.039 sec
[au:antunit] Target: testWritable took 0.002 sec
[au:antunit] Target: testAsConditions took 0.014 sec
[au:antunit] Target: testReadable took 0.001 sec
[au:antunit] Target: testUnwritable took 0.014 sec
[au:antunit] Build File: /srv/gump/public/workspace/ant/src/tests/antunit/types/selectors/select-test.xml
[au:antunit] Tests run: 4, Failures: 0, Errors: 0, Time elapsed: 0.035 sec
[au:antunit] Target: testIfFalse took 0.002 sec
[au:antunit] Target: testIfNotSet took 0.007 sec
[au:antunit] Target: testIfTrue took 0.006 sec
[au:antunit] Target: testIfSet took 0.007 sec
[au:antunit] Build File: /srv/gump/public/workspace/ant/src/tests/antunit/types/tarfileset-test.xml
[au:antunit] Tests run: 2, Failures: 0, Errors: 0, Time elapsed: 0.009 sec
[au:antunit] Target: testMissingArchive took 0.001 sec
[au:antunit] Target: testMissingArchiveDoesntMatter took 0.001 sec
[au:antunit] Build File: /srv/gump/public/workspace/ant/src/tests/antunit/types/zipfileset-test.xml
[au:antunit] Tests run: 5, Failures: 0, Errors: 0, Time elapsed: 0.069 sec
[au:antunit] Target: testMissingArchive took 0.001 sec
[au:antunit] Target: test-refid-check-encoding took 0 sec
[au:antunit] Target: test-refid-modify took 0.039 sec
[au:antunit] Target: test-refid-check-prefix took 0.001 sec
[au:antunit] Target: testMissingArchiveDoesntMatter took 0 sec

check-failed:

run-tests:

BUILD FAILED
/srv/gump/public/workspace/ant/build.xml:1610: Unit tests failed

Total time: 16 minutes 50 seconds
---------------------------------------------

To subscribe to this information via syndicated feeds:
- RSS: http://vmgump.apache.org/gump/public/ant/test-ant/rss.xml
- Atom: http://vmgump.apache.org/gump/public/ant/test-ant/atom.xml

============================== Gump Tracking Only ===
Produced by Apache Gump(TM) version 2.3.
Gump Run 20160421000006, vmgump.apache.org:vmgump:20160421000006
Gump E-mail Identifier (unique within run) #6.

*********************************************************** G U M P
[GUMP@vmgump]: Project easymock (in module easymock) failed
To whom it may engage...
        
This is an automated request, but not an unsolicited one. For 
more information please visit http://gump.apache.org/nagged.html, 
and/or contact the folk at general@gump.apache.org.

Project easymock has an issue affecting its community integration.
This issue affects 10 projects,
 and has been outstanding for 13 runs.
The current state of this project is 'Failed', with reason 'Build Failed'.
For reference only, the following projects are affected by this:
    - easymock :  EasyMock is a Java library that provides an easy way to use ...
    - tomcat-tc7.0.x-test-apr :  Tomcat 7.x, a web server implementing Java Servlet 3.0,
    ...
    - tomcat-tc7.0.x-test-bio :  Tomcat 7.x, a web server implementing Java Servlet 3.0,
    ...
    - tomcat-tc7.0.x-test-nio :  Tomcat 7.x, a web server implementing Java Servlet 3.0,
    ...
    - tomcat-tc8.0.x-test-apr :  Tomcat 8.x, a web server implementing the Java Servlet 3.1,
...
    - tomcat-tc8.0.x-test-bio :  Tomcat 8.x, a web server implementing the Java Servlet 3.1,
...
    - tomcat-tc8.0.x-test-nio :  Tomcat 8.x, a web server implementing the Java Servlet 3.1,
...
    - tomcat-tc8.0.x-test-nio2 :  Tomcat 8.x, a web server implementing the Java Servlet 3.1,
...
    - tomcat-trunk-test-nio :  Tomcat 9.x, a web server implementing the Java Servlet 4.0,
...
    - tomcat-trunk-test-nio2 :  Tomcat 9.x, a web server implementing the Java Servlet 4.0,
...


Full details are available at:
    http://vmgump.apache.org/gump/public/easymock/easymock/index.html

That said, some information snippets are provided here.

The following annotations (debug/informational/warning/error messages) were provided:
 -INFO- Making directory for Maven settings: [/srv/gump/public/workspace/easymock/core]
 -DEBUG- (Apache Gump generated) Apache Maven Settings in: /srv/gump/public/workspace/easymock/core/gump_mvn_settings.xml
 -INFO- Failed with reason build failed
 -INFO- Failed to extract fallback artifacts from Gump Repository



The following work was performed:
http://vmgump.apache.org/gump/public/easymock/easymock/gump_work/build_easymock_easymock.html
Work Name: build_easymock_easymock (Type: Build)
Work ended in a state of : Failed
Elapsed: 7 secs
Command Line: /opt/maven3/bin/mvn --batch-mode -Dmaven.test.skip=true --settings /srv/gump/public/workspace/easymock/core/gump_mvn_settings.xml
package 
[Working Directory: /srv/gump/public/workspace/easymock/core]
M2_HOME: /opt/maven3
---------------------------------------------
[INFO] Scanning for projects...
[INFO] ------------------------------------------------------------------------
[INFO] BUILD FAILURE
[INFO] ------------------------------------------------------------------------
[INFO] Total time: 0.741 s
[INFO] Finished at: 2016-04-21T02:10:31+00:00
[INFO] Final Memory: 4M/15M
[INFO] ------------------------------------------------------------------------
[ERROR] The goal you specified requires a project to execute but there is no POM in this directory
(/srv/gump/public/workspace/easymock/core). Please verify you invoked Maven from the correct
directory. -> [Help 1]
[ERROR] 
[ERROR] To see the full stack trace of the errors, re-run Maven with the -e switch.
[ERROR] Re-run Maven using the -X switch to enable full debug logging.
[ERROR] 
[ERROR] For more information about the errors and possible solutions, please read the following
articles:
[ERROR] [Help 1] http://cwiki.apache.org/confluence/display/MAVEN/MissingProjectException
---------------------------------------------

To subscribe to this information via syndicated feeds:
- RSS: http://vmgump.apache.org/gump/public/easymock/easymock/rss.xml
- Atom: http://vmgump.apache.org/gump/public/easymock/easymock/atom.xml

============================== Gump Tracking Only ===
Produced by Apache Gump(TM) version 2.3.
Gump Run 20160421000006, vmgump.apache.org:vmgump:20160421000006
Gump E-mail Identifier (unique within run) #7.


--
Apache Gump
http://gump.apache.org/ [Instance: vmgump]

---------------------------------------------------------------------
To unsubscribe, e-mail: general-unsubscribe@gump.apache.org
For additional commands, e-mail: general-help@gump.apache.org


Mime
View raw message