gump-general mailing list archives

Site index · List index
Message view « Date » · « Thread »
Top « Date » · « Thread »
From g...@vmgump.apache.org
Subject BATCH: All dressed up, with nowhere to go...
Date Sat, 16 Apr 2016 07:06:09 GMT
Dear Gumpmeisters,
            
The following 5 notifys should have been sent

*********************************************************** G U M P
[GUMP@vmgump]: Project openssl-make-test (in module openssl-master) failed
[GUMP@vmgump]: Project apache-httpd-make (in module apache-httpd) failed
[GUMP@vmgump]: Project compress-antlib-test (in module antlibs-compress) failed
[GUMP@vmgump]: Module commons-lang-trunk failed
[GUMP@vmgump]: Project commons-lang3 (in module commons-lang-trunk) failed
*********************************************************** G U M P
[GUMP@vmgump]: Project openssl-make-test (in module openssl-master) failed
To whom it may engage...
        
This is an automated request, but not an unsolicited one. For 
more information please visit http://gump.apache.org/nagged.html, 
and/or contact the folk at general@gump.apache.org.

Project openssl-make-test has an issue affecting its community integration.
This issue affects 8 projects,
 and has been outstanding for 25 runs.
The current state of this project is 'Failed', with reason 'Build Failed'.
For reference only, the following projects are affected by this:
    - openssl-make-install :  OpenSSL Encryption Library
    - openssl-make-test :  OpenSSL Encryption Library
    - tomcat-native-trunk-configure :  Tomcat native library using Apache Portable Runtime
    - tomcat-native-trunk-make :  Tomcat native library using Apache Portable Runtime
    - tomcat-native-trunk-make-install :  Tomcat native library using Apache Portable Runtime
    - tomcat-trunk-test-apr :  Tomcat 9.x, a web server implementing the Java Servlet 4.0,
...
    - tomcat-trunk-test-nio :  Tomcat 9.x, a web server implementing the Java Servlet 4.0,
...
    - tomcat-trunk-test-nio2 :  Tomcat 9.x, a web server implementing the Java Servlet 4.0,
...


Full details are available at:
    http://vmgump.apache.org/gump/public/openssl-master/openssl-make-test/index.html

That said, some information snippets are provided here.

The following annotations (debug/informational/warning/error messages) were provided:
 -INFO- Failed with reason build failed



The following work was performed:
http://vmgump.apache.org/gump/public/openssl-master/openssl-make-test/gump_work/build_openssl-master_openssl-make-test.html
Work Name: build_openssl-master_openssl-make-test (Type: Build)
Work ended in a state of : Failed
Elapsed: 1 min 28 secs
Command Line: make test 
[Working Directory: /srv/gump/public/workspace/openssl-master]
---------------------------------------------
    
    #   Failed test 'NON-DELEGATED; Root CA -> Intermediate CA'
    #   at ../test/recipes/80-test_ocsp.t line 31.
    
    #   Failed test 'NON-DELEGATED; Root CA -> EE'
    #   at ../test/recipes/80-test_ocsp.t line 31.
    
    #   Failed test 'DELEGATED; Intermediate CA -> EE'
    #   at ../test/recipes/80-test_ocsp.t line 31.
    
    #   Failed test 'DELEGATED; Root CA -> Intermediate CA'
    #   at ../test/recipes/80-test_ocsp.t line 31.
    
    #   Failed test 'DELEGATED; Root CA -> EE'
    #   at ../test/recipes/80-test_ocsp.t line 31.
    # Looks like you failed 6 tests of 6.

#   Failed test '=== INVALID SIGNATURE on the ISSUER CERTIFICATE ==='
#   at ../test/recipes/80-test_ocsp.t line 199.
# Looks like you failed 2 tests of 10.
../test/recipes/80-test_ocsp.t ............ 
Dubious, test returned 2 (wstat 512, 0x200)
Failed 2/10 subtests 
../test/recipes/80-test_ssl_new.t ......... ok
../test/recipes/80-test_ssl_old.t ......... ok
../test/recipes/80-test_ssl_test_ctx.t .... ok
../test/recipes/80-test_tsa.t ............. ok
../test/recipes/90-test_async.t ........... ok
../test/recipes/90-test_constant_time.t ... ok
../test/recipes/90-test_gmdiff.t .......... ok
../test/recipes/90-test_heartbeat.t ....... skipped: heartbeats is not supported by this OpenSSL
build
../test/recipes/90-test_ige.t ............. ok
../test/recipes/90-test_memleak.t ......... ok
../test/recipes/90-test_networking.t ...... ok
../test/recipes/90-test_np.t .............. ok
../test/recipes/90-test_p5_crpt2.t ........ ok
../test/recipes/90-test_secmem.t .......... ok
../test/recipes/90-test_srp.t ............. ok
../test/recipes/90-test_threads.t ......... ok
../test/recipes/90-test_v3name.t .......... ok

Test Summary Report
-------------------
../test/recipes/80-test_ocsp.t          (Wstat: 512 Tests: 10 Failed: 2)
  Failed tests:  1, 10
  Non-zero exit status: 2
Files=75, Tests=419, 65 wallclock secs ( 0.77 usr  0.13 sys + 42.85 cusr 12.64 csys = 56.39
CPU)
Result: FAIL
Failed 1/75 test programs. 2/419 subtests failed.
make: *** [test] Error 255
---------------------------------------------

To subscribe to this information via syndicated feeds:
- RSS: http://vmgump.apache.org/gump/public/openssl-master/openssl-make-test/rss.xml
- Atom: http://vmgump.apache.org/gump/public/openssl-master/openssl-make-test/atom.xml

============================== Gump Tracking Only ===
Produced by Apache Gump(TM) version 2.3.
Gump Run 20160416000007, vmgump.apache.org:vmgump:20160416000007
Gump E-mail Identifier (unique within run) #1.

*********************************************************** G U M P
[GUMP@vmgump]: Project apache-httpd-make (in module apache-httpd) failed
To whom it may engage...
        
This is an automated request, but not an unsolicited one. For 
more information please visit http://gump.apache.org/nagged.html, 
and/or contact the folk at general@gump.apache.org.

Project apache-httpd-make has an issue affecting its community integration.
This issue affects 5 projects,
 and has been outstanding for 11 runs.
The current state of this project is 'Failed', with reason 'Build Failed'.
For reference only, the following projects are affected by this:
    - apache-httpd-make :  Apache HTTP Server
    - apache-httpd-make-install :  Apache HTTP Server
    - tomcat-jk-native :  Connectors to various web servers
    - tomcat-jk-native-buildconf :  Connectors to various web servers
    - tomcat-jk-native-configure :  Connectors to various web servers


Full details are available at:
    http://vmgump.apache.org/gump/public/apache-httpd/apache-httpd-make/index.html

That said, some information snippets are provided here.

The following annotations (debug/informational/warning/error messages) were provided:
 -INFO- Failed with reason build failed



The following work was performed:
http://vmgump.apache.org/gump/public/apache-httpd/apache-httpd-make/gump_work/build_apache-httpd_apache-httpd-make.html
Work Name: build_apache-httpd_apache-httpd-make (Type: Build)
Work ended in a state of : Failed
Elapsed: 41 secs
Command Line: make 
[Working Directory: /srv/gump/public/workspace/apache-httpd]
---------------------------------------------
make[2]: Entering directory `/srv/gump/public/workspace/apache-httpd/modules/arch/unix'
make[2]: Leaving directory `/srv/gump/public/workspace/apache-httpd/modules/arch/unix'
Making all in dav/main
make[2]: Entering directory `/srv/gump/public/workspace/apache-httpd/modules/dav/main'
make[2]: Leaving directory `/srv/gump/public/workspace/apache-httpd/modules/dav/main'
Making all in generators
make[2]: Entering directory `/srv/gump/public/workspace/apache-httpd/modules/generators'
make[2]: Leaving directory `/srv/gump/public/workspace/apache-httpd/modules/generators'
Making all in dav/fs
make[2]: Entering directory `/srv/gump/public/workspace/apache-httpd/modules/dav/fs'
make[2]: Leaving directory `/srv/gump/public/workspace/apache-httpd/modules/dav/fs'
Making all in mappers
make[2]: Entering directory `/srv/gump/public/workspace/apache-httpd/modules/mappers'
make[2]: Leaving directory `/srv/gump/public/workspace/apache-httpd/modules/mappers'
make[1]: Leaving directory `/srv/gump/public/workspace/apache-httpd/modules'
Making all in support
make[1]: Entering directory `/srv/gump/public/workspace/apache-httpd/support'
make[2]: Entering directory `/srv/gump/public/workspace/apache-httpd/support'
/srv/gump/public/workspace/apr/dest-20160416/build-2/libtool --silent --mode=compile gcc -std=gnu99
 -g -O2 -pthread      -DLINUX -D_REENTRANT -D_GNU_SOURCE     -I. -I/srv/gump/public/workspace/apache-httpd/os/unix
-I/srv/gump/public/workspace/apache-httpd/include -I/srv/gump/public/workspace/apr/dest-20160416/include/apr-2
-I/srv/gump/public/workspace/pcre/dest-20160416/include -I/srv/gump/public/workspace/apache-httpd/modules/aaa
-I/srv/gump/public/workspace/apache-httpd/modules/cache -I/srv/gump/public/workspace/apache-httpd/modules/core
-I/srv/gump/public/workspace/apache-httpd/modules/database -I/srv/gump/public/workspace/apache-httpd/modules/filters
-I/srv/gump/public/workspace/apache-httpd/modules/ldap -I/srv/gump/public/workspace/apache-httpd/modules/loggers
-I/srv/gump/public/workspace/apache-httpd/modules/lua -I/srv/gump/public/workspace/apache-httpd/modules/proxy
-I/srv/gump/public/workspace/apache-httpd/modules/session -I/srv/gump/public/workspace/apache-httpd/modules/ssl
  -I/srv/gump/public/workspace/apache-httpd/modules/test -I/srv/gump/public/workspace/apache-httpd/server
-I/srv/gump/public/workspace/apache-httpd/modules/arch/unix -I/srv/gump/public/workspace/apache-httpd/modules/dav/main
-I/srv/gump/public/workspace/apache-httpd/modules/generators -I/srv/gump/public/workspace/apache-httpd/modules/mappers
 -prefer-non-pic -static -c htpasswd.c && touch htpasswd.lo
/srv/gump/public/workspace/apr/dest-20160416/build-2/libtool --silent --mode=compile gcc -std=gnu99
 -g -O2 -pthread      -DLINUX -D_REENTRANT -D_GNU_SOURCE     -I. -I/srv/gump/public/workspace/apache-httpd/os/unix
-I/srv/gump/public/workspace/apache-httpd/include -I/srv/gump/public/workspace/apr/dest-20160416/include/apr-2
-I/srv/gump/public/workspace/pcre/dest-20160416/include -I/srv/gump/public/workspace/apache-httpd/modules/aaa
-I/srv/gump/public/workspace/apache-httpd/modules/cache -I/srv/gump/public/workspace/apache-httpd/modules/core
-I/srv/gump/public/workspace/apache-httpd/modules/database -I/srv/gump/public/workspace/apache-httpd/modules/filters
-I/srv/gump/public/workspace/apache-httpd/modules/ldap -I/srv/gump/public/workspace/apache-httpd/modules/loggers
-I/srv/gump/public/workspace/apache-httpd/modules/lua -I/srv/gump/public/workspace/apache-httpd/modules/proxy
-I/srv/gump/public/workspace/apache-httpd/modules/session -I/srv/gump/public/workspace/apache-httpd/modules/ssl
  -I/srv/gump/public/workspace/apache-httpd/modules/test -I/srv/gump/public/workspace/apache-httpd/server
-I/srv/gump/public/workspace/apache-httpd/modules/arch/unix -I/srv/gump/public/workspace/apache-httpd/modules/dav/main
-I/srv/gump/public/workspace/apache-httpd/modules/generators -I/srv/gump/public/workspace/apache-httpd/modules/mappers
 -prefer-non-pic -static -c passwd_common.c && touch passwd_common.lo
/srv/gump/public/workspace/apr/dest-20160416/build-2/libtool --silent --mode=link gcc -std=gnu99
 -g -O2 -pthread         -o htpasswd  htpasswd.lo passwd_common.lo       /srv/gump/public/workspace/apr/dest-20160416/lib/libapr-2.la
-lcrypt -lrt -lcrypt -lpthread -ldl -lexpat -lcrypt
/srv/gump/public/workspace/apr/dest-20160416/build-2/libtool --silent --mode=compile gcc -std=gnu99
 -g -O2 -pthread      -DLINUX -D_REENTRANT -D_GNU_SOURCE     -I. -I/srv/gump/public/workspace/apache-httpd/os/unix
-I/srv/gump/public/workspace/apache-httpd/include -I/srv/gump/public/workspace/apr/dest-20160416/include/apr-2
-I/srv/gump/public/workspace/pcre/dest-20160416/include -I/srv/gump/public/workspace/apache-httpd/modules/aaa
-I/srv/gump/public/workspace/apache-httpd/modules/cache -I/srv/gump/public/workspace/apache-httpd/modules/core
-I/srv/gump/public/workspace/apache-httpd/modules/database -I/srv/gump/public/workspace/apache-httpd/modules/filters
-I/srv/gump/public/workspace/apache-httpd/modules/ldap -I/srv/gump/public/workspace/apache-httpd/modules/loggers
-I/srv/gump/public/workspace/apache-httpd/modules/lua -I/srv/gump/public/workspace/apache-httpd/modules/proxy
-I/srv/gump/public/workspace/apache-httpd/modules/session -I/srv/gump/public/workspace/apache-httpd/modules/ssl
  -I/srv/gump/public/workspace/apache-httpd/modules/test -I/srv/gump/public/workspace/apache-httpd/server
-I/srv/gump/public/workspace/apache-httpd/modules/arch/unix -I/srv/gump/public/workspace/apache-httpd/modules/dav/main
-I/srv/gump/public/workspace/apache-httpd/modules/generators -I/srv/gump/public/workspace/apache-httpd/modules/mappers
 -prefer-non-pic -static -c htdigest.c && touch htdigest.lo
/srv/gump/public/workspace/apr/dest-20160416/build-2/libtool --silent --mode=link gcc -std=gnu99
 -g -O2 -pthread         -o htdigest  htdigest.lo       /srv/gump/public/workspace/apr/dest-20160416/lib/libapr-2.la
-lcrypt -lrt -lcrypt -lpthread -ldl -lexpat
/srv/gump/public/workspace/apr/dest-20160416/build-2/libtool --silent --mode=compile gcc -std=gnu99
 -g -O2 -pthread      -DLINUX -D_REENTRANT -D_GNU_SOURCE     -I. -I/srv/gump/public/workspace/apache-httpd/os/unix
-I/srv/gump/public/workspace/apache-httpd/include -I/srv/gump/public/workspace/apr/dest-20160416/include/apr-2
-I/srv/gump/public/workspace/pcre/dest-20160416/include -I/srv/gump/public/workspace/apache-httpd/modules/aaa
-I/srv/gump/public/workspace/apache-httpd/modules/cache -I/srv/gump/public/workspace/apache-httpd/modules/core
-I/srv/gump/public/workspace/apache-httpd/modules/database -I/srv/gump/public/workspace/apache-httpd/modules/filters
-I/srv/gump/public/workspace/apache-httpd/modules/ldap -I/srv/gump/public/workspace/apache-httpd/modules/loggers
-I/srv/gump/public/workspace/apache-httpd/modules/lua -I/srv/gump/public/workspace/apache-httpd/modules/proxy
-I/srv/gump/public/workspace/apache-httpd/modules/session -I/srv/gump/public/workspace/apache-httpd/modules/ssl
  -I/srv/gump/public/workspace/apache-httpd/modules/test -I/srv/gump/public/workspace/apache-httpd/server
-I/srv/gump/public/workspace/apache-httpd/modules/arch/unix -I/srv/gump/public/workspace/apache-httpd/modules/dav/main
-I/srv/gump/public/workspace/apache-httpd/modules/generators -I/srv/gump/public/workspace/apache-httpd/modules/mappers
 -prefer-non-pic -static -c htdbm.c && touch htdbm.lo
/srv/gump/public/workspace/apr/dest-20160416/build-2/libtool --silent --mode=link gcc -std=gnu99
 -g -O2 -pthread         -o htdbm  htdbm.lo passwd_common.lo       /srv/gump/public/workspace/apr/dest-20160416/lib/libapr-2.la
-lcrypt -lrt -lcrypt -lpthread -ldl -lexpat -lcrypt
/srv/gump/public/workspace/apr/dest-20160416/build-2/libtool --silent --mode=compile gcc -std=gnu99
 -g -O2 -pthread      -DLINUX -D_REENTRANT -D_GNU_SOURCE     -I. -I/srv/gump/public/workspace/apache-httpd/os/unix
-I/srv/gump/public/workspace/apache-httpd/include -I/srv/gump/public/workspace/apr/dest-20160416/include/apr-2
-I/srv/gump/public/workspace/pcre/dest-20160416/include -I/srv/gump/public/workspace/apache-httpd/modules/aaa
-I/srv/gump/public/workspace/apache-httpd/modules/cache -I/srv/gump/public/workspace/apache-httpd/modules/core
-I/srv/gump/public/workspace/apache-httpd/modules/database -I/srv/gump/public/workspace/apache-httpd/modules/filters
-I/srv/gump/public/workspace/apache-httpd/modules/ldap -I/srv/gump/public/workspace/apache-httpd/modules/loggers
-I/srv/gump/public/workspace/apache-httpd/modules/lua -I/srv/gump/public/workspace/apache-httpd/modules/proxy
-I/srv/gump/public/workspace/apache-httpd/modules/session -I/srv/gump/public/workspace/apache-httpd/modules/ssl
  -I/srv/gump/public/workspace/apache-httpd/modules/test -I/srv/gump/public/workspace/apache-httpd/server
-I/srv/gump/public/workspace/apache-httpd/modules/arch/unix -I/srv/gump/public/workspace/apache-httpd/modules/dav/main
-I/srv/gump/public/workspace/apache-httpd/modules/generators -I/srv/gump/public/workspace/apache-httpd/modules/mappers
 -prefer-non-pic -static -c firehose.c && touch firehose.lo
/srv/gump/public/workspace/apr/dest-20160416/build-2/libtool --silent --mode=link gcc -std=gnu99
 -g -O2 -pthread         -o firehose  firehose.lo       /srv/gump/public/workspace/apr/dest-20160416/lib/libapr-2.la
-lcrypt -lrt -lcrypt -lpthread -ldl -lexpat
/srv/gump/public/workspace/apr/dest-20160416/build-2/libtool --silent --mode=compile gcc -std=gnu99
  -g -O2 -pthread      -DLINUX -D_REENTRANT -D_GNU_SOURCE   \
	      -I. -I/srv/gump/public/workspace/apache-httpd/os/unix -I/srv/gump/public/workspace/apache-httpd/include
-I/srv/gump/public/workspace/apr/dest-20160416/include/apr-2 -I/srv/gump/public/workspace/pcre/dest-20160416/include
-I/srv/gump/public/workspace/apache-httpd/modules/aaa -I/srv/gump/public/workspace/apache-httpd/modules/cache
-I/srv/gump/public/workspace/apache-httpd/modules/core -I/srv/gump/public/workspace/apache-httpd/modules/database
-I/srv/gump/public/workspace/apache-httpd/modules/filters -I/srv/gump/public/workspace/apache-httpd/modules/ldap
-I/srv/gump/public/workspace/apache-httpd/modules/loggers -I/srv/gump/public/workspace/apache-httpd/modules/lua
-I/srv/gump/public/workspace/apache-httpd/modules/proxy -I/srv/gump/public/workspace/apache-httpd/modules/session
-I/srv/gump/public/workspace/apache-httpd/modules/ssl -I/srv/gump/public/workspace/apache-httpd/modules/test
-I/srv/gump/public/workspace/apache-httpd/server -I/srv/gump/public/workspace/apache-httpd/modules
 /arch/unix -I/srv/gump/public/workspace/apache-httpd/modules/dav/main -I/srv/gump/public/workspace/apache-httpd/modules/generators
-I/srv/gump/public/workspace/apache-httpd/modules/mappers  -prefer-non-pic -static -c ab.c
&& touch ab.lo
ab.c: In function 'ssl_proceed_handshake':
ab.c:715:17: warning: implicit declaration of function 'SSL_get_server_tmp_key' [-Wimplicit-function-declaration]
                 if (SSL_get_server_tmp_key(c->ssl, &key)) {
                 ^
ab.c:732:25: warning: implicit declaration of function 'EC_curve_nid2nist' [-Wimplicit-function-declaration]
                         cname = EC_curve_nid2nist(nid);
                         ^
ab.c:732:31: warning: assignment makes pointer from integer without a cast [enabled by default]
                         cname = EC_curve_nid2nist(nid);
                               ^
/srv/gump/public/workspace/apr/dest-20160416/build-2/libtool --silent --mode=link gcc -std=gnu99
 -g -O2 -pthread   -lssl -lcrypto -lcrypt -lrt -lpthread -ldl -lexpat  \
	         -o ab  ab.lo       /srv/gump/public/workspace/apr/dest-20160416/lib/libapr-2.la
-lcrypt -lrt -lcrypt -lpthread -ldl -lexpat -lm
ab.o: In function `ssl_proceed_handshake':
/srv/gump/public/workspace/apache-httpd/support/ab.c:715: undefined reference to `SSL_get_server_tmp_key'
/srv/gump/public/workspace/apache-httpd/support/ab.c:732: undefined reference to `EC_curve_nid2nist'
collect2: error: ld returned 1 exit status
make[2]: *** [ab] Error 1
make[2]: Leaving directory `/srv/gump/public/workspace/apache-httpd/support'
make[1]: *** [all-recursive] Error 1
make[1]: Leaving directory `/srv/gump/public/workspace/apache-httpd/support'
make: *** [all-recursive] Error 1
---------------------------------------------

To subscribe to this information via syndicated feeds:
- RSS: http://vmgump.apache.org/gump/public/apache-httpd/apache-httpd-make/rss.xml
- Atom: http://vmgump.apache.org/gump/public/apache-httpd/apache-httpd-make/atom.xml

============================== Gump Tracking Only ===
Produced by Apache Gump(TM) version 2.3.
Gump Run 20160416000007, vmgump.apache.org:vmgump:20160416000007
Gump E-mail Identifier (unique within run) #2.

*********************************************************** G U M P
[GUMP@vmgump]: Project compress-antlib-test (in module antlibs-compress) failed
To whom it may engage...
        
This is an automated request, but not an unsolicited one. For 
more information please visit http://gump.apache.org/nagged.html, 
and/or contact the folk at general@gump.apache.org.

Project compress-antlib-test has an issue affecting its community integration.
This issue affects 1 projects,
 and has been outstanding for 49 runs.
The current state of this project is 'Failed', with reason 'Build Failed'.
For reference only, the following projects are affected by this:
    - compress-antlib-test :  The Apache Compress Antlib contains tasks and resources that...


Full details are available at:
    http://vmgump.apache.org/gump/public/antlibs-compress/compress-antlib-test/index.html

That said, some information snippets are provided here.

The following annotations (debug/informational/warning/error messages) were provided:
 -DEBUG- Dependency on ant exists, no need to add for property ant.home.
 -INFO- Failed with reason build failed



The following work was performed:
http://vmgump.apache.org/gump/public/antlibs-compress/compress-antlib-test/gump_work/build_antlibs-compress_compress-antlib-test.html
Work Name: build_antlibs-compress_compress-antlib-test (Type: Build)
Work ended in a state of : Failed
Elapsed: 4 mins 54 secs
Command Line: /usr/lib/jvm/java-8-oracle/bin/java -Djava.awt.headless=true -Dbuild.sysclasspath=only
-Xbootclasspath/p:/srv/gump/public/workspace/xml-xerces2/build/xercesImpl.jar:/srv/gump/public/workspace/xml-commons/java/external/build/xml-apis.jar
org.apache.tools.ant.Main -Dgump.merge=/srv/gump/public/gump/work/merge.xml -Dant.home=/srv/gump/public/workspace/ant/dist
test 
[Working Directory: /srv/gump/public/workspace/antlibs-compress]
CLASSPATH: /usr/lib/jvm/java-8-oracle/lib/tools.jar:/srv/gump/public/workspace/antlibs-compress/ivy/ivy.jar:/srv/gump/public/workspace/antlibs-compress/build/ant-compress-20160416.jar:/srv/gump/public/workspace/ant/dist/lib/ant.jar:/srv/gump/public/workspace/ant/dist/lib/ant-launcher.jar:/srv/gump/public/workspace/ant/dist/lib/ant-jmf.jar:/srv/gump/public/workspace/ant/dist/lib/ant-junit.jar:/srv/gump/public/workspace/ant/dist/lib/ant-junit4.jar:/srv/gump/public/workspace/ant/dist/lib/ant-swing.jar:/srv/gump/public/workspace/ant/dist/lib/ant-apache-resolver.jar:/srv/gump/public/workspace/ant/dist/lib/ant-apache-xalan2.jar:/srv/gump/public/workspace/commons-compress/target/commons-compress-1.12-SNAPSHOT.jar:/srv/gump/public/workspace/xz-java/build/jar-20160416/xz.jar:/srv/gump/public/workspace/antlibs-antunit/build/ant-antunit-20160416.jar:/srv/gump/public/workspace/xml-commons/java/external/build/xml-apis-ext.jar
---------------------------------------------
[au:antunit] Target: testWithDirectories took 0.021 sec
[au:antunit] Target: testFullpath took 0.044 sec
[au:antunit] Target: testPreserve0Permissions took 0.017 sec
[au:antunit] Target: testForceCreateOfUpToDate took 4.1 sec
[au:antunit] Target: testNoDirectoriesByDefault took 0.025 sec
[au:antunit] Target: testPlainFileSet took 0.026 sec
[au:antunit] Target: testReplaceOfUpToDate took 4.019 sec
[au:antunit] Target: testCoreZipFileSet  FAILED
[au:antunit] 	at line 35, column 24
[au:antunit] 	Message: Assertion failed
[au:antunit] 	took 0.017 sec
[au:antunit] Target: testAntlibTarFileSet took 0.013 sec
[au:antunit] Target: testCreateOfOutOfDate took 4.055 sec
[au:antunit] Target: testFileSetPermissionsWin took 0.09 sec
[au:antunit] Target: testAddDuplicates took 0.03 sec
[au:antunit] Target: testRemoveLeadingSlashes took 0.014 sec
[au:antunit] Target: testPrefixWithSlash took 0.016 sec
[au:antunit] Target: testWithImplicitDirectories took 0.017 sec
[au:antunit] Target: testForceReplaceOfUpToDate took 4.034 sec
[au:antunit] Target: test0PermissionsGetReplaced took 0.017 sec
[au:antunit] Target: testFailDuplicates took 0.005 sec
[au:antunit] Build File: /srv/gump/public/workspace/antlibs-compress/src/tests/antunit/zipentry-test.xml
[au:antunit] Tests run: 3, Failures: 1, Errors: 0, Time elapsed: 0.054 sec
[au:antunit] Target: testResourceProperties  FAILED
[au:antunit] 	at line 59, column 20
[au:antunit] 	Message: Assertion failed
[au:antunit] 	took 0.029 sec
[au:antunit] Target: testUncompressSource took 0.01 sec
[au:antunit] Target: testZipSource took 0.004 sec
[au:antunit] Build File: /srv/gump/public/workspace/antlibs-compress/src/tests/antunit/zipfileset-test.xml
[au:antunit] Tests run: 9, Failures: 0, Errors: 0, Time elapsed: 0.336 sec
[au:antunit] Target: testSkipUnreadableEntries took 0.004 sec
[au:antunit] Target: testMissingArchive took 0.007 sec
[au:antunit] Target: testUncompressSource took 0.009 sec
[au:antunit] Target: test-refid-check-encoding took 0.003 sec
[au:antunit] Target: testZipSource took 0.213 sec
[au:antunit] Target: test-refid-modify took 0.045 sec
[au:antunit] Target: test-refid-check-prefix took 0.004 sec
[au:antunit] Target: testMissingArchiveDoesntMatter took 0.008 sec
[au:antunit] Target: testFailsOnUnreadableEntries took 0.006 sec
[au:antunit] Build File: /srv/gump/public/workspace/antlibs-compress/src/tests/antunit/zresource-test.xml
[au:antunit] Tests run: 1, Failures: 0, Errors: 0, Time elapsed: 0.01 sec
[au:antunit] Target: testNativeZ took 0.008 sec

test:

BUILD FAILED
/srv/gump/public/workspace/antlibs-compress/common/build.xml:209: At least one AntUnit test
has failed.

Total time: 4 minutes 53 seconds
---------------------------------------------

To subscribe to this information via syndicated feeds:
- RSS: http://vmgump.apache.org/gump/public/antlibs-compress/compress-antlib-test/rss.xml
- Atom: http://vmgump.apache.org/gump/public/antlibs-compress/compress-antlib-test/atom.xml

============================== Gump Tracking Only ===
Produced by Apache Gump(TM) version 2.3.
Gump Run 20160416000007, vmgump.apache.org:vmgump:20160416000007
Gump E-mail Identifier (unique within run) #3.

*********************************************************** G U M P
[GUMP@vmgump]: Module commons-lang-trunk failed
To whom it may engage...
        
This is an automated request, but not an unsolicited one. For 
more information please visit http://gump.apache.org/nagged.html, 
and/or contact the folk at general@gump.apache.org.

Module commons-lang-trunk has an issue affecting its community integration,
 and has been outstanding for 148 runs.
The current state of this module is 'Failed', with reason 'Update Failed'.

Full details are available at:
    http://vmgump.apache.org/gump/public/commons-lang-trunk/index.html

That said, some information snippets are provided here.

The following annotations (debug/informational/warning/error messages) were provided:
 -INFO- Failed with reason update failed



The following work was performed:
http://vmgump.apache.org/gump/public/commons-lang-trunk/gump_work/update_commons-lang-trunk.html
Work Name: update_commons-lang-trunk (Type: Update)
Work ended in a state of : Failed
Elapsed: 2 secs
Command Line: git pull --quiet http://git-wip-us.apache.org/repos/asf//commons-lang.git master

[Working Directory: /srv/gump/public/workspace/cvs/commons-lang-trunk]
---------------------------------------------
error: Your local changes to the following files would be overwritten by merge:
	NOTICE.txt
Please, commit your changes or stash them before you can merge.
Aborting
---------------------------------------------

To subscribe to this information via syndicated feeds:
- RSS: http://vmgump.apache.org/gump/public/commons-lang-trunk/rss.xml
- Atom: http://vmgump.apache.org/gump/public/commons-lang-trunk/atom.xml

============================== Gump Tracking Only ===
Produced by Apache Gump(TM) version 2.3.
Gump Run 20160416000007, vmgump.apache.org:vmgump:20160416000007
Gump E-mail Identifier (unique within run) #4.

*********************************************************** G U M P
[GUMP@vmgump]: Project commons-lang3 (in module commons-lang-trunk) failed
To whom it may engage...
        
This is an automated request, but not an unsolicited one. For 
more information please visit http://gump.apache.org/nagged.html, 
and/or contact the folk at general@gump.apache.org.

Project commons-lang3 has an issue affecting its community integration,
 and has been outstanding for 148 runs.
The current state of this project is 'Failed', with reason 'Update Failed'.

Full details are available at:
    http://vmgump.apache.org/gump/public/commons-lang-trunk/commons-lang3/index.html

That said, some information snippets are provided here.

The following annotations (debug/informational/warning/error messages) were provided:
 -DEBUG- Sole jar output [commons-lang3-*[0-9T].jar] identifier set to project name
 -DEBUG- Sole pom output [pom.xml] identifier set to project name
 -INFO- Failed with reason update failed
 -INFO- Failed to extract fallback artifacts from Gump Repository

To subscribe to this information via syndicated feeds:
- RSS: http://vmgump.apache.org/gump/public/commons-lang-trunk/commons-lang3/rss.xml
- Atom: http://vmgump.apache.org/gump/public/commons-lang-trunk/commons-lang3/atom.xml

============================== Gump Tracking Only ===
Produced by Apache Gump(TM) version 2.3.
Gump Run 20160416000007, vmgump.apache.org:vmgump:20160416000007
Gump E-mail Identifier (unique within run) #5.


--
Apache Gump
http://gump.apache.org/ [Instance: vmgump]

---------------------------------------------------------------------
To unsubscribe, e-mail: general-unsubscribe@gump.apache.org
For additional commands, e-mail: general-help@gump.apache.org


Mime
View raw message