gump-general mailing list archives

Site index · List index
Message view « Date » · « Thread »
Top « Date » · « Thread »
From g...@vmgump.apache.org
Subject BATCH: All dressed up, with nowhere to go...
Date Mon, 14 Mar 2016 08:59:50 GMT
Dear Gumpmeisters,
            
The following 4 notifys should have been sent

*********************************************************** G U M P
[GUMP@vmgump]: Project openssl-make-install (in module openssl-master) failed
[GUMP@vmgump]: Project compress-antlib-test (in module antlibs-compress) failed
[GUMP@vmgump]: Module commons-lang-trunk failed
[GUMP@vmgump]: Project commons-lang3 (in module commons-lang-trunk) failed
*********************************************************** G U M P
[GUMP@vmgump]: Project openssl-make-install (in module openssl-master) failed
To whom it may engage...
        
This is an automated request, but not an unsolicited one. For 
more information please visit http://gump.apache.org/nagged.html, 
and/or contact the folk at general@gump.apache.org.

Project openssl-make-install has an issue affecting its community integration.
This issue affects 7 projects.
The current state of this project is 'Failed', with reason 'Build Failed'.
For reference only, the following projects are affected by this:
    - openssl-make-install :  OpenSSL Encryption Library
    - tomcat-native-trunk-configure :  Tomcat native library using Apache Portable Runtime
    - tomcat-native-trunk-make :  Tomcat native library using Apache Portable Runtime
    - tomcat-native-trunk-make-install :  Tomcat native library using Apache Portable Runtime
    - tomcat-trunk-test-apr :  Tomcat 9.x, a web server implementing the Java Servlet 4.0,
...
    - tomcat-trunk-test-nio :  Tomcat 9.x, a web server implementing the Java Servlet 4.0,
...
    - tomcat-trunk-test-nio2 :  Tomcat 9.x, a web server implementing the Java Servlet 4.0,
...


Full details are available at:
    http://vmgump.apache.org/gump/public/openssl-master/openssl-make-install/index.html

That said, some information snippets are provided here.

The following annotations (debug/informational/warning/error messages) were provided:
 -INFO- Failed with reason build failed
 -INFO- Failed to extract fallback artifacts from Gump Repository



The following work was performed:
http://vmgump.apache.org/gump/public/openssl-master/openssl-make-install/gump_work/build_openssl-master_openssl-make-install.html
Work Name: build_openssl-master_openssl-make-install (Type: Build)
Work ended in a state of : Failed
Elapsed: 42 secs
Command Line: make install 
[Working Directory: /srv/gump/public/workspace/openssl-master]
---------------------------------------------
EVP_PKEY_copy_parameters.3 => EVP_PKEY_cmp.3
link /srv/gump/public/workspace/openssl-master/dest-20160314/share/man/man3/EVP_PKEY_missing_parameters.3
-> /srv/gump/public/workspace/openssl-master/dest-20160314/share/man/man3/EVP_PKEY_cmp.3
EVP_PKEY_missing_parameters.3 => EVP_PKEY_cmp.3
link /srv/gump/public/workspace/openssl-master/dest-20160314/share/man/man3/EVP_PKEY_cmp_parameters.3
-> /srv/gump/public/workspace/openssl-master/dest-20160314/share/man/man3/EVP_PKEY_cmp.3
EVP_PKEY_cmp_parameters.3 => EVP_PKEY_cmp.3
install ./doc/crypto/EVP_PKEY_decrypt.pod -> /srv/gump/public/workspace/openssl-master/dest-20160314/share/man/man3/EVP_PKEY_decrypt.3
link /srv/gump/public/workspace/openssl-master/dest-20160314/share/man/man3/EVP_PKEY_decrypt_init.3
-> /srv/gump/public/workspace/openssl-master/dest-20160314/share/man/man3/EVP_PKEY_decrypt.3
EVP_PKEY_decrypt_init.3 => EVP_PKEY_decrypt.3
install ./doc/crypto/EVP_PKEY_derive.pod -> /srv/gump/public/workspace/openssl-master/dest-20160314/share/man/man3/EVP_PKEY_derive.3
link /srv/gump/public/workspace/openssl-master/dest-20160314/share/man/man3/EVP_PKEY_derive_init.3
-> /srv/gump/public/workspace/openssl-master/dest-20160314/share/man/man3/EVP_PKEY_derive.3
EVP_PKEY_derive_init.3 => EVP_PKEY_derive.3
link /srv/gump/public/workspace/openssl-master/dest-20160314/share/man/man3/EVP_PKEY_derive_set_peer.3
-> /srv/gump/public/workspace/openssl-master/dest-20160314/share/man/man3/EVP_PKEY_derive.3
EVP_PKEY_derive_set_peer.3 => EVP_PKEY_derive.3
install ./doc/crypto/EVP_PKEY_encrypt.pod -> /srv/gump/public/workspace/openssl-master/dest-20160314/share/man/man3/EVP_PKEY_encrypt.3
link /srv/gump/public/workspace/openssl-master/dest-20160314/share/man/man3/EVP_PKEY_encrypt_init.3
-> /srv/gump/public/workspace/openssl-master/dest-20160314/share/man/man3/EVP_PKEY_encrypt.3
EVP_PKEY_encrypt_init.3 => EVP_PKEY_encrypt.3
install ./doc/crypto/EVP_PKEY_get_default_digest.pod -> /srv/gump/public/workspace/openssl-master/dest-20160314/share/man/man3/EVP_PKEY_get_default_digest.3
link /srv/gump/public/workspace/openssl-master/dest-20160314/share/man/man3/EVP_PKEY_get_default_digest_nid.3
-> /srv/gump/public/workspace/openssl-master/dest-20160314/share/man/man3/EVP_PKEY_get_default_digest.3
EVP_PKEY_get_default_digest_nid.3 => EVP_PKEY_get_default_digest.3
install ./doc/crypto/EVP_PKEY_keygen.pod -> /srv/gump/public/workspace/openssl-master/dest-20160314/share/man/man3/EVP_PKEY_keygen.3
link /srv/gump/public/workspace/openssl-master/dest-20160314/share/man/man3/EVP_PKEY_keygen_init.3
-> /srv/gump/public/workspace/openssl-master/dest-20160314/share/man/man3/EVP_PKEY_keygen.3
EVP_PKEY_keygen_init.3 => EVP_PKEY_keygen.3
link /srv/gump/public/workspace/openssl-master/dest-20160314/share/man/man3/EVP_PKEY_paramgen_init.3
-> /srv/gump/public/workspace/openssl-master/dest-20160314/share/man/man3/EVP_PKEY_keygen.3
EVP_PKEY_paramgen_init.3 => EVP_PKEY_keygen.3
link /srv/gump/public/workspace/openssl-master/dest-20160314/share/man/man3/EVP_PKEY_paramgen.3
-> /srv/gump/public/workspace/openssl-master/dest-20160314/share/man/man3/EVP_PKEY_keygen.3
EVP_PKEY_paramgen.3 => EVP_PKEY_keygen.3
link /srv/gump/public/workspace/openssl-master/dest-20160314/share/man/man3/EVP_PKEY_CTX_set_cb.3
-> /srv/gump/public/workspace/openssl-master/dest-20160314/share/man/man3/EVP_PKEY_keygen.3
EVP_PKEY_CTX_set_cb.3 => EVP_PKEY_keygen.3
link /srv/gump/public/workspace/openssl-master/dest-20160314/share/man/man3/EVP_PKEY_CTX_get_cb.3
-> /srv/gump/public/workspace/openssl-master/dest-20160314/share/man/man3/EVP_PKEY_keygen.3
EVP_PKEY_CTX_get_cb.3 => EVP_PKEY_keygen.3
link /srv/gump/public/workspace/openssl-master/dest-20160314/share/man/man3/EVP_PKEY_CTX_get_keygen_info.3
-> /srv/gump/public/workspace/openssl-master/dest-20160314/share/man/man3/EVP_PKEY_keygen.3
EVP_PKEY_CTX_get_keygen_info.3 => EVP_PKEY_keygen.3
link /srv/gump/public/workspace/openssl-master/dest-20160314/share/man/man3/EVP_PKEVP_PKEY_CTX_set_app_data.3
-> /srv/gump/public/workspace/openssl-master/dest-20160314/share/man/man3/EVP_PKEY_keygen.3
EVP_PKEVP_PKEY_CTX_set_app_data.3 => EVP_PKEY_keygen.3
link /srv/gump/public/workspace/openssl-master/dest-20160314/share/man/man3/EVP_PKEY_CTX_get_app_data.3
-> /srv/gump/public/workspace/openssl-master/dest-20160314/share/man/man3/EVP_PKEY_keygen.3
EVP_PKEY_CTX_get_app_data.3 => EVP_PKEY_keygen.3
install ./doc/crypto/EVP_PKEY_new.pod -> /srv/gump/public/workspace/openssl-master/dest-20160314/share/man/man3/EVP_PKEY_new.3
link /srv/gump/public/workspace/openssl-master/dest-20160314/share/man/man3/EVP_PKEY_up_ref.3
-> /srv/gump/public/workspace/openssl-master/dest-20160314/share/man/man3/EVP_PKEY_new.3
EVP_PKEY_up_ref.3 => EVP_PKEY_new.3
link /srv/gump/public/workspace/openssl-master/dest-20160314/share/man/man3/EVP_PKEY_free.3
-> /srv/gump/public/workspace/openssl-master/dest-20160314/share/man/man3/EVP_PKEY_new.3
EVP_PKEY_free.3 => EVP_PKEY_new.3
install ./doc/crypto/EVP_PKEY_print_private.pod -> /srv/gump/public/workspace/openssl-master/dest-20160314/share/man/man3/EVP_PKEY_print_private.3
link /srv/gump/public/workspace/openssl-master/dest-20160314/share/man/man3/EVP_PKEY_print_public.3
-> /srv/gump/public/workspace/openssl-master/dest-20160314/share/man/man3/EVP_PKEY_print_private.3
EVP_PKEY_print_public.3 => EVP_PKEY_print_private.3
link /srv/gump/public/workspace/openssl-master/dest-20160314/share/man/man3/EVP_PKEY_print_params.3
-> /srv/gump/public/workspace/openssl-master/dest-20160314/share/man/man3/EVP_PKEY_print_private.3
EVP_PKEY_print_params.3 => EVP_PKEY_print_private.3
install ./doc/crypto/EVP_PKEY_set1_RSA.pod -> /srv/gump/public/workspace/openssl-master/dest-20160314/share/man/man3/EVP_PKEY_set1_RSA.3
IO::File=IO(0x6c4090) around line 62: Unterminated B<...> sequence
POD document had syntax errors at /usr/bin/pod2man line 71.
make: *** [install_man_docs] Error 255
---------------------------------------------

To subscribe to this information via syndicated feeds:
- RSS: http://vmgump.apache.org/gump/public/openssl-master/openssl-make-install/rss.xml
- Atom: http://vmgump.apache.org/gump/public/openssl-master/openssl-make-install/atom.xml

============================== Gump Tracking Only ===
Produced by Apache Gump(TM) version 2.3.
Gump Run 20160314000015, vmgump.apache.org:vmgump:20160314000015
Gump E-mail Identifier (unique within run) #1.

*********************************************************** G U M P
[GUMP@vmgump]: Project compress-antlib-test (in module antlibs-compress) failed
To whom it may engage...
        
This is an automated request, but not an unsolicited one. For 
more information please visit http://gump.apache.org/nagged.html, 
and/or contact the folk at general@gump.apache.org.

Project compress-antlib-test has an issue affecting its community integration.
This issue affects 1 projects,
 and has been outstanding for 77 runs.
The current state of this project is 'Failed', with reason 'Build Failed'.
For reference only, the following projects are affected by this:
    - compress-antlib-test :  The Apache Compress Antlib contains tasks and resources that...


Full details are available at:
    http://vmgump.apache.org/gump/public/antlibs-compress/compress-antlib-test/index.html

That said, some information snippets are provided here.

The following annotations (debug/informational/warning/error messages) were provided:
 -DEBUG- Dependency on ant exists, no need to add for property ant.home.
 -INFO- Failed with reason build failed



The following work was performed:
http://vmgump.apache.org/gump/public/antlibs-compress/compress-antlib-test/gump_work/build_antlibs-compress_compress-antlib-test.html
Work Name: build_antlibs-compress_compress-antlib-test (Type: Build)
Work ended in a state of : Failed
Elapsed: 5 mins 48 secs
Command Line: /usr/lib/jvm/java-8-oracle/bin/java -Djava.awt.headless=true -Dbuild.sysclasspath=only
-Xbootclasspath/p:/srv/gump/public/workspace/xml-xerces2/build/xercesImpl.jar:/srv/gump/public/workspace/xml-commons/java/external/build/xml-apis.jar
org.apache.tools.ant.Main -Dgump.merge=/srv/gump/public/gump/work/merge.xml -Dant.home=/srv/gump/public/workspace/ant/dist
test 
[Working Directory: /srv/gump/public/workspace/antlibs-compress]
CLASSPATH: /usr/lib/jvm/java-8-oracle/lib/tools.jar:/srv/gump/public/workspace/antlibs-compress/ivy/ivy.jar:/srv/gump/public/workspace/antlibs-compress/build/ant-compress-20160314.jar:/srv/gump/public/workspace/ant/dist/lib/ant.jar:/srv/gump/public/workspace/ant/dist/lib/ant-launcher.jar:/srv/gump/public/workspace/ant/dist/lib/ant-jmf.jar:/srv/gump/public/workspace/ant/dist/lib/ant-junit.jar:/srv/gump/public/workspace/ant/dist/lib/ant-junit4.jar:/srv/gump/public/workspace/ant/dist/lib/ant-swing.jar:/srv/gump/public/workspace/ant/dist/lib/ant-apache-resolver.jar:/srv/gump/public/workspace/ant/dist/lib/ant-apache-xalan2.jar:/srv/gump/public/workspace/commons-compress/target/commons-compress-1.11-SNAPSHOT.jar:/srv/gump/public/workspace/xz-java/build/jar-20160314/xz.jar:/srv/gump/public/workspace/antlibs-antunit/build/ant-antunit-20160314.jar:/srv/gump/public/workspace/xml-commons/java/external/build/xml-apis-ext.jar
---------------------------------------------
[au:antunit] Target: testWithDirectories took 0.051 sec
[au:antunit] Target: testFullpath took 0.049 sec
[au:antunit] Target: testPreserve0Permissions took 0.05 sec
[au:antunit] Target: testForceCreateOfUpToDate took 4.267 sec
[au:antunit] Target: testNoDirectoriesByDefault took 0.028 sec
[au:antunit] Target: testPlainFileSet took 0.014 sec
[au:antunit] Target: testReplaceOfUpToDate took 4.012 sec
[au:antunit] Target: testCoreZipFileSet  FAILED
[au:antunit] 	at line 35, column 24
[au:antunit] 	Message: Assertion failed
[au:antunit] 	took 0.019 sec
[au:antunit] Target: testAntlibTarFileSet took 0.022 sec
[au:antunit] Target: testCreateOfOutOfDate took 4.037 sec
[au:antunit] Target: testFileSetPermissionsWin took 0.024 sec
[au:antunit] Target: testAddDuplicates took 0.022 sec
[au:antunit] Target: testRemoveLeadingSlashes took 0.023 sec
[au:antunit] Target: testPrefixWithSlash took 0.027 sec
[au:antunit] Target: testWithImplicitDirectories took 0.032 sec
[au:antunit] Target: testForceReplaceOfUpToDate took 4.039 sec
[au:antunit] Target: test0PermissionsGetReplaced took 0.02 sec
[au:antunit] Target: testFailDuplicates took 0.003 sec
[au:antunit] Build File: /srv/gump/public/workspace/antlibs-compress/src/tests/antunit/zipentry-test.xml
[au:antunit] Tests run: 3, Failures: 1, Errors: 0, Time elapsed: 0.039 sec
[au:antunit] Target: testResourceProperties  FAILED
[au:antunit] 	at line 59, column 20
[au:antunit] 	Message: Assertion failed
[au:antunit] 	took 0.017 sec
[au:antunit] Target: testUncompressSource took 0.007 sec
[au:antunit] Target: testZipSource took 0.004 sec
[au:antunit] Build File: /srv/gump/public/workspace/antlibs-compress/src/tests/antunit/zipfileset-test.xml
[au:antunit] Tests run: 9, Failures: 0, Errors: 0, Time elapsed: 0.597 sec
[au:antunit] Target: testSkipUnreadableEntries took 0.013 sec
[au:antunit] Target: testMissingArchive took 0.002 sec
[au:antunit] Target: testUncompressSource took 0.012 sec
[au:antunit] Target: test-refid-check-encoding took 0.009 sec
[au:antunit] Target: testZipSource took 0.409 sec
[au:antunit] Target: test-refid-modify took 0.095 sec
[au:antunit] Target: test-refid-check-prefix took 0.003 sec
[au:antunit] Target: testMissingArchiveDoesntMatter took 0.003 sec
[au:antunit] Target: testFailsOnUnreadableEntries took 0.008 sec
[au:antunit] Build File: /srv/gump/public/workspace/antlibs-compress/src/tests/antunit/zresource-test.xml
[au:antunit] Tests run: 1, Failures: 0, Errors: 0, Time elapsed: 0.018 sec
[au:antunit] Target: testNativeZ took 0.016 sec

test:

BUILD FAILED
/srv/gump/public/workspace/antlibs-compress/common/build.xml:209: At least one AntUnit test
has failed.

Total time: 5 minutes 47 seconds
---------------------------------------------

To subscribe to this information via syndicated feeds:
- RSS: http://vmgump.apache.org/gump/public/antlibs-compress/compress-antlib-test/rss.xml
- Atom: http://vmgump.apache.org/gump/public/antlibs-compress/compress-antlib-test/atom.xml

============================== Gump Tracking Only ===
Produced by Apache Gump(TM) version 2.3.
Gump Run 20160314000015, vmgump.apache.org:vmgump:20160314000015
Gump E-mail Identifier (unique within run) #2.

*********************************************************** G U M P
[GUMP@vmgump]: Module commons-lang-trunk failed
To whom it may engage...
        
This is an automated request, but not an unsolicited one. For 
more information please visit http://gump.apache.org/nagged.html, 
and/or contact the folk at general@gump.apache.org.

Module commons-lang-trunk has an issue affecting its community integration,
 and has been outstanding for 84 runs.
The current state of this module is 'Failed', with reason 'Update Failed'.

Full details are available at:
    http://vmgump.apache.org/gump/public/commons-lang-trunk/index.html

That said, some information snippets are provided here.

The following annotations (debug/informational/warning/error messages) were provided:
 -INFO- Failed with reason update failed



The following work was performed:
http://vmgump.apache.org/gump/public/commons-lang-trunk/gump_work/update_commons-lang-trunk.html
Work Name: update_commons-lang-trunk (Type: Update)
Work ended in a state of : Failed
Elapsed: 3 secs
Command Line: git pull --quiet http://git-wip-us.apache.org/repos/asf//commons-lang.git master

[Working Directory: /srv/gump/public/workspace/cvs/commons-lang-trunk]
---------------------------------------------
error: Your local changes to the following files would be overwritten by merge:
	NOTICE.txt
Please, commit your changes or stash them before you can merge.
Aborting
---------------------------------------------

To subscribe to this information via syndicated feeds:
- RSS: http://vmgump.apache.org/gump/public/commons-lang-trunk/rss.xml
- Atom: http://vmgump.apache.org/gump/public/commons-lang-trunk/atom.xml

============================== Gump Tracking Only ===
Produced by Apache Gump(TM) version 2.3.
Gump Run 20160314000015, vmgump.apache.org:vmgump:20160314000015
Gump E-mail Identifier (unique within run) #3.

*********************************************************** G U M P
[GUMP@vmgump]: Project commons-lang3 (in module commons-lang-trunk) failed
To whom it may engage...
        
This is an automated request, but not an unsolicited one. For 
more information please visit http://gump.apache.org/nagged.html, 
and/or contact the folk at general@gump.apache.org.

Project commons-lang3 has an issue affecting its community integration,
 and has been outstanding for 84 runs.
The current state of this project is 'Failed', with reason 'Update Failed'.

Full details are available at:
    http://vmgump.apache.org/gump/public/commons-lang-trunk/commons-lang3/index.html

That said, some information snippets are provided here.

The following annotations (debug/informational/warning/error messages) were provided:
 -DEBUG- Sole jar output [commons-lang3-*[0-9T].jar] identifier set to project name
 -DEBUG- Sole pom output [pom.xml] identifier set to project name
 -INFO- Failed with reason update failed
 -INFO- Failed to extract fallback artifacts from Gump Repository

To subscribe to this information via syndicated feeds:
- RSS: http://vmgump.apache.org/gump/public/commons-lang-trunk/commons-lang3/rss.xml
- Atom: http://vmgump.apache.org/gump/public/commons-lang-trunk/commons-lang3/atom.xml

============================== Gump Tracking Only ===
Produced by Apache Gump(TM) version 2.3.
Gump Run 20160314000015, vmgump.apache.org:vmgump:20160314000015
Gump E-mail Identifier (unique within run) #4.


--
Apache Gump
http://gump.apache.org/ [Instance: vmgump]

---------------------------------------------------------------------
To unsubscribe, e-mail: general-unsubscribe@gump.apache.org
For additional commands, e-mail: general-help@gump.apache.org


Mime
View raw message