gump-general mailing list archives

Site index · List index
Message view « Date » · « Thread »
Top « Date » · « Thread »
From g...@vmgump.apache.org
Subject BATCH: All dressed up, with nowhere to go...
Date Sat, 13 Feb 2016 06:06:51 GMT
Dear Gumpmeisters,
            
The following 4 notifys should have been sent

*********************************************************** G U M P
[GUMP@vmgump]: Project openssl-make-test (in module openssl-master) failed
[GUMP@vmgump]: Project compress-antlib-test (in module antlibs-compress) failed
[GUMP@vmgump]: Module commons-lang-trunk failed
[GUMP@vmgump]: Project commons-lang3 (in module commons-lang-trunk) failed
*********************************************************** G U M P
[GUMP@vmgump]: Project openssl-make-test (in module openssl-master) failed
To whom it may engage...
        
This is an automated request, but not an unsolicited one. For 
more information please visit http://gump.apache.org/nagged.html, 
and/or contact the folk at general@gump.apache.org.

Project openssl-make-test has an issue affecting its community integration.
This issue affects 10 projects,
 and has been outstanding for 13 runs.
The current state of this project is 'Failed', with reason 'Build Failed'.
For reference only, the following projects are affected by this:
    - openssl-make-install :  OpenSSL Encryption Library
    - openssl-make-test :  OpenSSL Encryption Library
    - tomcat-native-configure :  Tomcat native library using Apache Portable Runtime
    - tomcat-native-make :  Tomcat native library using Apache Portable Runtime
    - tomcat-native-make-install :  Tomcat native library using Apache Portable Runtime
    - tomcat-tc7.0.x-test-apr :  Tomcat 7.x, a web server implementing Java Servlet 3.0,
    ...
    - tomcat-tc8.0.x-test-apr :  Tomcat 8.x, a web server implementing the Java Servlet 3.1,
...
    - tomcat-trunk-test-apr :  Tomcat 9.x, a web server implementing the Java Servlet 4.0,
...
    - tomcat-trunk-test-nio :  Tomcat 9.x, a web server implementing the Java Servlet 4.0,
...
    - tomcat-trunk-test-nio2 :  Tomcat 9.x, a web server implementing the Java Servlet 4.0,
...


Full details are available at:
    http://vmgump.apache.org/gump/public/openssl-master/openssl-make-test/index.html

That said, some information snippets are provided here.

The following annotations (debug/informational/warning/error messages) were provided:
 -INFO- Failed with reason build failed



The following work was performed:
http://vmgump.apache.org/gump/public/openssl-master/openssl-make-test/gump_work/build_openssl-master_openssl-make-test.html
Work Name: build_openssl-master_openssl-make-test (Type: Build)
Work ended in a state of : Failed
Elapsed: 2 mins 24 secs
Command Line: make test 
[Working Directory: /srv/gump/public/workspace/openssl-master]
---------------------------------------------
    
    #   Failed test 'ServerHello extension extended master secret check'
    #   at ../test/recipes/70-test_tlsextms.t line 259.
    # Looks like you failed 3 tests of 4.

#   Failed test 'Session resumption extended master secret test'
#   at ../test/recipes/70-test_tlsextms.t line 265.
# Looks like you failed 2 tests of 9.
../test/recipes/70-test_tlsextms.t ........ 
Dubious, test returned 2 (wstat 512, 0x200)
Failed 2/9 subtests 
../test/recipes/70-test_verify_extra.t .... ok
../test/recipes/80-test_ca.t .............. ok
../test/recipes/80-test_cms.t ............. ok
../test/recipes/80-test_dane.t ............ ok
../test/recipes/80-test_dtlsv1listen.t .... ok
../test/recipes/80-test_ocsp.t ............ ok
../test/recipes/80-test_ssl.t ............. ok
../test/recipes/80-test_tsa.t ............. ok
../test/recipes/90-test_async.t ........... ok
../test/recipes/90-test_constant_time.t ... ok
../test/recipes/90-test_gmdiff.t .......... ok
../test/recipes/90-test_heartbeat.t ....... skipped: heartbeats is not supported by this OpenSSL
build
../test/recipes/90-test_ige.t ............. ok
../test/recipes/90-test_jpake.t ........... skipped: jpake is not supported by this OpenSSL
build
../test/recipes/90-test_memleak.t ......... ok
../test/recipes/90-test_networking.t ...... ok
../test/recipes/90-test_np.t .............. ok
../test/recipes/90-test_p5_crpt2.t ........ ok
../test/recipes/90-test_secmem.t .......... ok
../test/recipes/90-test_srp.t ............. ok
../test/recipes/90-test_v3name.t .......... ok

Test Summary Report
-------------------
../test/recipes/70-test_sslextension.t  (Wstat: 256 Tests: 1 Failed: 1)
  Failed test:  1
  Non-zero exit status: 1
../test/recipes/70-test_sslsessiontick.t (Wstat: 256 Tests: 8 Failed: 1)
  Failed test:  6
  Non-zero exit status: 1
../test/recipes/70-test_tlsextms.t      (Wstat: 512 Tests: 9 Failed: 2)
  Failed tests:  2, 5
  Non-zero exit status: 2
Files=70, Tests=433, 142 wallclock secs ( 1.52 usr  0.31 sys + 97.94 cusr 31.65 csys = 131.42
CPU)
Result: FAIL
Failed 3/70 test programs. 4/433 subtests failed.
make[1]: *** [tests] Error 255
make[1]: Leaving directory `/srv/gump/public/workspace/openssl-master/test'
make: *** [tests] Error 2
---------------------------------------------

To subscribe to this information via syndicated feeds:
- RSS: http://vmgump.apache.org/gump/public/openssl-master/openssl-make-test/rss.xml
- Atom: http://vmgump.apache.org/gump/public/openssl-master/openssl-make-test/atom.xml

============================== Gump Tracking Only ===
Produced by Apache Gump(TM) version 2.3.
Gump Run 20160213000008, vmgump.apache.org:vmgump:20160213000008
Gump E-mail Identifier (unique within run) #1.

*********************************************************** G U M P
[GUMP@vmgump]: Project compress-antlib-test (in module antlibs-compress) failed
To whom it may engage...
        
This is an automated request, but not an unsolicited one. For 
more information please visit http://gump.apache.org/nagged.html, 
and/or contact the folk at general@gump.apache.org.

Project compress-antlib-test has an issue affecting its community integration.
This issue affects 1 projects,
 and has been outstanding for 18 runs.
The current state of this project is 'Failed', with reason 'Build Failed'.
For reference only, the following projects are affected by this:
    - compress-antlib-test :  The Apache Compress Antlib contains tasks and resources that...


Full details are available at:
    http://vmgump.apache.org/gump/public/antlibs-compress/compress-antlib-test/index.html

That said, some information snippets are provided here.

The following annotations (debug/informational/warning/error messages) were provided:
 -DEBUG- Dependency on ant exists, no need to add for property ant.home.
 -INFO- Failed with reason build failed



The following work was performed:
http://vmgump.apache.org/gump/public/antlibs-compress/compress-antlib-test/gump_work/build_antlibs-compress_compress-antlib-test.html
Work Name: build_antlibs-compress_compress-antlib-test (Type: Build)
Work ended in a state of : Failed
Elapsed: 4 mins 43 secs
Command Line: /usr/lib/jvm/java-8-oracle/bin/java -Djava.awt.headless=true -Dbuild.sysclasspath=only
-Xbootclasspath/p:/srv/gump/public/workspace/xml-xerces2/build/xercesImpl.jar:/srv/gump/public/workspace/xml-commons/java/external/build/xml-apis.jar
org.apache.tools.ant.Main -Dgump.merge=/srv/gump/public/gump/work/merge.xml -Dant.home=/srv/gump/public/workspace/ant/dist
test 
[Working Directory: /srv/gump/public/workspace/antlibs-compress]
CLASSPATH: /usr/lib/jvm/java-8-oracle/lib/tools.jar:/srv/gump/public/workspace/antlibs-compress/ivy/ivy.jar:/srv/gump/public/workspace/antlibs-compress/build/ant-compress-20160213.jar:/srv/gump/public/workspace/ant/dist/lib/ant.jar:/srv/gump/public/workspace/ant/dist/lib/ant-launcher.jar:/srv/gump/public/workspace/ant/dist/lib/ant-jmf.jar:/srv/gump/public/workspace/ant/dist/lib/ant-junit.jar:/srv/gump/public/workspace/ant/dist/lib/ant-junit4.jar:/srv/gump/public/workspace/ant/dist/lib/ant-swing.jar:/srv/gump/public/workspace/ant/dist/lib/ant-apache-resolver.jar:/srv/gump/public/workspace/ant/dist/lib/ant-apache-xalan2.jar:/srv/gump/public/workspace/commons-compress/target/commons-compress-1.11-SNAPSHOT.jar:/srv/gump/public/workspace/xz-java/build/jar-20160213/xz.jar:/srv/gump/public/workspace/antlibs-antunit/build/ant-antunit-20160213.jar:/srv/gump/public/workspace/xml-commons/java/external/build/xml-apis-ext.jar
---------------------------------------------
[au:antunit] Target: testWithDirectories took 0.024 sec
[au:antunit] Target: testFullpath took 0.026 sec
[au:antunit] Target: testPreserve0Permissions took 0.028 sec
[au:antunit] Target: testForceCreateOfUpToDate took 4.027 sec
[au:antunit] Target: testNoDirectoriesByDefault took 0.03 sec
[au:antunit] Target: testPlainFileSet took 0.028 sec
[au:antunit] Target: testReplaceOfUpToDate took 4.022 sec
[au:antunit] Target: testCoreZipFileSet  FAILED
[au:antunit] 	at line 35, column 24
[au:antunit] 	Message: Assertion failed
[au:antunit] 	took 0.145 sec
[au:antunit] Target: testAntlibTarFileSet took 0.021 sec
[au:antunit] Target: testCreateOfOutOfDate took 4.03 sec
[au:antunit] Target: testFileSetPermissionsWin took 0.025 sec
[au:antunit] Target: testAddDuplicates took 0.012 sec
[au:antunit] Target: testRemoveLeadingSlashes took 0.019 sec
[au:antunit] Target: testPrefixWithSlash took 0.013 sec
[au:antunit] Target: testWithImplicitDirectories took 0.015 sec
[au:antunit] Target: testForceReplaceOfUpToDate took 4.027 sec
[au:antunit] Target: test0PermissionsGetReplaced took 0.023 sec
[au:antunit] Target: testFailDuplicates took 0.092 sec
[au:antunit] Build File: /srv/gump/public/workspace/antlibs-compress/src/tests/antunit/zipentry-test.xml
[au:antunit] Tests run: 3, Failures: 1, Errors: 0, Time elapsed: 0.05 sec
[au:antunit] Target: testResourceProperties  FAILED
[au:antunit] 	at line 59, column 20
[au:antunit] 	Message: Assertion failed
[au:antunit] 	took 0.016 sec
[au:antunit] Target: testUncompressSource took 0.006 sec
[au:antunit] Target: testZipSource took 0.02 sec
[au:antunit] Build File: /srv/gump/public/workspace/antlibs-compress/src/tests/antunit/zipfileset-test.xml
[au:antunit] Tests run: 9, Failures: 0, Errors: 0, Time elapsed: 0.14 sec
[au:antunit] Target: testSkipUnreadableEntries took 0.009 sec
[au:antunit] Target: testMissingArchive took 0.002 sec
[au:antunit] Target: testUncompressSource took 0.012 sec
[au:antunit] Target: test-refid-check-encoding took 0.002 sec
[au:antunit] Target: testZipSource took 0.011 sec
[au:antunit] Target: test-refid-modify took 0.06 sec
[au:antunit] Target: test-refid-check-prefix took 0.003 sec
[au:antunit] Target: testMissingArchiveDoesntMatter took 0.003 sec
[au:antunit] Target: testFailsOnUnreadableEntries took 0.01 sec
[au:antunit] Build File: /srv/gump/public/workspace/antlibs-compress/src/tests/antunit/zresource-test.xml
[au:antunit] Tests run: 1, Failures: 0, Errors: 0, Time elapsed: 0.013 sec
[au:antunit] Target: testNativeZ took 0.012 sec

test:

BUILD FAILED
/srv/gump/public/workspace/antlibs-compress/common/build.xml:209: At least one AntUnit test
has failed.

Total time: 4 minutes 42 seconds
---------------------------------------------

To subscribe to this information via syndicated feeds:
- RSS: http://vmgump.apache.org/gump/public/antlibs-compress/compress-antlib-test/rss.xml
- Atom: http://vmgump.apache.org/gump/public/antlibs-compress/compress-antlib-test/atom.xml

============================== Gump Tracking Only ===
Produced by Apache Gump(TM) version 2.3.
Gump Run 20160213000008, vmgump.apache.org:vmgump:20160213000008
Gump E-mail Identifier (unique within run) #2.

*********************************************************** G U M P
[GUMP@vmgump]: Module commons-lang-trunk failed
To whom it may engage...
        
This is an automated request, but not an unsolicited one. For 
more information please visit http://gump.apache.org/nagged.html, 
and/or contact the folk at general@gump.apache.org.

Module commons-lang-trunk has an issue affecting its community integration,
 and has been outstanding for 25 runs.
The current state of this module is 'Failed', with reason 'Update Failed'.

Full details are available at:
    http://vmgump.apache.org/gump/public/commons-lang-trunk/index.html

That said, some information snippets are provided here.

The following annotations (debug/informational/warning/error messages) were provided:
 -INFO- Failed with reason update failed



The following work was performed:
http://vmgump.apache.org/gump/public/commons-lang-trunk/gump_work/update_commons-lang-trunk.html
Work Name: update_commons-lang-trunk (Type: Update)
Work ended in a state of : Failed
Elapsed: 1 sec
Command Line: git pull --quiet http://git-wip-us.apache.org/repos/asf//commons-lang.git master

[Working Directory: /srv/gump/public/workspace/cvs/commons-lang-trunk]
---------------------------------------------
error: Your local changes to the following files would be overwritten by merge:
	NOTICE.txt
Please, commit your changes or stash them before you can merge.
Aborting
---------------------------------------------

To subscribe to this information via syndicated feeds:
- RSS: http://vmgump.apache.org/gump/public/commons-lang-trunk/rss.xml
- Atom: http://vmgump.apache.org/gump/public/commons-lang-trunk/atom.xml

============================== Gump Tracking Only ===
Produced by Apache Gump(TM) version 2.3.
Gump Run 20160213000008, vmgump.apache.org:vmgump:20160213000008
Gump E-mail Identifier (unique within run) #3.

*********************************************************** G U M P
[GUMP@vmgump]: Project commons-lang3 (in module commons-lang-trunk) failed
To whom it may engage...
        
This is an automated request, but not an unsolicited one. For 
more information please visit http://gump.apache.org/nagged.html, 
and/or contact the folk at general@gump.apache.org.

Project commons-lang3 has an issue affecting its community integration,
 and has been outstanding for 25 runs.
The current state of this project is 'Failed', with reason 'Update Failed'.

Full details are available at:
    http://vmgump.apache.org/gump/public/commons-lang-trunk/commons-lang3/index.html

That said, some information snippets are provided here.

The following annotations (debug/informational/warning/error messages) were provided:
 -DEBUG- Sole jar output [commons-lang3-*[0-9T].jar] identifier set to project name
 -DEBUG- Sole pom output [pom.xml] identifier set to project name
 -INFO- Failed with reason update failed
 -INFO- Failed to extract fallback artifacts from Gump Repository

To subscribe to this information via syndicated feeds:
- RSS: http://vmgump.apache.org/gump/public/commons-lang-trunk/commons-lang3/rss.xml
- Atom: http://vmgump.apache.org/gump/public/commons-lang-trunk/commons-lang3/atom.xml

============================== Gump Tracking Only ===
Produced by Apache Gump(TM) version 2.3.
Gump Run 20160213000008, vmgump.apache.org:vmgump:20160213000008
Gump E-mail Identifier (unique within run) #4.


--
Apache Gump
http://gump.apache.org/ [Instance: vmgump]

---------------------------------------------------------------------
To unsubscribe, e-mail: general-unsubscribe@gump.apache.org
For additional commands, e-mail: general-help@gump.apache.org


Mime
View raw message