gump-general mailing list archives

Site index · List index
Message view « Date » · « Thread »
Top « Date » · « Thread »
From g...@vmgump.apache.org
Subject BATCH: All dressed up, with nowhere to go...
Date Sat, 06 Feb 2016 06:14:23 GMT
Dear Gumpmeisters,
            
The following 4 notifys should have been sent

*********************************************************** G U M P
[GUMP@vmgump]: Project openssl-make (in module openssl-master) failed
[GUMP@vmgump]: Project compress-antlib-test (in module antlibs-compress) failed
[GUMP@vmgump]: Module commons-lang-trunk failed
[GUMP@vmgump]: Project commons-lang3 (in module commons-lang-trunk) failed
*********************************************************** G U M P
[GUMP@vmgump]: Project openssl-make (in module openssl-master) failed
To whom it may engage...
        
This is an automated request, but not an unsolicited one. For 
more information please visit http://gump.apache.org/nagged.html, 
and/or contact the folk at general@gump.apache.org.

Project openssl-make has an issue affecting its community integration.
This issue affects 11 projects,
 and has been outstanding for 57 runs.
The current state of this project is 'Failed', with reason 'Build Failed'.
For reference only, the following projects are affected by this:
    - openssl-make :  OpenSSL Encryption Library
    - openssl-make-install :  OpenSSL Encryption Library
    - openssl-make-test :  OpenSSL Encryption Library
    - tomcat-native-configure :  Tomcat native library using Apache Portable Runtime
    - tomcat-native-make :  Tomcat native library using Apache Portable Runtime
    - tomcat-native-make-install :  Tomcat native library using Apache Portable Runtime
    - tomcat-tc7.0.x-test-apr :  Tomcat 7.x, a web server implementing Java Servlet 3.0,
    ...
    - tomcat-tc8.0.x-test-apr :  Tomcat 8.x, a web server implementing the Java Servlet 3.1,
...
    - tomcat-trunk-test-apr :  Tomcat 9.x, a web server implementing the Java Servlet 4.0,
...
    - tomcat-trunk-test-nio :  Tomcat 9.x, a web server implementing the Java Servlet 4.0,
...
    - tomcat-trunk-test-nio2 :  Tomcat 9.x, a web server implementing the Java Servlet 4.0,
...


Full details are available at:
    http://vmgump.apache.org/gump/public/openssl-master/openssl-make/index.html

That said, some information snippets are provided here.

The following annotations (debug/informational/warning/error messages) were provided:
 -INFO- Failed with reason build failed



The following work was performed:
http://vmgump.apache.org/gump/public/openssl-master/openssl-make/gump_work/build_openssl-master_openssl-make.html
Work Name: build_openssl-master_openssl-make (Type: Build)
Work ended in a state of : Failed
Elapsed: 4 mins
Command Line: make 
[Working Directory: /srv/gump/public/workspace/openssl-master]
---------------------------------------------
make[2]: Leaving directory `/srv/gump/public/workspace/openssl-master/crypto/srp'
making all in crypto/cmac...
make[2]: Entering directory `/srv/gump/public/workspace/openssl-master/crypto/cmac'
gcc -I.. -I../.. -I../modes -I../include -I../../include  -fPIC -DOPENSSL_PIC -DOPENSSL_THREADS
-pthread -DDSO_DLFCN -DHAVE_DLFCN_H -Wa,--noexecstack -m64 -DL_ENDIAN -Wall -O3 -DOPENSSL_IA32_SSE2
-DOPENSSL_BN_ASM_MONT -DOPENSSL_BN_ASM_MONT5 -DOPENSSL_BN_ASM_GF2m -DSHA1_ASM -DSHA256_ASM
-DSHA512_ASM -DMD5_ASM -DAES_ASM -DVPAES_ASM -DBSAES_ASM -DGHASH_ASM -DECP_NISTZ256_ASM  
-c -o cmac.o cmac.c
gcc -I.. -I../.. -I../modes -I../include -I../../include  -fPIC -DOPENSSL_PIC -DOPENSSL_THREADS
-pthread -DDSO_DLFCN -DHAVE_DLFCN_H -Wa,--noexecstack -m64 -DL_ENDIAN -Wall -O3 -DOPENSSL_IA32_SSE2
-DOPENSSL_BN_ASM_MONT -DOPENSSL_BN_ASM_MONT5 -DOPENSSL_BN_ASM_GF2m -DSHA1_ASM -DSHA256_ASM
-DSHA512_ASM -DMD5_ASM -DAES_ASM -DVPAES_ASM -DBSAES_ASM -DGHASH_ASM -DECP_NISTZ256_ASM  
-c -o cm_ameth.o cm_ameth.c
gcc -I.. -I../.. -I../modes -I../include -I../../include  -fPIC -DOPENSSL_PIC -DOPENSSL_THREADS
-pthread -DDSO_DLFCN -DHAVE_DLFCN_H -Wa,--noexecstack -m64 -DL_ENDIAN -Wall -O3 -DOPENSSL_IA32_SSE2
-DOPENSSL_BN_ASM_MONT -DOPENSSL_BN_ASM_MONT5 -DOPENSSL_BN_ASM_GF2m -DSHA1_ASM -DSHA256_ASM
-DSHA512_ASM -DMD5_ASM -DAES_ASM -DVPAES_ASM -DBSAES_ASM -DGHASH_ASM -DECP_NISTZ256_ASM  
-c -o cm_pmeth.o cm_pmeth.c
ar  r ../../libcrypto.a cmac.o cm_ameth.o cm_pmeth.o
/usr/bin/ranlib ../../libcrypto.a || echo Never mind.
make[2]: Leaving directory `/srv/gump/public/workspace/openssl-master/crypto/cmac'
making all in crypto/ct...
make[2]: Entering directory `/srv/gump/public/workspace/openssl-master/crypto/ct'
gcc -I.. -I../.. -I../modes -I../include -I../../include  -fPIC -DOPENSSL_PIC -DOPENSSL_THREADS
-pthread -DDSO_DLFCN -DHAVE_DLFCN_H -Wa,--noexecstack -m64 -DL_ENDIAN -Wall -O3 -DOPENSSL_IA32_SSE2
-DOPENSSL_BN_ASM_MONT -DOPENSSL_BN_ASM_MONT5 -DOPENSSL_BN_ASM_GF2m -DSHA1_ASM -DSHA256_ASM
-DSHA512_ASM -DMD5_ASM -DAES_ASM -DVPAES_ASM -DBSAES_ASM -DGHASH_ASM -DECP_NISTZ256_ASM  
-c -o ct_lib.o ct_lib.c
gcc -I.. -I../.. -I../modes -I../include -I../../include  -fPIC -DOPENSSL_PIC -DOPENSSL_THREADS
-pthread -DDSO_DLFCN -DHAVE_DLFCN_H -Wa,--noexecstack -m64 -DL_ENDIAN -Wall -O3 -DOPENSSL_IA32_SSE2
-DOPENSSL_BN_ASM_MONT -DOPENSSL_BN_ASM_MONT5 -DOPENSSL_BN_ASM_GF2m -DSHA1_ASM -DSHA256_ASM
-DSHA512_ASM -DMD5_ASM -DAES_ASM -DVPAES_ASM -DBSAES_ASM -DGHASH_ASM -DECP_NISTZ256_ASM  
-c -o ct_err.o ct_err.c
ar  r ../../libcrypto.a ct_lib.o ct_err.o
/usr/bin/ranlib ../../libcrypto.a || echo Never mind.
make[2]: Leaving directory `/srv/gump/public/workspace/openssl-master/crypto/ct'
making all in crypto/async...
make[2]: Entering directory `/srv/gump/public/workspace/openssl-master/crypto/async'
gcc -I.. -I../.. -I../modes -I../include -I../../include  -fPIC -DOPENSSL_PIC -DOPENSSL_THREADS
-pthread -DDSO_DLFCN -DHAVE_DLFCN_H -Wa,--noexecstack -m64 -DL_ENDIAN -Wall -O3 -DOPENSSL_IA32_SSE2
-DOPENSSL_BN_ASM_MONT -DOPENSSL_BN_ASM_MONT5 -DOPENSSL_BN_ASM_GF2m -DSHA1_ASM -DSHA256_ASM
-DSHA512_ASM -DMD5_ASM -DAES_ASM -DVPAES_ASM -DBSAES_ASM -DGHASH_ASM -DECP_NISTZ256_ASM -c
async.c -o async.o
gcc -I.. -I../.. -I../modes -I../include -I../../include  -fPIC -DOPENSSL_PIC -DOPENSSL_THREADS
-pthread -DDSO_DLFCN -DHAVE_DLFCN_H -Wa,--noexecstack -m64 -DL_ENDIAN -Wall -O3 -DOPENSSL_IA32_SSE2
-DOPENSSL_BN_ASM_MONT -DOPENSSL_BN_ASM_MONT5 -DOPENSSL_BN_ASM_GF2m -DSHA1_ASM -DSHA256_ASM
-DSHA512_ASM -DMD5_ASM -DAES_ASM -DVPAES_ASM -DBSAES_ASM -DGHASH_ASM -DECP_NISTZ256_ASM -c
async_err.c -o async_err.o
gcc -I.. -I../.. -I../modes -I../include -I../../include  -fPIC -DOPENSSL_PIC -DOPENSSL_THREADS
-pthread -DDSO_DLFCN -DHAVE_DLFCN_H -Wa,--noexecstack -m64 -DL_ENDIAN -Wall -O3 -DOPENSSL_IA32_SSE2
-DOPENSSL_BN_ASM_MONT -DOPENSSL_BN_ASM_MONT5 -DOPENSSL_BN_ASM_GF2m -DSHA1_ASM -DSHA256_ASM
-DSHA512_ASM -DMD5_ASM -DAES_ASM -DVPAES_ASM -DBSAES_ASM -DGHASH_ASM -DECP_NISTZ256_ASM -c
arch/async_posix.c -o arch/async_posix.o
gcc -I.. -I../.. -I../modes -I../include -I../../include  -fPIC -DOPENSSL_PIC -DOPENSSL_THREADS
-pthread -DDSO_DLFCN -DHAVE_DLFCN_H -Wa,--noexecstack -m64 -DL_ENDIAN -Wall -O3 -DOPENSSL_IA32_SSE2
-DOPENSSL_BN_ASM_MONT -DOPENSSL_BN_ASM_MONT5 -DOPENSSL_BN_ASM_GF2m -DSHA1_ASM -DSHA256_ASM
-DSHA512_ASM -DMD5_ASM -DAES_ASM -DVPAES_ASM -DBSAES_ASM -DGHASH_ASM -DECP_NISTZ256_ASM -c
arch/async_win.c -o arch/async_win.o
gcc -I.. -I../.. -I../modes -I../include -I../../include  -fPIC -DOPENSSL_PIC -DOPENSSL_THREADS
-pthread -DDSO_DLFCN -DHAVE_DLFCN_H -Wa,--noexecstack -m64 -DL_ENDIAN -Wall -O3 -DOPENSSL_IA32_SSE2
-DOPENSSL_BN_ASM_MONT -DOPENSSL_BN_ASM_MONT5 -DOPENSSL_BN_ASM_GF2m -DSHA1_ASM -DSHA256_ASM
-DSHA512_ASM -DMD5_ASM -DAES_ASM -DVPAES_ASM -DBSAES_ASM -DGHASH_ASM -DECP_NISTZ256_ASM -c
arch/async_null.c -o arch/async_null.o
ar  r ../../libcrypto.a async.o async_err.o arch/async_posix.o arch/async_win.o arch/async_null.o
/usr/bin/ranlib ../../libcrypto.a || echo Never mind.
make[2]: Leaving directory `/srv/gump/public/workspace/openssl-master/crypto/async'
making all in crypto/kdf...
make[2]: Entering directory `/srv/gump/public/workspace/openssl-master/crypto/kdf'
gcc -I.. -I../.. -I../modes -I../include -I../../include  -fPIC -DOPENSSL_PIC -DOPENSSL_THREADS
-pthread -DDSO_DLFCN -DHAVE_DLFCN_H -Wa,--noexecstack -m64 -DL_ENDIAN -Wall -O3 -DOPENSSL_IA32_SSE2
-DOPENSSL_BN_ASM_MONT -DOPENSSL_BN_ASM_MONT5 -DOPENSSL_BN_ASM_GF2m -DSHA1_ASM -DSHA256_ASM
-DSHA512_ASM -DMD5_ASM -DAES_ASM -DVPAES_ASM -DBSAES_ASM -DGHASH_ASM -DECP_NISTZ256_ASM  
-c -o tls1_prf.o tls1_prf.c
ar  r ../../libcrypto.a tls1_prf.o
/usr/bin/ranlib ../../libcrypto.a || echo Never mind.
make[2]: Leaving directory `/srv/gump/public/workspace/openssl-master/crypto/kdf'
if [ -n "libcrypto.so.1.1 libssl.so.1.1" ]; then \
		(cd ..; make libcrypto.so.1.1); \
	fi
make[2]: Entering directory `/srv/gump/public/workspace/openssl-master'
make[3]: Entering directory `/srv/gump/public/workspace/openssl-master'
make[4]: Entering directory `/srv/gump/public/workspace/openssl-master'
Error: BIO_ADDR_clear does not have a number assigned
/usr/bin/ld:crypto.map:244: syntax error in VERSION script
collect2: error: ld returned 1 exit status
make[4]: *** [link_a.linux-shared] Error 1
make[4]: Leaving directory `/srv/gump/public/workspace/openssl-master'
make[3]: *** [do_linux-shared] Error 2
make[3]: Leaving directory `/srv/gump/public/workspace/openssl-master'
make[2]: *** [libcrypto.so.1.1] Error 2
make[2]: Leaving directory `/srv/gump/public/workspace/openssl-master'
make[1]: *** [shared] Error 2
make[1]: Leaving directory `/srv/gump/public/workspace/openssl-master/crypto'
make: *** [build_crypto] Error 1
---------------------------------------------

To subscribe to this information via syndicated feeds:
- RSS: http://vmgump.apache.org/gump/public/openssl-master/openssl-make/rss.xml
- Atom: http://vmgump.apache.org/gump/public/openssl-master/openssl-make/atom.xml

============================== Gump Tracking Only ===
Produced by Apache Gump(TM) version 2.3.
Gump Run 20160206000008, vmgump.apache.org:vmgump:20160206000008
Gump E-mail Identifier (unique within run) #1.

*********************************************************** G U M P
[GUMP@vmgump]: Project compress-antlib-test (in module antlibs-compress) failed
To whom it may engage...
        
This is an automated request, but not an unsolicited one. For 
more information please visit http://gump.apache.org/nagged.html, 
and/or contact the folk at general@gump.apache.org.

Project compress-antlib-test has an issue affecting its community integration.
This issue affects 1 projects,
 and has been outstanding for 3 runs.
The current state of this project is 'Failed', with reason 'Build Failed'.
For reference only, the following projects are affected by this:
    - compress-antlib-test :  The Apache Compress Antlib contains tasks and resources that...


Full details are available at:
    http://vmgump.apache.org/gump/public/antlibs-compress/compress-antlib-test/index.html

That said, some information snippets are provided here.

The following annotations (debug/informational/warning/error messages) were provided:
 -DEBUG- Dependency on ant exists, no need to add for property ant.home.
 -INFO- Failed with reason build failed



The following work was performed:
http://vmgump.apache.org/gump/public/antlibs-compress/compress-antlib-test/gump_work/build_antlibs-compress_compress-antlib-test.html
Work Name: build_antlibs-compress_compress-antlib-test (Type: Build)
Work ended in a state of : Failed
Elapsed: 5 mins 45 secs
Command Line: /usr/lib/jvm/java-8-oracle/bin/java -Djava.awt.headless=true -Dbuild.sysclasspath=only
-Xbootclasspath/p:/srv/gump/public/workspace/xml-xerces2/build/xercesImpl.jar:/srv/gump/public/workspace/xml-commons/java/external/build/xml-apis.jar
org.apache.tools.ant.Main -Dgump.merge=/srv/gump/public/gump/work/merge.xml -Dant.home=/srv/gump/public/workspace/ant/dist
test 
[Working Directory: /srv/gump/public/workspace/antlibs-compress]
CLASSPATH: /usr/lib/jvm/java-8-oracle/lib/tools.jar:/srv/gump/public/workspace/antlibs-compress/ivy/ivy.jar:/srv/gump/public/workspace/antlibs-compress/build/ant-compress-20160206.jar:/srv/gump/public/workspace/ant/dist/lib/ant.jar:/srv/gump/public/workspace/ant/dist/lib/ant-launcher.jar:/srv/gump/public/workspace/ant/dist/lib/ant-jmf.jar:/srv/gump/public/workspace/ant/dist/lib/ant-junit.jar:/srv/gump/public/workspace/ant/dist/lib/ant-junit4.jar:/srv/gump/public/workspace/ant/dist/lib/ant-swing.jar:/srv/gump/public/workspace/ant/dist/lib/ant-apache-resolver.jar:/srv/gump/public/workspace/ant/dist/lib/ant-apache-xalan2.jar:/srv/gump/public/workspace/commons-compress/target/commons-compress-1.11-SNAPSHOT.jar:/srv/gump/public/workspace/xz-java/build/jar-20160206/xz.jar:/srv/gump/public/workspace/antlibs-antunit/build/ant-antunit-20160206.jar:/srv/gump/public/workspace/xml-commons/java/external/build/xml-apis-ext.jar
---------------------------------------------
[au:antunit] Target: testWithDirectories took 0.057 sec
[au:antunit] Target: testFullpath took 0.05 sec
[au:antunit] Target: testPreserve0Permissions took 0.056 sec
[au:antunit] Target: testForceCreateOfUpToDate took 4.049 sec
[au:antunit] Target: testNoDirectoriesByDefault took 0.019 sec
[au:antunit] Target: testPlainFileSet took 0.147 sec
[au:antunit] Target: testReplaceOfUpToDate took 4.017 sec
[au:antunit] Target: testCoreZipFileSet  FAILED
[au:antunit] 	at line 35, column 24
[au:antunit] 	Message: Assertion failed
[au:antunit] 	took 0.036 sec
[au:antunit] Target: testAntlibTarFileSet took 0.042 sec
[au:antunit] Target: testCreateOfOutOfDate took 4.068 sec
[au:antunit] Target: testFileSetPermissionsWin took 0.049 sec
[au:antunit] Target: testAddDuplicates took 0.031 sec
[au:antunit] Target: testRemoveLeadingSlashes took 0.037 sec
[au:antunit] Target: testPrefixWithSlash took 0.042 sec
[au:antunit] Target: testWithImplicitDirectories took 0.033 sec
[au:antunit] Target: testForceReplaceOfUpToDate took 4.048 sec
[au:antunit] Target: test0PermissionsGetReplaced took 0.026 sec
[au:antunit] Target: testFailDuplicates took 0.005 sec
[au:antunit] Build File: /srv/gump/public/workspace/antlibs-compress/src/tests/antunit/zipentry-test.xml
[au:antunit] Tests run: 3, Failures: 1, Errors: 0, Time elapsed: 0.036 sec
[au:antunit] Target: testResourceProperties  FAILED
[au:antunit] 	at line 59, column 20
[au:antunit] 	Message: Assertion failed
[au:antunit] 	took 0.012 sec
[au:antunit] Target: testUncompressSource took 0.006 sec
[au:antunit] Target: testZipSource took 0.007 sec
[au:antunit] Build File: /srv/gump/public/workspace/antlibs-compress/src/tests/antunit/zipfileset-test.xml
[au:antunit] Tests run: 9, Failures: 0, Errors: 0, Time elapsed: 0.135 sec
[au:antunit] Target: testSkipUnreadableEntries took 0.006 sec
[au:antunit] Target: testMissingArchive took 0.007 sec
[au:antunit] Target: testUncompressSource took 0.014 sec
[au:antunit] Target: test-refid-check-encoding took 0.007 sec
[au:antunit] Target: testZipSource took 0.007 sec
[au:antunit] Target: test-refid-modify took 0.053 sec
[au:antunit] Target: test-refid-check-prefix took 0.003 sec
[au:antunit] Target: testMissingArchiveDoesntMatter took 0.009 sec
[au:antunit] Target: testFailsOnUnreadableEntries took 0.007 sec
[au:antunit] Build File: /srv/gump/public/workspace/antlibs-compress/src/tests/antunit/zresource-test.xml
[au:antunit] Tests run: 1, Failures: 0, Errors: 0, Time elapsed: 0.016 sec
[au:antunit] Target: testNativeZ took 0.015 sec

test:

BUILD FAILED
/srv/gump/public/workspace/antlibs-compress/common/build.xml:209: At least one AntUnit test
has failed.

Total time: 5 minutes 44 seconds
---------------------------------------------

To subscribe to this information via syndicated feeds:
- RSS: http://vmgump.apache.org/gump/public/antlibs-compress/compress-antlib-test/rss.xml
- Atom: http://vmgump.apache.org/gump/public/antlibs-compress/compress-antlib-test/atom.xml

============================== Gump Tracking Only ===
Produced by Apache Gump(TM) version 2.3.
Gump Run 20160206000008, vmgump.apache.org:vmgump:20160206000008
Gump E-mail Identifier (unique within run) #2.

*********************************************************** G U M P
[GUMP@vmgump]: Module commons-lang-trunk failed
To whom it may engage...
        
This is an automated request, but not an unsolicited one. For 
more information please visit http://gump.apache.org/nagged.html, 
and/or contact the folk at general@gump.apache.org.

Module commons-lang-trunk has an issue affecting its community integration,
 and has been outstanding for 10 runs.
The current state of this module is 'Failed', with reason 'Update Failed'.

Full details are available at:
    http://vmgump.apache.org/gump/public/commons-lang-trunk/index.html

That said, some information snippets are provided here.

The following annotations (debug/informational/warning/error messages) were provided:
 -INFO- Failed with reason update failed



The following work was performed:
http://vmgump.apache.org/gump/public/commons-lang-trunk/gump_work/update_commons-lang-trunk.html
Work Name: update_commons-lang-trunk (Type: Update)
Work ended in a state of : Failed
Elapsed: 2 secs
Command Line: git pull --quiet http://git-wip-us.apache.org/repos/asf//commons-lang.git master

[Working Directory: /srv/gump/public/workspace/cvs/commons-lang-trunk]
---------------------------------------------
error: Your local changes to the following files would be overwritten by merge:
	NOTICE.txt
Please, commit your changes or stash them before you can merge.
Aborting
---------------------------------------------

To subscribe to this information via syndicated feeds:
- RSS: http://vmgump.apache.org/gump/public/commons-lang-trunk/rss.xml
- Atom: http://vmgump.apache.org/gump/public/commons-lang-trunk/atom.xml

============================== Gump Tracking Only ===
Produced by Apache Gump(TM) version 2.3.
Gump Run 20160206000008, vmgump.apache.org:vmgump:20160206000008
Gump E-mail Identifier (unique within run) #3.

*********************************************************** G U M P
[GUMP@vmgump]: Project commons-lang3 (in module commons-lang-trunk) failed
To whom it may engage...
        
This is an automated request, but not an unsolicited one. For 
more information please visit http://gump.apache.org/nagged.html, 
and/or contact the folk at general@gump.apache.org.

Project commons-lang3 has an issue affecting its community integration,
 and has been outstanding for 10 runs.
The current state of this project is 'Failed', with reason 'Update Failed'.

Full details are available at:
    http://vmgump.apache.org/gump/public/commons-lang-trunk/commons-lang3/index.html

That said, some information snippets are provided here.

The following annotations (debug/informational/warning/error messages) were provided:
 -DEBUG- Sole jar output [commons-lang3-*[0-9T].jar] identifier set to project name
 -DEBUG- Sole pom output [pom.xml] identifier set to project name
 -INFO- Failed with reason update failed
 -INFO- Failed to extract fallback artifacts from Gump Repository

To subscribe to this information via syndicated feeds:
- RSS: http://vmgump.apache.org/gump/public/commons-lang-trunk/commons-lang3/rss.xml
- Atom: http://vmgump.apache.org/gump/public/commons-lang-trunk/commons-lang3/atom.xml

============================== Gump Tracking Only ===
Produced by Apache Gump(TM) version 2.3.
Gump Run 20160206000008, vmgump.apache.org:vmgump:20160206000008
Gump E-mail Identifier (unique within run) #4.


--
Apache Gump
http://gump.apache.org/ [Instance: vmgump]

---------------------------------------------------------------------
To unsubscribe, e-mail: general-unsubscribe@gump.apache.org
For additional commands, e-mail: general-help@gump.apache.org


Mime
View raw message