gump-general mailing list archives

Site index · List index
Message view « Date » · « Thread »
Top « Date » · « Thread »
From g...@vmgump.apache.org
Subject BATCH: All dressed up, with nowhere to go...
Date Mon, 18 Jan 2016 03:07:42 GMT
Dear Gumpmeisters,
            
The following 4 notifys should have been sent

*********************************************************** G U M P
[GUMP@vmgump]: Project openssl-make-test (in module openssl-master) failed
[GUMP@vmgump]: Module forrest failed
[GUMP@vmgump]: Project easymock-parent (in module easymock) failed
[GUMP@vmgump]: Project compress-antlib-test (in module antlibs-compress) failed
*********************************************************** G U M P
[GUMP@vmgump]: Project openssl-make-test (in module openssl-master) failed
To whom it may engage...
        
This is an automated request, but not an unsolicited one. For 
more information please visit http://gump.apache.org/nagged.html, 
and/or contact the folk at general@gump.apache.org.

Project openssl-make-test has an issue affecting its community integration.
This issue affects 10 projects,
 and has been outstanding for 14 runs.
The current state of this project is 'Failed', with reason 'Build Failed'.
For reference only, the following projects are affected by this:
    - openssl-make-install :  OpenSSL Encryption Library
    - openssl-make-test :  OpenSSL Encryption Library
    - tomcat-native-configure :  Tomcat native library using Apache Portable Runtime
    - tomcat-native-make :  Tomcat native library using Apache Portable Runtime
    - tomcat-native-make-install :  Tomcat native library using Apache Portable Runtime
    - tomcat-tc7.0.x-test-apr :  Tomcat 7.x, a web server implementing Java Servlet 3.0,
    ...
    - tomcat-tc8.0.x-test-apr :  Tomcat 8.x, a web server implementing the Java Servlet 3.1,
...
    - tomcat-trunk-test-apr :  Tomcat 9.x, a web server implementing the Java Servlet 4.0,
...
    - tomcat-trunk-test-nio :  Tomcat 9.x, a web server implementing the Java Servlet 4.0,
...
    - tomcat-trunk-test-nio2 :  Tomcat 9.x, a web server implementing the Java Servlet 4.0,
...


Full details are available at:
    http://vmgump.apache.org/gump/public/openssl-master/openssl-make-test/index.html

That said, some information snippets are provided here.

The following annotations (debug/informational/warning/error messages) were provided:
 -INFO- Failed with reason build failed



The following work was performed:
http://vmgump.apache.org/gump/public/openssl-master/openssl-make-test/gump_work/build_openssl-master_openssl-make-test.html
Work Name: build_openssl-master_openssl-make-test (Type: Build)
Work ended in a state of : Failed
Elapsed: 
Command Line: make test 
[Working Directory: /srv/gump/public/workspace/openssl-master]
---------------------------------------------
make[2]: Nothing to be done for `all'.
make[2]: Leaving directory `/srv/gump/public/workspace/openssl-master/crypto/ts'
making all in crypto/srp...
make[2]: Entering directory `/srv/gump/public/workspace/openssl-master/crypto/srp'
make[2]: Nothing to be done for `all'.
make[2]: Leaving directory `/srv/gump/public/workspace/openssl-master/crypto/srp'
making all in crypto/cmac...
make[2]: Entering directory `/srv/gump/public/workspace/openssl-master/crypto/cmac'
make[2]: Nothing to be done for `all'.
make[2]: Leaving directory `/srv/gump/public/workspace/openssl-master/crypto/cmac'
making all in crypto/ct...
make[2]: Entering directory `/srv/gump/public/workspace/openssl-master/crypto/ct'
make[2]: Nothing to be done for `all'.
make[2]: Leaving directory `/srv/gump/public/workspace/openssl-master/crypto/ct'
making all in crypto/async...
make[2]: Entering directory `/srv/gump/public/workspace/openssl-master/crypto/async'
make[2]: Nothing to be done for `all'.
make[2]: Leaving directory `/srv/gump/public/workspace/openssl-master/crypto/async'
if [ -n "libcrypto.so.1.1 libssl.so.1.1" ]; then \
		(cd ..; make libcrypto.so.1.1); \
	fi
make[2]: Entering directory `/srv/gump/public/workspace/openssl-master'
make[2]: `libcrypto.so.1.1' is up to date.
make[2]: Leaving directory `/srv/gump/public/workspace/openssl-master'
make[1]: Leaving directory `/srv/gump/public/workspace/openssl-master/crypto'
making all in engines...
make[1]: Entering directory `/srv/gump/public/workspace/openssl-master/engines'
making all in engines/ccgost...
make[2]: Entering directory `/srv/gump/public/workspace/openssl-master/engines/ccgost'
make[2]: Nothing to be done for `all'.
make[2]: Leaving directory `/srv/gump/public/workspace/openssl-master/engines/ccgost'
make[1]: Leaving directory `/srv/gump/public/workspace/openssl-master/engines'
making all in ssl...
make[1]: Entering directory `/srv/gump/public/workspace/openssl-master/ssl'
if [ -n "libcrypto.so.1.1 libssl.so.1.1" ]; then \
		(cd ..; make libssl.so.1.1); \
	fi
make[2]: Entering directory `/srv/gump/public/workspace/openssl-master'
make[2]: `libssl.so.1.1' is up to date.
make[2]: Leaving directory `/srv/gump/public/workspace/openssl-master'
make[1]: Leaving directory `/srv/gump/public/workspace/openssl-master/ssl'
making all in apps...
make[1]: Entering directory `/srv/gump/public/workspace/openssl-master/apps'
make[1]: Nothing to be done for `all'.
make[1]: Leaving directory `/srv/gump/public/workspace/openssl-master/apps'
testing...
make[1]: Entering directory `/srv/gump/public/workspace/openssl-master/test'
make[1]: *** No rule to make target `tests'.  Stop.
make[1]: Leaving directory `/srv/gump/public/workspace/openssl-master/test'
make: *** [tests] Error 2
---------------------------------------------

To subscribe to this information via syndicated feeds:
- RSS: http://vmgump.apache.org/gump/public/openssl-master/openssl-make-test/rss.xml
- Atom: http://vmgump.apache.org/gump/public/openssl-master/openssl-make-test/atom.xml

============================== Gump Tracking Only ===
Produced by Apache Gump(TM) version 2.3.
Gump Run 20160118000006, vmgump.apache.org:vmgump:20160118000006
Gump E-mail Identifier (unique within run) #1.

*********************************************************** G U M P
[GUMP@vmgump]: Module forrest failed
To whom it may engage...
        
This is an automated request, but not an unsolicited one. For 
more information please visit http://gump.apache.org/nagged.html, 
and/or contact the folk at general@gump.apache.org.

Module forrest has an issue affecting its community integration,
 and has been outstanding for 585 runs.
The current state of this module is 'Failed', with reason 'Update Failed'.

Full details are available at:
    http://vmgump.apache.org/gump/public/forrest/index.html

That said, some information snippets are provided here.

The following annotations (debug/informational/warning/error messages) were provided:
 -INFO- Failed with reason update failed



The following work was performed:
http://vmgump.apache.org/gump/public/forrest/gump_work/update_forrest.html
Work Name: update_forrest (Type: Update)
Work ended in a state of : Failed
Elapsed: 10 mins 3 secs
Command Line: svn --quiet update --non-interactive forrest 
[Working Directory: /srv/gump/public/workspace/cvs]
---------------------------------------------
svn: E205011: Failure occurred processing one or more externals definitions
---------------------------------------------

To subscribe to this information via syndicated feeds:
- RSS: http://vmgump.apache.org/gump/public/forrest/rss.xml
- Atom: http://vmgump.apache.org/gump/public/forrest/atom.xml

============================== Gump Tracking Only ===
Produced by Apache Gump(TM) version 2.3.
Gump Run 20160118000006, vmgump.apache.org:vmgump:20160118000006
Gump E-mail Identifier (unique within run) #2.

*********************************************************** G U M P
[GUMP@vmgump]: Project easymock-parent (in module easymock) failed
To whom it may engage...
        
This is an automated request, but not an unsolicited one. For 
more information please visit http://gump.apache.org/nagged.html, 
and/or contact the folk at general@gump.apache.org.

Project easymock-parent has an issue affecting its community integration.
This issue affects 7 projects,
 and has been outstanding for 95 runs.
The current state of this project is 'Failed', with reason 'Build Failed'.
For reference only, the following projects are affected by this:
    - easymock :  EasyMock is a Java library that provides an easy way to use ...
    - easymock-parent :  EasyMock is a Java library that provides an easy way to use ...
    - tomcat-tc7.0.x-test-bio :  Tomcat 7.x, a web server implementing Java Servlet 3.0,
    ...
    - tomcat-tc7.0.x-test-nio :  Tomcat 7.x, a web server implementing Java Servlet 3.0,
    ...
    - tomcat-tc8.0.x-test-bio :  Tomcat 8.x, a web server implementing the Java Servlet 3.1,
...
    - tomcat-tc8.0.x-test-nio :  Tomcat 8.x, a web server implementing the Java Servlet 3.1,
...
    - tomcat-tc8.0.x-test-nio2 :  Tomcat 8.x, a web server implementing the Java Servlet 3.1,
...


Full details are available at:
    http://vmgump.apache.org/gump/public/easymock/easymock-parent/index.html

That said, some information snippets are provided here.

The following annotations (debug/informational/warning/error messages) were provided:
 -DEBUG- (Apache Gump generated) Apache Maven Settings in: /srv/gump/public/workspace/easymock/gump_mvn_settings.xml
 -INFO- Failed with reason build failed
 -DEBUG- Maven POM in: /srv/gump/public/workspace/easymock/pom.xml
 -INFO- Failed to extract fallback artifacts from Gump Repository



The following work was performed:
http://vmgump.apache.org/gump/public/easymock/easymock-parent/gump_work/build_easymock_easymock-parent.html
Work Name: build_easymock_easymock-parent (Type: Build)
Work ended in a state of : Failed
Elapsed: 10 secs
Command Line: /opt/maven3/bin/mvn --batch-mode -Dpackaging=pom -DgroupId=org.easymock -Dfile=pom.xml
-DartifactId=easymock-parent -Dversion=3.5-SNAPSHOT --settings /srv/gump/public/workspace/easymock/gump_mvn_settings.xml
install:install-file 
[Working Directory: /srv/gump/public/workspace/easymock]
M2_HOME: /opt/maven3
---------------------------------------------
[INFO] Scanning for projects...
[INFO] Downloading: http://localhost:8192/maven2/org/apache/maven/wagon/wagon-ssh-external/1.0-beta-6/wagon-ssh-external-1.0-beta-6.pom
[ERROR] The build could not read 1 project -> [Help 1]
[ERROR]   
[ERROR]   The project org.easymock:easymock-parent:3.5-SNAPSHOT (/srv/gump/public/workspace/easymock/pom.xml)
has 1 error
[ERROR]     Unresolveable build extension: Plugin org.apache.maven.wagon:wagon-ssh-external:1.0-beta-6
or one of its dependencies could not be resolved: Failed to read artifact descriptor for org.apache.maven.wagon:wagon-ssh-external:jar:1.0-beta-6:
Could not transfer artifact org.apache.maven.wagon:wagon-ssh-external:pom:1.0-beta-6 from/to
gump-central (http://localhost:8192/maven2): TransferFailedException: ClientProtocolException:
Status line contains invalid status code: HTTP/1.1 :01 :01 -> [Help 2]
[ERROR] 
[ERROR] To see the full stack trace of the errors, re-run Maven with the -e switch.
[ERROR] Re-run Maven using the -X switch to enable full debug logging.
[ERROR] 
[ERROR] For more information about the errors and possible solutions, please read the following
articles:
[ERROR] [Help 1] http://cwiki.apache.org/confluence/display/MAVEN/ProjectBuildingException
[ERROR] [Help 2] http://cwiki.apache.org/confluence/display/MAVEN/PluginResolutionException
---------------------------------------------

To subscribe to this information via syndicated feeds:
- RSS: http://vmgump.apache.org/gump/public/easymock/easymock-parent/rss.xml
- Atom: http://vmgump.apache.org/gump/public/easymock/easymock-parent/atom.xml

============================== Gump Tracking Only ===
Produced by Apache Gump(TM) version 2.3.
Gump Run 20160118000006, vmgump.apache.org:vmgump:20160118000006
Gump E-mail Identifier (unique within run) #5.

*********************************************************** G U M P
[GUMP@vmgump]: Project compress-antlib-test (in module antlibs-compress) failed
To whom it may engage...
        
This is an automated request, but not an unsolicited one. For 
more information please visit http://gump.apache.org/nagged.html, 
and/or contact the folk at general@gump.apache.org.

Project compress-antlib-test has an issue affecting its community integration.
This issue affects 1 projects,
 and has been outstanding for 38 runs.
The current state of this project is 'Failed', with reason 'Build Failed'.
For reference only, the following projects are affected by this:
    - compress-antlib-test :  The Apache Compress Antlib contains tasks and resources that...


Full details are available at:
    http://vmgump.apache.org/gump/public/antlibs-compress/compress-antlib-test/index.html

That said, some information snippets are provided here.

The following annotations (debug/informational/warning/error messages) were provided:
 -DEBUG- Dependency on ant exists, no need to add for property ant.home.
 -INFO- Failed with reason build failed



The following work was performed:
http://vmgump.apache.org/gump/public/antlibs-compress/compress-antlib-test/gump_work/build_antlibs-compress_compress-antlib-test.html
Work Name: build_antlibs-compress_compress-antlib-test (Type: Build)
Work ended in a state of : Failed
Elapsed: 6 mins 19 secs
Command Line: /usr/lib/jvm/java-8-oracle/bin/java -Djava.awt.headless=true -Dbuild.sysclasspath=only
-Xbootclasspath/p:/srv/gump/public/workspace/xml-xerces2/build/xercesImpl.jar:/srv/gump/public/workspace/xml-commons/java/external/build/xml-apis.jar
org.apache.tools.ant.Main -Dgump.merge=/srv/gump/public/gump/work/merge.xml -Dant.home=/srv/gump/public/workspace/ant/dist
test 
[Working Directory: /srv/gump/public/workspace/antlibs-compress]
CLASSPATH: /usr/lib/jvm/java-8-oracle/lib/tools.jar:/srv/gump/public/workspace/antlibs-compress/ivy/ivy.jar:/srv/gump/public/workspace/antlibs-compress/build/ant-compress-20160118.jar:/srv/gump/public/workspace/ant/dist/lib/ant.jar:/srv/gump/public/workspace/ant/dist/lib/ant-launcher.jar:/srv/gump/public/workspace/ant/dist/lib/ant-jmf.jar:/srv/gump/public/workspace/ant/dist/lib/ant-junit.jar:/srv/gump/public/workspace/ant/dist/lib/ant-junit4.jar:/srv/gump/public/workspace/ant/dist/lib/ant-swing.jar:/srv/gump/public/workspace/ant/dist/lib/ant-apache-resolver.jar:/srv/gump/public/workspace/ant/dist/lib/ant-apache-xalan2.jar:/srv/gump/public/workspace/commons-compress/target/commons-compress-1.11-SNAPSHOT.jar:/srv/gump/public/workspace/xz-java/build/jar-20160118/xz.jar:/srv/gump/public/workspace/antlibs-antunit/build/ant-antunit-20160118.jar:/srv/gump/public/workspace/xml-commons/java/external/build/xml-apis-ext.jar
---------------------------------------------
[au:antunit] Target: testWithDirectories took 0.178 sec
[au:antunit] Target: testFullpath took 0.013 sec
[au:antunit] Target: testPreserve0Permissions took 0.018 sec
[au:antunit] Target: testForceCreateOfUpToDate took 4.111 sec
[au:antunit] Target: testNoDirectoriesByDefault took 0.087 sec
[au:antunit] Target: testPlainFileSet took 0.012 sec
[au:antunit] Target: testReplaceOfUpToDate took 4.011 sec
[au:antunit] Target: testCoreZipFileSet  FAILED
[au:antunit] 	at line 35, column 24
[au:antunit] 	Message: Assertion failed
[au:antunit] 	took 0.016 sec
[au:antunit] Target: testAntlibTarFileSet took 0.022 sec
[au:antunit] Target: testCreateOfOutOfDate took 4.037 sec
[au:antunit] Target: testFileSetPermissionsWin took 0.024 sec
[au:antunit] Target: testAddDuplicates took 0.012 sec
[au:antunit] Target: testRemoveLeadingSlashes took 0.013 sec
[au:antunit] Target: testPrefixWithSlash took 0.014 sec
[au:antunit] Target: testWithImplicitDirectories took 0.013 sec
[au:antunit] Target: testForceReplaceOfUpToDate took 4.023 sec
[au:antunit] Target: test0PermissionsGetReplaced took 0.024 sec
[au:antunit] Target: testFailDuplicates took 0.004 sec
[au:antunit] Build File: /srv/gump/public/workspace/antlibs-compress/src/tests/antunit/zipentry-test.xml
[au:antunit] Tests run: 3, Failures: 1, Errors: 0, Time elapsed: 0.036 sec
[au:antunit] Target: testResourceProperties  FAILED
[au:antunit] 	at line 59, column 20
[au:antunit] 	Message: Assertion failed
[au:antunit] 	took 0.012 sec
[au:antunit] Target: testUncompressSource took 0.008 sec
[au:antunit] Target: testZipSource took 0.006 sec
[au:antunit] Build File: /srv/gump/public/workspace/antlibs-compress/src/tests/antunit/zipfileset-test.xml
[au:antunit] Tests run: 9, Failures: 0, Errors: 0, Time elapsed: 0.356 sec
[au:antunit] Target: testSkipUnreadableEntries took 0.005 sec
[au:antunit] Target: testMissingArchive took 0.007 sec
[au:antunit] Target: testUncompressSource took 0.011 sec
[au:antunit] Target: test-refid-check-encoding took 0.007 sec
[au:antunit] Target: testZipSource took 0.008 sec
[au:antunit] Target: test-refid-modify took 0.063 sec
[au:antunit] Target: test-refid-check-prefix took 0.004 sec
[au:antunit] Target: testMissingArchiveDoesntMatter took 0.012 sec
[au:antunit] Target: testFailsOnUnreadableEntries took 0.007 sec
[au:antunit] Build File: /srv/gump/public/workspace/antlibs-compress/src/tests/antunit/zresource-test.xml
[au:antunit] Tests run: 1, Failures: 0, Errors: 0, Time elapsed: 0.017 sec
[au:antunit] Target: testNativeZ took 0.015 sec

test:

BUILD FAILED
/srv/gump/public/workspace/antlibs-compress/common/build.xml:209: At least one AntUnit test
has failed.

Total time: 6 minutes 18 seconds
---------------------------------------------

To subscribe to this information via syndicated feeds:
- RSS: http://vmgump.apache.org/gump/public/antlibs-compress/compress-antlib-test/rss.xml
- Atom: http://vmgump.apache.org/gump/public/antlibs-compress/compress-antlib-test/atom.xml

============================== Gump Tracking Only ===
Produced by Apache Gump(TM) version 2.3.
Gump Run 20160118000006, vmgump.apache.org:vmgump:20160118000006
Gump E-mail Identifier (unique within run) #6.


--
Apache Gump
http://gump.apache.org/ [Instance: vmgump]

---------------------------------------------------------------------
To unsubscribe, e-mail: general-unsubscribe@gump.apache.org
For additional commands, e-mail: general-help@gump.apache.org


Mime
View raw message