gump-general mailing list archives

Site index · List index
Message view « Date » · « Thread »
Top « Date » · « Thread »
From g...@vmgump.apache.org
Subject BATCH: All dressed up, with nowhere to go...
Date Fri, 11 Dec 2015 15:36:50 GMT
Dear Gumpmeisters,
            
The following 1 notifys should have been sent

*********************************************************** G U M P
[GUMP@vmgump]: Project checkstyle (in module checkstyle) failed
*********************************************************** G U M P
[GUMP@vmgump]: Project checkstyle (in module checkstyle) failed
To whom it may engage...
        
This is an automated request, but not an unsolicited one. For 
more information please visit http://gump.apache.org/nagged.html, 
and/or contact the folk at general@gump.apache.org.

Project checkstyle has an issue affecting its community integration.
This issue affects 5 projects.
The current state of this project is 'Failed', with reason 'Build Failed'.
For reference only, the following projects are affected by this:
    - checkstyle :  Java style checker
    - tomcat-tc7.0.x-validate :  Tomcat 7.x, a web server implementing Java Servlet 3.0,
    ...
    - tomcat-tc8.0.x-validate :  Tomcat 8.x, a web server implementing the Java Servlet 3.1,
...
    - tomcat-trunk-validate :  Tomcat 9.x, a web server implementing the Java Servlet 4.0,
...
    - xmlgraphics-commons-test :  Apache XML Graphics Commons - Common Components for Batik
an...


Full details are available at:
    http://vmgump.apache.org/gump/public/checkstyle/checkstyle/index.html

That said, some information snippets are provided here.

The following annotations (debug/informational/warning/error messages) were provided:
 -DEBUG- (Apache Gump generated) Apache Maven Settings in: /srv/gump/public/workspace/checkstyle/gump_mvn_settings.xml
 -INFO- Failed with reason build failed
 -DEBUG- Maven POM in: /srv/gump/public/workspace/checkstyle/pom.xml
 -INFO- Failed to extract fallback artifacts from Gump Repository



The following work was performed:
http://vmgump.apache.org/gump/public/checkstyle/checkstyle/gump_work/build_checkstyle_checkstyle.html
Work Name: build_checkstyle_checkstyle (Type: Build)
Work ended in a state of : Failed
Elapsed: 31 secs
Command Line: /opt/maven3/bin/mvn --batch-mode -Dcobertura.skip=true -DskipTests=true --settings
/srv/gump/public/workspace/checkstyle/gump_mvn_settings.xml install 
[Working Directory: /srv/gump/public/workspace/checkstyle]
M2_HOME: /opt/maven3
---------------------------------------------
[INFO] Downloaded: http://localhost:8192/maven2/org/apache/commons/commons-lang3/3.4/commons-lang3-3.4.jar
(443 KB at 2021.4 KB/sec)
[INFO] Downloading: http://localhost:8192/maven2/nl/jqno/equalsverifier/equalsverifier/1.7.5/equalsverifier-1.7.5.jar
[INFO] Downloaded: http://localhost:8192/maven2/org/apache/ant/ant-launcher/1.9.6/ant-launcher-1.9.6.jar
(18 KB at 299.1 KB/sec)
[INFO] Downloading: http://localhost:8192/maven2/org/powermock/powermock-api-mockito/1.6.3/powermock-api-mockito-1.6.3.jar
[INFO] Downloaded: http://localhost:8192/maven2/com/github/stefanbirkner/system-rules/1.13.0/system-rules-1.13.0.jar
(31 KB at 130.8 KB/sec)
[INFO] Downloading: http://localhost:8192/maven2/org/powermock/powermock-api-support/1.6.3/powermock-api-support-1.6.3.jar
[INFO] Downloaded: http://localhost:8192/maven2/org/powermock/powermock-api-mockito/1.6.3/powermock-api-mockito-1.6.3.jar
(95 KB at 356.8 KB/sec)
[INFO] Downloading: http://localhost:8192/maven2/org/powermock/powermock-core/1.6.3/powermock-core-1.6.3.jar
[INFO] Downloaded: http://localhost:8192/maven2/org/apache/ant/ant/1.9.6/ant-1.9.6.jar (1989
KB at 3292.4 KB/sec)
[INFO] Downloading: http://localhost:8192/maven2/org/javassist/javassist/3.20.0-GA/javassist-3.20.0-GA.jar
[INFO] Downloaded: http://localhost:8192/maven2/org/powermock/powermock-api-support/1.6.3/powermock-api-support-1.6.3.jar
(20 KB at 26.7 KB/sec)
[INFO] Downloading: http://localhost:8192/maven2/org/powermock/powermock-reflect/1.6.3/powermock-reflect-1.6.3.jar
[INFO] Downloading: http://localhost:8192/maven2/org/powermock/powermock-module-junit4/1.6.3/powermock-module-junit4-1.6.3.jar
[INFO] Downloaded: http://localhost:8192/maven2/org/powermock/powermock-core/1.6.3/powermock-core-1.6.3.jar
(103 KB at 154.1 KB/sec)
[INFO] Downloading: http://localhost:8192/maven2/org/powermock/powermock-module-junit4-common/1.6.3/powermock-module-junit4-common-1.6.3.jar
[INFO] Downloaded: http://localhost:8192/maven2/com/google/guava/guava/18.0/guava-18.0.jar
(2204 KB at 1914.3 KB/sec)
[INFO] Downloading: http://localhost:8192/maven2/org/eclipse/jgit/org.eclipse.jgit/4.1.1.201511131810-r/org.eclipse.jgit-4.1.1.201511131810-r.jar
[INFO] Downloaded: http://localhost:8192/maven2/org/powermock/powermock-reflect/1.6.3/powermock-reflect-1.6.3.jar
(47 KB at 250.9 KB/sec)
[INFO] Downloading: http://localhost:8192/maven2/com/jcraft/jsch/0.1.53/jsch-0.1.53.jar
[INFO] Downloaded: http://localhost:8192/maven2/org/powermock/powermock-module-junit4/1.6.3/powermock-module-junit4-1.6.3.jar
(46 KB at 208.5 KB/sec)
[INFO] Downloading: http://localhost:8192/maven2/com/googlecode/javaewah/JavaEWAH/0.7.9/JavaEWAH-0.7.9.jar
[INFO] Downloaded: http://localhost:8192/maven2/org/javassist/javassist/3.20.0-GA/javassist-3.20.0-GA.jar
(733 KB at 1197.7 KB/sec)
[INFO] Downloading: http://localhost:8192/maven2/org/apache/httpcomponents/httpclient/4.3.6/httpclient-4.3.6.jar
[INFO] Downloaded: http://localhost:8192/maven2/org/powermock/powermock-module-junit4-common/1.6.3/powermock-module-junit4-common-1.6.3.jar
(15 KB at 54.5 KB/sec)
[INFO] Downloading: http://localhost:8192/maven2/org/apache/httpcomponents/httpcore/4.3.3/httpcore-4.3.3.jar
[INFO] Downloaded: http://localhost:8192/maven2/com/googlecode/javaewah/JavaEWAH/0.7.9/JavaEWAH-0.7.9.jar
(123 KB at 1027.0 KB/sec)
[INFO] Downloading: http://localhost:8192/maven2/org/slf4j/slf4j-api/1.7.2/slf4j-api-1.7.2.jar
[INFO] Downloaded: http://localhost:8192/maven2/com/jcraft/jsch/0.1.53/jsch-0.1.53.jar (274
KB at 1121.5 KB/sec)
[INFO] Downloading: http://localhost:8192/maven2/org/eclipse/jdt/org.eclipse.jdt.annotation/1.1.0/org.eclipse.jdt.annotation-1.1.0.jar
[INFO] Downloaded: http://localhost:8192/maven2/org/eclipse/jgit/org.eclipse.jgit/4.1.1.201511131810-r/org.eclipse.jgit-4.1.1.201511131810-r.jar
(2113 KB at 5416.1 KB/sec)
[INFO] Downloading: http://localhost:8192/maven2/org/slf4j/slf4j-simple/1.7.13/slf4j-simple-1.7.13.jar
[INFO] Downloaded: http://localhost:8192/maven2/org/apache/httpcomponents/httpcore/4.3.3/httpcore-4.3.3.jar
(277 KB at 1805.0 KB/sec)
[INFO] Downloaded: http://localhost:8192/maven2/org/apache/httpcomponents/httpclient/4.3.6/httpclient-4.3.6.jar
(579 KB at 2546.8 KB/sec)
[INFO] Downloaded: http://localhost:8192/maven2/org/slf4j/slf4j-simple/1.7.13/slf4j-simple-1.7.13.jar
(11 KB at 71.6 KB/sec)
[INFO] Downloaded: http://localhost:8192/maven2/org/eclipse/jdt/org.eclipse.jdt.annotation/1.1.0/org.eclipse.jdt.annotation-1.1.0.jar
(5 KB at 26.4 KB/sec)
[INFO] Downloaded: http://localhost:8192/maven2/org/slf4j/slf4j-api/1.7.2/slf4j-api-1.7.2.jar
(26 KB at 89.4 KB/sec)
[INFO] ------------------------------------------------------------------------
[INFO] BUILD FAILURE
[INFO] ------------------------------------------------------------------------
[INFO] Total time: 28.486 s
[INFO] Finished at: 2015-12-11T08:25:47+00:00
[INFO] Final Memory: 10M/26M
[INFO] ------------------------------------------------------------------------
[ERROR] Failed to execute goal on project checkstyle: Could not resolve dependencies for project
com.puppycrawl.tools:checkstyle:jar:6.14-SNAPSHOT: Could not transfer artifact nl.jqno.equalsverifier:equalsverifier:jar:1.7.5
from/to gump-central (http://localhost:8192/maven2): TransferFailedException: ClientProtocolException:
Status line contains invalid status code: HTTP/1.1 :01 :01 -> [Help 1]
[ERROR] 
[ERROR] To see the full stack trace of the errors, re-run Maven with the -e switch.
[ERROR] Re-run Maven using the -X switch to enable full debug logging.
[ERROR] 
[ERROR] For more information about the errors and possible solutions, please read the following
articles:
[ERROR] [Help 1] http://cwiki.apache.org/confluence/display/MAVEN/DependencyResolutionException
---------------------------------------------

To subscribe to this information via syndicated feeds:
- RSS: http://vmgump.apache.org/gump/public/checkstyle/checkstyle/rss.xml
- Atom: http://vmgump.apache.org/gump/public/checkstyle/checkstyle/atom.xml

============================== Gump Tracking Only ===
Produced by Apache Gump(TM) version 2.3.
Gump Run 20151211060005, vmgump.apache.org:vmgump:20151211060005
Gump E-mail Identifier (unique within run) #1.


--
Apache Gump
http://gump.apache.org/ [Instance: vmgump]

---------------------------------------------------------------------
To unsubscribe, e-mail: general-unsubscribe@gump.apache.org
For additional commands, e-mail: general-help@gump.apache.org


Mime
View raw message