gump-general mailing list archives

Site index · List index
Message view « Date » · « Thread »
Top « Date » · « Thread »
From g...@vmgump.apache.org
Subject BATCH: All dressed up, with nowhere to go...
Date Tue, 17 Nov 2015 09:41:58 GMT
Dear Gumpmeisters,
            
The following 2 notifys should have been sent

*********************************************************** G U M P
[GUMP@vmgump]: Project compress-antlib-test (in module antlibs-compress) failed
[GUMP@vmgump]: Project rat (in module rat) failed
*********************************************************** G U M P
[GUMP@vmgump]: Project compress-antlib-test (in module antlibs-compress) failed
To whom it may engage...
        
This is an automated request, but not an unsolicited one. For 
more information please visit http://gump.apache.org/nagged.html, 
and/or contact the folk at general@gump.apache.org.

Project compress-antlib-test has an issue affecting its community integration.
This issue affects 1 projects,
 and has been outstanding for 83 runs.
The current state of this project is 'Failed', with reason 'Build Failed'.
For reference only, the following projects are affected by this:
    - compress-antlib-test :  The Apache Compress Antlib contains tasks and resources that...


Full details are available at:
    http://vmgump.apache.org/gump/public/antlibs-compress/compress-antlib-test/index.html

That said, some information snippets are provided here.

The following annotations (debug/informational/warning/error messages) were provided:
 -DEBUG- Dependency on ant exists, no need to add for property ant.home.
 -INFO- Failed with reason build failed



The following work was performed:
http://vmgump.apache.org/gump/public/antlibs-compress/compress-antlib-test/gump_work/build_antlibs-compress_compress-antlib-test.html
Work Name: build_antlibs-compress_compress-antlib-test (Type: Build)
Work ended in a state of : Failed
Elapsed: 5 mins 26 secs
Command Line: /usr/lib/jvm/java-8-oracle/bin/java -Djava.awt.headless=true -Dbuild.sysclasspath=only
-Xbootclasspath/p:/srv/gump/public/workspace/xml-xerces2/build/xercesImpl.jar:/srv/gump/public/workspace/xml-commons/java/external/build/xml-apis.jar
org.apache.tools.ant.Main -Dgump.merge=/srv/gump/public/gump/work/merge.xml -Dant.home=/srv/gump/public/workspace/ant/dist
test 
[Working Directory: /srv/gump/public/workspace/antlibs-compress]
CLASSPATH: /usr/lib/jvm/java-8-oracle/lib/tools.jar:/srv/gump/public/workspace/antlibs-compress/ivy/ivy.jar:/srv/gump/public/workspace/antlibs-compress/build/ant-compress-20151117.jar:/srv/gump/public/workspace/ant/dist/lib/ant.jar:/srv/gump/public/workspace/ant/dist/lib/ant-launcher.jar:/srv/gump/public/workspace/ant/dist/lib/ant-jmf.jar:/srv/gump/public/workspace/ant/dist/lib/ant-junit.jar:/srv/gump/public/workspace/ant/dist/lib/ant-junit4.jar:/srv/gump/public/workspace/ant/dist/lib/ant-swing.jar:/srv/gump/public/workspace/ant/dist/lib/ant-apache-resolver.jar:/srv/gump/public/workspace/ant/dist/lib/ant-apache-xalan2.jar:/srv/gump/public/workspace/commons-compress/target/commons-compress-1.11-SNAPSHOT.jar:/srv/gump/public/workspace/xz-java/build/jar-20151117/xz.jar:/srv/gump/public/workspace/antlibs-antunit/build/ant-antunit-20151117.jar:/srv/gump/public/workspace/xml-commons/java/external/build/xml-apis-ext.jar
---------------------------------------------
[au:antunit] Target: testWithDirectories took 0.03 sec
[au:antunit] Target: testFullpath took 0.029 sec
[au:antunit] Target: testPreserve0Permissions took 0.032 sec
[au:antunit] Target: testForceCreateOfUpToDate took 4.034 sec
[au:antunit] Target: testNoDirectoriesByDefault took 0.03 sec
[au:antunit] Target: testPlainFileSet took 0.025 sec
[au:antunit] Target: testReplaceOfUpToDate took 4.024 sec
[au:antunit] Target: testCoreZipFileSet  FAILED
[au:antunit] 	at line 35, column 24
[au:antunit] 	Message: Assertion failed
[au:antunit] 	took 0.017 sec
[au:antunit] Target: testAntlibTarFileSet took 0.035 sec
[au:antunit] Target: testCreateOfOutOfDate took 4.024 sec
[au:antunit] Target: testFileSetPermissionsWin took 0.015 sec
[au:antunit] Target: testAddDuplicates took 0.018 sec
[au:antunit] Target: testRemoveLeadingSlashes took 0.033 sec
[au:antunit] Target: testPrefixWithSlash took 0.046 sec
[au:antunit] Target: testWithImplicitDirectories took 0.017 sec
[au:antunit] Target: testForceReplaceOfUpToDate took 4.033 sec
[au:antunit] Target: test0PermissionsGetReplaced took 0.03 sec
[au:antunit] Target: testFailDuplicates took 0.008 sec
[au:antunit] Build File: /srv/gump/public/workspace/antlibs-compress/src/tests/antunit/zipentry-test.xml
[au:antunit] Tests run: 3, Failures: 1, Errors: 0, Time elapsed: 0.055 sec
[au:antunit] Target: testResourceProperties  FAILED
[au:antunit] 	at line 59, column 20
[au:antunit] 	Message: Assertion failed
[au:antunit] 	took 0.026 sec
[au:antunit] Target: testUncompressSource took 0.009 sec
[au:antunit] Target: testZipSource took 0.006 sec
[au:antunit] Build File: /srv/gump/public/workspace/antlibs-compress/src/tests/antunit/zipfileset-test.xml
[au:antunit] Tests run: 9, Failures: 0, Errors: 0, Time elapsed: 0.33 sec
[au:antunit] Target: testSkipUnreadableEntries took 0.01 sec
[au:antunit] Target: testMissingArchive took 0.005 sec
[au:antunit] Target: testUncompressSource took 0.014 sec
[au:antunit] Target: test-refid-check-encoding took 0.007 sec
[au:antunit] Target: testZipSource took 0.008 sec
[au:antunit] Target: test-refid-modify took 0.062 sec
[au:antunit] Target: test-refid-check-prefix took 0.004 sec
[au:antunit] Target: testMissingArchiveDoesntMatter took 0.003 sec
[au:antunit] Target: testFailsOnUnreadableEntries took 0.012 sec
[au:antunit] Build File: /srv/gump/public/workspace/antlibs-compress/src/tests/antunit/zresource-test.xml
[au:antunit] Tests run: 1, Failures: 0, Errors: 0, Time elapsed: 0.014 sec
[au:antunit] Target: testNativeZ took 0.013 sec

test:

BUILD FAILED
/srv/gump/public/workspace/antlibs-compress/common/build.xml:209: At least one AntUnit test
has failed.

Total time: 5 minutes 26 seconds
---------------------------------------------

To subscribe to this information via syndicated feeds:
- RSS: http://vmgump.apache.org/gump/public/antlibs-compress/compress-antlib-test/rss.xml
- Atom: http://vmgump.apache.org/gump/public/antlibs-compress/compress-antlib-test/atom.xml

============================== Gump Tracking Only ===
Produced by Apache Gump(TM) version 2.3.
Gump Run 20151117000006, vmgump.apache.org:vmgump:20151117000006
Gump E-mail Identifier (unique within run) #1.

*********************************************************** G U M P
[GUMP@vmgump]: Project rat (in module rat) failed
To whom it may engage...
        
This is an automated request, but not an unsolicited one. For 
more information please visit http://gump.apache.org/nagged.html, 
and/or contact the folk at general@gump.apache.org.

Project rat has an issue affecting its community integration.
This issue affects 2 projects,
 and has been outstanding for 311 runs.
The current state of this project is 'Failed', with reason 'Build Failed'.
For reference only, the following projects are affected by this:
    - forrest-rat :  Apache Forrest software is a publishing framework that trans...
    - rat :  Release Audit Tool


Full details are available at:
    http://vmgump.apache.org/gump/public/rat/rat/index.html

That said, some information snippets are provided here.

The following annotations (debug/informational/warning/error messages) were provided:
 -DEBUG- (Apache Gump generated) Apache Maven Settings in: /srv/gump/public/workspace/rat/gump_mvn_settings.xml
 -INFO- Failed with reason build failed
 -DEBUG- Maven POM in: /srv/gump/public/workspace/rat/pom.xml
 -DEBUG- Extracted fallback artifacts from Gump Repository



The following work was performed:
http://vmgump.apache.org/gump/public/rat/rat/gump_work/build_rat_rat.html
Work Name: build_rat_rat (Type: Build)
Work ended in a state of : Failed
Elapsed: 1 min 16 secs
Command Line: /opt/maven3/bin/mvn --batch-mode -DskipTests=true -DjavaVersion=1.8 --settings
/srv/gump/public/workspace/rat/gump_mvn_settings.xml package 
[Working Directory: /srv/gump/public/workspace/rat]
M2_HOME: /opt/maven3
---------------------------------------------
[INFO] Exclude: **/.bzrignore
[INFO] 37 resources included (use -debug for more details)
[INFO] Rat check: Summary of files. Unapproved: 0 unknown: 0 generated: 0 approved: 37 licence.
[INFO] 
[INFO] --- maven-plugin-plugin:3.4:helpmojo (help-goal) @ apache-rat-plugin ---
[INFO] Downloading: http://localhost:8192/maven2/org/apache/maven/plugin-tools/maven-plugin-tools-api/3.4/maven-plugin-tools-api-3.4.pom
[INFO] Downloading: http://localhost:8192/maven2/org/apache/maven/plugin-tools/maven-plugin-tools-generators/3.4/maven-plugin-tools-generators-3.4.pom
[INFO] Downloaded: http://localhost:8192/maven2/org/apache/maven/plugin-tools/maven-plugin-tools-generators/3.4/maven-plugin-tools-generators-3.4.pom
(5 KB at 14.3 KB/sec)
[INFO] Downloading: http://localhost:8192/maven2/net/sf/jtidy/jtidy/r938/jtidy-r938.pom
[INFO] Downloaded: http://localhost:8192/maven2/net/sf/jtidy/jtidy/r938/jtidy-r938.pom (10
KB at 85.0 KB/sec)
[INFO] Downloading: http://localhost:8192/maven2/org/apache/maven/plugin-tools/maven-plugin-tools-java/3.4/maven-plugin-tools-java-3.4.pom
[INFO] Downloaded: http://localhost:8192/maven2/org/apache/maven/plugin-tools/maven-plugin-tools-java/3.4/maven-plugin-tools-java-3.4.pom
(4 KB at 23.3 KB/sec)
[INFO] Downloading: http://localhost:8192/maven2/com/thoughtworks/qdox/qdox/2.0-M3/qdox-2.0-M3.pom
[INFO] Downloaded: http://localhost:8192/maven2/com/thoughtworks/qdox/qdox/2.0-M3/qdox-2.0-M3.pom
(18 KB at 135.3 KB/sec)
[INFO] Downloading: http://localhost:8192/maven2/org/apache/maven/plugin-tools/maven-plugin-tools-annotations/3.4/maven-plugin-tools-annotations-3.4.pom
[INFO] Downloaded: http://localhost:8192/maven2/org/apache/maven/plugin-tools/maven-plugin-tools-annotations/3.4/maven-plugin-tools-annotations-3.4.pom
(5 KB at 48.4 KB/sec)
[INFO] Downloading: http://localhost:8192/maven2/org/apache/maven/plugin-tools/maven-plugin-annotations/3.4/maven-plugin-annotations-3.4.pom
[INFO] Downloaded: http://localhost:8192/maven2/org/apache/maven/plugin-tools/maven-plugin-annotations/3.4/maven-plugin-annotations-3.4.pom
(2 KB at 17.5 KB/sec)
[INFO] Downloading: http://localhost:8192/maven2/org/codehaus/plexus/plexus-archiver/2.1.1/plexus-archiver-2.1.1.pom
[INFO] Downloaded: http://localhost:8192/maven2/org/codehaus/plexus/plexus-archiver/2.1.1/plexus-archiver-2.1.1.pom
(3 KB at 32.7 KB/sec)
[INFO] Downloading: http://localhost:8192/maven2/org/codehaus/plexus/plexus-io/2.0.3/plexus-io-2.0.3.pom
[INFO] Downloaded: http://localhost:8192/maven2/org/codehaus/plexus/plexus-io/2.0.3/plexus-io-2.0.3.pom
(2 KB at 20.1 KB/sec)
[INFO] Downloading: http://localhost:8192/maven2/org/apache/maven/reporting/maven-reporting-impl/2.3/maven-reporting-impl-2.3.pom
[INFO] Downloaded: http://localhost:8192/maven2/org/apache/maven/reporting/maven-reporting-impl/2.3/maven-reporting-impl-2.3.pom
(5 KB at 47.0 KB/sec)
[INFO] ------------------------------------------------------------------------
[INFO] Reactor Summary:
[INFO] 
[INFO] Apache Creadur Rat ................................. SUCCESS [ 17.219 s]
[INFO] Apache Creadur Rat::API ............................ SUCCESS [ 11.472 s]
[INFO] Apache Creadur Rat::Core ........................... SUCCESS [ 18.310 s]
[INFO] Apache Creadur Rat::Plugin4Maven ................... FAILURE [ 18.977 s]
[INFO] Apache Creadur Rat::Tasks4Ant ...................... SKIPPED
[INFO] Apache Creadur Rat::Command Line ................... SKIPPED
[INFO] ------------------------------------------------------------------------
[INFO] BUILD FAILURE
[INFO] ------------------------------------------------------------------------
[INFO] Total time: 01:11 min
[INFO] Finished at: 2015-11-17T01:56:06+00:00
[INFO] Final Memory: 31M/107M
[INFO] ------------------------------------------------------------------------
[ERROR] Failed to execute goal org.apache.maven.plugins:maven-plugin-plugin:3.4:helpmojo (help-goal)
on project apache-rat-plugin: Execution help-goal of goal org.apache.maven.plugins:maven-plugin-plugin:3.4:helpmojo
failed: Plugin org.apache.maven.plugins:maven-plugin-plugin:3.4 or one of its dependencies
could not be resolved: Failed to collect dependencies at org.apache.maven.plugins:maven-plugin-plugin:jar:3.4
-> org.apache.maven.plugin-tools:maven-plugin-tools-api:jar:3.4: Failed to read artifact
descriptor for org.apache.maven.plugin-tools:maven-plugin-tools-api:jar:3.4: Could not transfer
artifact org.apache.maven.plugin-tools:maven-plugin-tools-api:pom:3.4 from/to gump-central
(http://localhost:8192/maven2): TransferFailedException: ClientProtocolException: Status line
contains invalid status code: HTTP/1.1 :01 :01 -> [Help 1]
[ERROR] 
[ERROR] To see the full stack trace of the errors, re-run Maven with the -e switch.
[ERROR] Re-run Maven using the -X switch to enable full debug logging.
[ERROR] 
[ERROR] For more information about the errors and possible solutions, please read the following
articles:
[ERROR] [Help 1] http://cwiki.apache.org/confluence/display/MAVEN/PluginResolutionException
[ERROR] 
[ERROR] After correcting the problems, you can resume the build with the command
[ERROR]   mvn <goals> -rf :apache-rat-plugin
---------------------------------------------

To subscribe to this information via syndicated feeds:
- RSS: http://vmgump.apache.org/gump/public/rat/rat/rss.xml
- Atom: http://vmgump.apache.org/gump/public/rat/rat/atom.xml

============================== Gump Tracking Only ===
Produced by Apache Gump(TM) version 2.3.
Gump Run 20151117000006, vmgump.apache.org:vmgump:20151117000006
Gump E-mail Identifier (unique within run) #2.


--
Apache Gump
http://gump.apache.org/ [Instance: vmgump]

---------------------------------------------------------------------
To unsubscribe, e-mail: general-unsubscribe@gump.apache.org
For additional commands, e-mail: general-help@gump.apache.org


Mime
View raw message