gump-general mailing list archives

Site index · List index
Message view « Date » · « Thread »
Top « Date » · « Thread »
From g...@vmgump.apache.org
Subject BATCH: All dressed up, with nowhere to go...
Date Fri, 02 Oct 2015 14:47:01 GMT
Dear Gumpmeisters,
            
The following 1 notifys should have been sent

*********************************************************** G U M P
[GUMP@vmgump]: Project checkstyle (in module checkstyle) failed
*********************************************************** G U M P
[GUMP@vmgump]: Project checkstyle (in module checkstyle) failed
To whom it may engage...
        
This is an automated request, but not an unsolicited one. For 
more information please visit http://gump.apache.org/nagged.html, 
and/or contact the folk at general@gump.apache.org.

Project checkstyle has an issue affecting its community integration.
This issue affects 5 projects.
The current state of this project is 'Failed', with reason 'Build Failed'.
For reference only, the following projects are affected by this:
    - checkstyle :  Java style checker
    - tomcat-tc7.0.x-validate :  Tomcat 7.x, a web server implementing Java Servlet 3.0,
    ...
    - tomcat-tc8.0.x-validate :  Tomcat 8.x, a web server implementing the Java Servlet 3.1,
...
    - tomcat-trunk-validate :  Tomcat 9.x, a web server implementing the Java Servlet 4.0,
...
    - xmlgraphics-commons-test :  Apache XML Graphics Commons - Common Components for Batik
an...


Full details are available at:
    http://vmgump.apache.org/gump/public/checkstyle/checkstyle/index.html

That said, some information snippets are provided here.

The following annotations (debug/informational/warning/error messages) were provided:
 -DEBUG- (Apache Gump generated) Apache Maven Settings in: /srv/gump/public/workspace/checkstyle/gump_mvn_settings.xml
 -INFO- Failed with reason build failed
 -DEBUG- Maven POM in: /srv/gump/public/workspace/checkstyle/pom.xml
 -INFO- Failed to extract fallback artifacts from Gump Repository



The following work was performed:
http://vmgump.apache.org/gump/public/checkstyle/checkstyle/gump_work/build_checkstyle_checkstyle.html
Work Name: build_checkstyle_checkstyle (Type: Build)
Work ended in a state of : Failed
Elapsed: 2 mins 49 secs
Command Line: /opt/maven3/bin/mvn --batch-mode -Dcobertura.skip=true -DskipTests=true --settings
/srv/gump/public/workspace/checkstyle/gump_mvn_settings.xml install 
[Working Directory: /srv/gump/public/workspace/checkstyle]
M2_HOME: /opt/maven3
---------------------------------------------
[propertyfile] Creating new property file: /srv/gump/public/workspace/checkstyle/target/classes/checkstylecompilation.properties
  [javadoc] Generating Javadoc
  [javadoc] Javadoc execution
  [javadoc] Loading source file /srv/gump/public/workspace/checkstyle/src/main/java/com/puppycrawl/tools/checkstyle/api/TokenTypes.java...
  [javadoc] Constructing Javadoc information...
[INFO] Executed tasks
[INFO] 
[INFO] --- maven-resources-plugin:2.7:testResources (default-testResources) @ checkstyle ---
[INFO] Using 'UTF-8' encoding to copy filtered resources.
[INFO] Copying 511 resources
[INFO] 
[INFO] --- maven-compiler-plugin:3.3:testCompile (default-testCompile) @ checkstyle ---
[INFO] Changes detected - recompiling the module!
[INFO] Compiling 815 source files to /srv/gump/public/workspace/checkstyle/target/test-classes
[INFO] /srv/gump/public/workspace/checkstyle/src/test/java/com/puppycrawl/tools/checkstyle/checks/javadoc/AbstractTypeAwareCheckTest.java:
/srv/gump/public/workspace/checkstyle/src/test/java/com/puppycrawl/tools/checkstyle/checks/javadoc/AbstractTypeAwareCheckTest.java
uses or overrides a deprecated API.
[INFO] /srv/gump/public/workspace/checkstyle/src/test/java/com/puppycrawl/tools/checkstyle/checks/javadoc/AbstractTypeAwareCheckTest.java:
Recompile with -Xlint:deprecation for details.
[INFO] 
[INFO] --- maven-compiler-plugin:3.3:testCompile (compile-without-error-prone) @ checkstyle
---
[INFO] Changes detected - recompiling the module!
[INFO] Compiling 363 source files to /srv/gump/public/workspace/checkstyle/target/test-classes
[INFO] 
[INFO] --- maven-compiler-plugin:3.3:testCompile (compile-with-error-prone) @ checkstyle ---
[INFO] Changes detected - recompiling the module!
[INFO] Compiling 353 source files to /srv/gump/public/workspace/checkstyle/target/test-classes
Note: /srv/gump/public/workspace/checkstyle/src/test/java/com/puppycrawl/tools/checkstyle/checks/javadoc/AbstractTypeAwareCheckTest.java
uses or overrides a deprecated API.
Note: Recompile with -Xlint:deprecation for details.
[INFO] 
[INFO] --- maven-surefire-plugin:2.18.1:test (default-test) @ checkstyle ---
[INFO] Tests are skipped.
[INFO] 
[INFO] --- xml-maven-plugin:1.0:validate (default) @ checkstyle ---
[INFO] Downloading: https://oss.sonatype.org/content/repositories/codehaus-snapshots/xml-resolver/xml-resolver/1.2/xml-resolver-1.2.pom
[INFO] Downloading: http://localhost:8192/maven2/xml-resolver/xml-resolver/1.2/xml-resolver-1.2.pom
[INFO] Downloading: https://oss.sonatype.org/content/repositories/codehaus-snapshots/org/codehaus/plexus/plexus-io/1.0-alpha-5/plexus-io-1.0-alpha-5.pom
[INFO] Downloading: http://localhost:8192/maven2/org/codehaus/plexus/plexus-io/1.0-alpha-5/plexus-io-1.0-alpha-5.pom
[INFO] Downloaded: http://localhost:8192/maven2/org/codehaus/plexus/plexus-io/1.0-alpha-5/plexus-io-1.0-alpha-5.pom
(2 KB at 5.4 KB/sec)
[INFO] ------------------------------------------------------------------------
[INFO] BUILD FAILURE
[INFO] ------------------------------------------------------------------------
[INFO] Total time: 02:46 min
[INFO] Finished at: 2015-10-02T08:10:13+00:00
[INFO] Final Memory: 77M/189M
[INFO] ------------------------------------------------------------------------
[ERROR] Failed to execute goal org.codehaus.mojo:xml-maven-plugin:1.0:validate (default) on
project checkstyle: Execution default of goal org.codehaus.mojo:xml-maven-plugin:1.0:validate
failed: Plugin org.codehaus.mojo:xml-maven-plugin:1.0 or one of its dependencies could not
be resolved: Failed to collect dependencies at org.codehaus.mojo:xml-maven-plugin:jar:1.0
-> xml-resolver:xml-resolver:jar:1.2: Failed to read artifact descriptor for xml-resolver:xml-resolver:jar:1.2:
Could not transfer artifact xml-resolver:xml-resolver:pom:1.2 from/to gump-central (http://localhost:8192/maven2):
TransferFailedException: ClientProtocolException: Status line contains invalid status code:
HTTP/1.1 :01 :01 -> [Help 1]
[ERROR] 
[ERROR] To see the full stack trace of the errors, re-run Maven with the -e switch.
[ERROR] Re-run Maven using the -X switch to enable full debug logging.
[ERROR] 
[ERROR] For more information about the errors and possible solutions, please read the following
articles:
[ERROR] [Help 1] http://cwiki.apache.org/confluence/display/MAVEN/PluginResolutionException
---------------------------------------------

To subscribe to this information via syndicated feeds:
- RSS: http://vmgump.apache.org/gump/public/checkstyle/checkstyle/rss.xml
- Atom: http://vmgump.apache.org/gump/public/checkstyle/checkstyle/atom.xml

============================== Gump Tracking Only ===
Produced by Apache Gump(TM) version 2.3.
Gump Run 20151002060005, vmgump.apache.org:vmgump:20151002060005
Gump E-mail Identifier (unique within run) #1.


--
Apache Gump
http://gump.apache.org/ [Instance: vmgump]

---------------------------------------------------------------------
To unsubscribe, e-mail: general-unsubscribe@gump.apache.org
For additional commands, e-mail: general-help@gump.apache.org


Mime
View raw message