gump-general mailing list archives

Site index · List index
Message view « Date » · « Thread »
Top « Date » · « Thread »
Subject BATCH: All dressed up, with nowhere to go...
Date Thu, 17 Sep 2015 13:36:44 GMT
Dear Gumpmeisters,
The following 1 notifys should have been sent

*********************************************************** G U M P
[GUMP@vmgump]: Project checkstyle (in module checkstyle) failed
*********************************************************** G U M P
[GUMP@vmgump]: Project checkstyle (in module checkstyle) failed
To whom it may engage...
This is an automated request, but not an unsolicited one. For 
more information please visit, 
and/or contact the folk at

Project checkstyle has an issue affecting its community integration.
This issue affects 5 projects.
The current state of this project is 'Failed', with reason 'Build Failed'.
For reference only, the following projects are affected by this:
    - checkstyle :  Java style checker
    - tomcat-tc7.0.x-validate :  Tomcat 7.x, a web server implementing Java Servlet 3.0,
    - tomcat-tc8.0.x-validate :  Tomcat 8.x, a web server implementing the Java Servlet 3.1,
    - tomcat-trunk-validate :  Tomcat 9.x, a web server implementing the Java Servlet 4.0,
    - xmlgraphics-commons-test :  Apache XML Graphics Commons - Common Components for Batik

Full details are available at:

That said, some information snippets are provided here.

The following annotations (debug/informational/warning/error messages) were provided:
 -DEBUG- (Apache Gump generated) Apache Maven Settings in: /srv/gump/public/workspace/checkstyle/gump_mvn_settings.xml
 -INFO- Failed with reason build failed
 -DEBUG- Maven POM in: /srv/gump/public/workspace/checkstyle/pom.xml
 -INFO- Failed to extract fallback artifacts from Gump Repository

The following work was performed:
Work Name: build_checkstyle_checkstyle (Type: Build)
Work ended in a state of : Failed
Elapsed: 5 mins 44 secs
Command Line: /opt/maven3/bin/mvn --batch-mode -Dcobertura.skip=true -DskipTests=true --settings
/srv/gump/public/workspace/checkstyle/gump_mvn_settings.xml install 
[Working Directory: /srv/gump/public/workspace/checkstyle]
M2_HOME: /opt/maven3
[INFO] --- maven-pmd-plugin:3.5:pmd (pmd) @ checkstyle ---
[INFO] Downloading:
[INFO] Downloading: http://localhost:8192/maven2/dom4j/dom4j/1.6.1/dom4j-1.6.1.pom
[INFO] Downloading:
[INFO] Downloading: http://localhost:8192/maven2/org/codehaus/plexus/plexus-resources/1.0.1/plexus-resources-1.0.1.pom
[INFO] Downloaded: http://localhost:8192/maven2/org/codehaus/plexus/plexus-resources/1.0.1/plexus-resources-1.0.1.pom
(2 KB at 5.1 KB/sec)
[INFO] Downloading:
[INFO] Downloading: http://localhost:8192/maven2/net/sourceforge/pmd/pmd-core/5.3.2/pmd-core-5.3.2.pom
[INFO] Downloaded: http://localhost:8192/maven2/net/sourceforge/pmd/pmd-core/5.3.2/pmd-core-5.3.2.pom
(5 KB at 39.2 KB/sec)
[INFO] Downloading:
[INFO] Downloading: http://localhost:8192/maven2/net/sourceforge/pmd/pmd/5.3.2/pmd-5.3.2.pom
[INFO] Downloaded: http://localhost:8192/maven2/net/sourceforge/pmd/pmd/5.3.2/pmd-5.3.2.pom
(37 KB at 156.3 KB/sec)
[INFO] Downloading:
[INFO] Downloading: http://localhost:8192/maven2/jaxen/jaxen/1.1.4/jaxen-1.1.4.pom
[INFO] Downloaded: http://localhost:8192/maven2/jaxen/jaxen/1.1.4/jaxen-1.1.4.pom (13 KB at
60.4 KB/sec)
[INFO] Downloading:
[INFO] Downloading: http://localhost:8192/maven2/net/java/dev/javacc/javacc/5.0/javacc-5.0.pom
[INFO] Downloaded: http://localhost:8192/maven2/net/java/dev/javacc/javacc/5.0/javacc-5.0.pom
(3 KB at 47.3 KB/sec)
[INFO] Downloading:
[INFO] Downloading: http://localhost:8192/maven2/net/sourceforge/saxon/saxon/
[INFO] Downloaded: http://localhost:8192/maven2/net/sourceforge/saxon/saxon/
(6 KB at 85.0 KB/sec)
[INFO] Downloading:
[INFO] Downloading: http://localhost:8192/maven2/org/apache/commons/commons-lang3/3.3.2/commons-lang3-3.3.2.pom
[INFO] Downloaded: http://localhost:8192/maven2/org/apache/commons/commons-lang3/3.3.2/commons-lang3-3.3.2.pom
(23 KB at 2764.8 KB/sec)
[INFO] Downloading:
[INFO] Downloading: http://localhost:8192/maven2/net/sourceforge/pmd/pmd-java/5.3.2/pmd-java-5.3.2.pom
[INFO] Downloaded: http://localhost:8192/maven2/net/sourceforge/pmd/pmd-java/5.3.2/pmd-java-5.3.2.pom
(6 KB at 91.5 KB/sec)
[INFO] Downloading:
[INFO] Downloading: http://localhost:8192/maven2/net/sourceforge/pmd/pmd-javascript/5.3.2/pmd-javascript-5.3.2.pom
[INFO] Downloaded: http://localhost:8192/maven2/net/sourceforge/pmd/pmd-javascript/5.3.2/pmd-javascript-5.3.2.pom
(3 KB at 33.9 KB/sec)
[INFO] Downloading:
[INFO] Downloading: http://localhost:8192/maven2/org/mozilla/rhino/1.7R4/rhino-1.7R4.pom
[INFO] Downloaded: http://localhost:8192/maven2/org/mozilla/rhino/1.7R4/rhino-1.7R4.pom (2
KB at 20.9 KB/sec)
[INFO] Downloading:
[INFO] Downloading: http://localhost:8192/maven2/net/sourceforge/pmd/pmd-jsp/5.3.2/pmd-jsp-5.3.2.pom
[INFO] Downloaded: http://localhost:8192/maven2/net/sourceforge/pmd/pmd-jsp/5.3.2/pmd-jsp-5.3.2.pom
(5 KB at 59.6 KB/sec)
[INFO] ------------------------------------------------------------------------
[INFO] ------------------------------------------------------------------------
[INFO] Total time: 05:41 min
[INFO] Finished at: 2015-09-17T08:12:31+00:00
[INFO] Final Memory: 79M/190M
[INFO] ------------------------------------------------------------------------
[ERROR] Failed to execute goal org.apache.maven.plugins:maven-pmd-plugin:3.5:pmd (pmd) on
project checkstyle: Execution pmd of goal org.apache.maven.plugins:maven-pmd-plugin:3.5:pmd
failed: Plugin org.apache.maven.plugins:maven-pmd-plugin:3.5 or one of its dependencies could
not be resolved: Failed to collect dependencies at org.apache.maven.plugins:maven-pmd-plugin:jar:3.5
-> dom4j:dom4j:jar:1.6.1: Failed to read artifact descriptor for dom4j:dom4j:jar:1.6.1:
Could not transfer artifact dom4j:dom4j:pom:1.6.1 from/to nexus-snapshot ( unknown error: Unknown host unknown error -> [Help
[ERROR] To see the full stack trace of the errors, re-run Maven with the -e switch.
[ERROR] Re-run Maven using the -X switch to enable full debug logging.
[ERROR] For more information about the errors and possible solutions, please read the following
[ERROR] [Help 1]

To subscribe to this information via syndicated feeds:
- RSS:
- Atom:

============================== Gump Tracking Only ===
Produced by Apache Gump(TM) version 2.3.
Gump Run 20150917060003,
Gump E-mail Identifier (unique within run) #1.

Apache Gump [Instance: vmgump]

To unsubscribe, e-mail:
For additional commands, e-mail:

View raw message