gump-general mailing list archives

Site index · List index
Message view « Date » · « Thread »
Top « Date » · « Thread »
From g...@vmgump.apache.org
Subject BATCH: All dressed up, with nowhere to go...
Date Sat, 22 Aug 2015 05:40:37 GMT
Dear Gumpmeisters,
            
The following 3 notifys should have been sent

*********************************************************** G U M P
[GUMP@vmgump]: Project openssl-make-test (in module openssl-master) failed
[GUMP@vmgump]: Project tika-parsers (in module tika) failed
[GUMP@vmgump]: Project tika-reactor (in module tika) failed
*********************************************************** G U M P
[GUMP@vmgump]: Project openssl-make-test (in module openssl-master) failed
To whom it may engage...
        
This is an automated request, but not an unsolicited one. For 
more information please visit http://gump.apache.org/nagged.html, 
and/or contact the folk at general@gump.apache.org.

Project openssl-make-test has an issue affecting its community integration.
This issue affects 10 projects,
 and has been outstanding for 24 runs.
The current state of this project is 'Failed', with reason 'Build Failed'.
For reference only, the following projects are affected by this:
    - openssl-make-install :  OpenSSL Encryption Library
    - openssl-make-test :  OpenSSL Encryption Library
    - tomcat-native-configure :  Tomcat native library using Apache Portable Runtime
    - tomcat-native-make :  Tomcat native library using Apache Portable Runtime
    - tomcat-native-make-install :  Tomcat native library using Apache Portable Runtime
    - tomcat-tc7.0.x-test-apr :  Tomcat 7.x, a web server implementing Java Servlet 3.0,
    ...
    - tomcat-tc8.0.x-test-apr :  Tomcat 8.x, a web server implementing the Java Servlet 3.1,
...
    - tomcat-trunk-test-apr :  Tomcat 9.x, a web server implementing the Java Servlet 4.0,
...
    - tomcat-trunk-test-nio :  Tomcat 9.x, a web server implementing the Java Servlet 4.0,
...
    - tomcat-trunk-test-nio2 :  Tomcat 9.x, a web server implementing the Java Servlet 4.0,
...


Full details are available at:
    http://vmgump.apache.org/gump/public/openssl-master/openssl-make-test/index.html

That said, some information snippets are provided here.

The following annotations (debug/informational/warning/error messages) were provided:
 -INFO- Failed with reason build failed



The following work was performed:
http://vmgump.apache.org/gump/public/openssl-master/openssl-make-test/gump_work/build_openssl-master_openssl-make-test.html
Work Name: build_openssl-master_openssl-make-test (Type: Build)
Work ended in a state of : Failed
Elapsed: 2 mins 7 secs
Command Line: make test 
[Working Directory: /srv/gump/public/workspace/openssl-master]
---------------------------------------------
47746833227424:error:0407006A:rsa routines:RSA_padding_check_PKCS1_type_1:block type is not
01:rsa_pk1.c:103:
47746833227424:error:04067072:rsa routines:RSA_EAY_PUBLIC_DECRYPT:padding check failed:rsa_eay.c:703:
47746833227424:error:0D0C5006:asn1 encoding routines:ASN1_item_verify:EVP lib:a_verify.c:215:
47746833227424:error:27069065:OCSP routines:OCSP_basic_verify:certificate verify error:ocsp_vfy.c:139:Verify
error:certificate signature failure
DELEGATED; Root CA -> EE
Response Verify Failure
47766180601504:error:0407006A:rsa routines:RSA_padding_check_PKCS1_type_1:block type is not
01:rsa_pk1.c:103:
47766180601504:error:04067072:rsa routines:RSA_EAY_PUBLIC_DECRYPT:padding check failed:rsa_eay.c:703:
47766180601504:error:0D0C5006:asn1 encoding routines:ASN1_item_verify:EVP lib:a_verify.c:215:
47766180601504:error:27069065:OCSP routines:OCSP_basic_verify:certificate verify error:ocsp_vfy.c:139:Verify
error:certificate signature failure
=== INVALID SIGNATURE on the ISSUER CERTIFICATE ===
NON-DELEGATED; Intermediate CA -> EE
Response verify OK
NON-DELEGATED; Root CA -> Intermediate CA
Response verify OK
NON-DELEGATED; Root CA -> EE
Response verify OK
DELEGATED; Intermediate CA -> EE
Response verify OK
DELEGATED; Root CA -> Intermediate CA
Response verify OK
DELEGATED; Root CA -> EE
Response verify OK
ALL OCSP TESTS SUCCESSFUL
@@@ START test_gost2814789
OPENSSL_ENGINES=../engines/ccgost ../util/shlib_wrap.sh ./gost2814789test
Testing GOST 28147-89 ......b5242888/5242888..b5242888/5242888......b5242880/5242880. passed
@@@ START test_heartbeat
../util/shlib_wrap.sh ./heartbeat_test
@@@ START test_p5_crpt2
../util/shlib_wrap.sh ./p5_crpt2_test
PKCS5_PBKDF2_HMAC() tests ..... done
@@@ START test_constant_time
../util/shlib_wrap.sh ./constant_time_test
Testing constant time operations...
ok (ran 1908 tests)
@@@ START test_verify_extra
../util/shlib_wrap.sh ./verify_extra_test
PASS
@@@ START test_clienthello
../util/shlib_wrap.sh ./clienthellotest
@@@ START test_packet
../util/shlib_wrap.sh ./packettest
PASS
@@@ START test_sslvertol
[ -z "libcrypto.so.1.1 libssl.so.1.1" ] || OPENSSL_ENGINES=../engines ../util/shlib_wrap.sh
/usr/bin/perl -I../util -w ./sslvertoltest.pl "OPENSSL_ia32cap='~0x200000200000000' ../apps/openssl"
../apps/server.pem
FAILED: Version tolerance test
make[1]: *** [test_sslvertol] Error 255
make[1]: Leaving directory `/srv/gump/public/workspace/openssl-master/test'
make: *** [tests] Error 2
---------------------------------------------

To subscribe to this information via syndicated feeds:
- RSS: http://vmgump.apache.org/gump/public/openssl-master/openssl-make-test/rss.xml
- Atom: http://vmgump.apache.org/gump/public/openssl-master/openssl-make-test/atom.xml

============================== Gump Tracking Only ===
Produced by Apache Gump(TM) version 2.3.
Gump Run 20150822000005, vmgump.apache.org:vmgump:20150822000005
Gump E-mail Identifier (unique within run) #1.

*********************************************************** G U M P
[GUMP@vmgump]: Project tika-parsers (in module tika) failed
To whom it may engage...
        
This is an automated request, but not an unsolicited one. For 
more information please visit http://gump.apache.org/nagged.html, 
and/or contact the folk at general@gump.apache.org.

Project tika-parsers has an issue affecting its community integration.
This issue affects 2 projects,
 and has been outstanding for 48 runs.
The current state of this project is 'Failed', with reason 'Build Failed'.
For reference only, the following projects are affected by this:
    - tika-parsers :  Apache Tika is a toolkit for detecting and extracting metada...
    - tika-parsers-test :  Apache Tika is a toolkit for detecting and extracting metada...


Full details are available at:
    http://vmgump.apache.org/gump/public/tika/tika-parsers/index.html

That said, some information snippets are provided here.

The following annotations (debug/informational/warning/error messages) were provided:
 -DEBUG- Sole jar output [tika-parsers-*[0-9T].jar] identifier set to project name
 -INFO- Optional dependency org.apache.poi prerequisite failed with reason build failed
 -DEBUG- (Apache Gump generated) Apache Maven Settings in: /srv/gump/public/workspace/tika/tika-parsers/gump_mvn_settings.xml
 -INFO- Failed with reason build failed
 -DEBUG- Maven POM in: /srv/gump/public/workspace/tika/tika-parsers/pom.xml
 -INFO- Failed to extract fallback artifacts from Gump Repository



The following work was performed:
http://vmgump.apache.org/gump/public/tika/tika-parsers/gump_work/build_tika_tika-parsers.html
Work Name: build_tika_tika-parsers (Type: Build)
Work ended in a state of : Failed
Elapsed: 1 min 32 secs
Command Line: /opt/maven3/bin/mvn --batch-mode -DskipTests=true --settings /srv/gump/public/workspace/tika/tika-parsers/gump_mvn_settings.xml
package 
[Working Directory: /srv/gump/public/workspace/tika/tika-parsers]
M2_HOME: /opt/maven3
---------------------------------------------
[ERROR] /srv/gump/public/workspace/tika/tika-parsers/src/main/java/org/apache/tika/parser/font/TrueTypeParser.java:[67,26]
cannot find symbol
  symbol:   method parseTTF(java.io.File)
  location: variable parser of type org.apache.fontbox.ttf.TTFParser
[ERROR] /srv/gump/public/workspace/tika/tika-parsers/src/main/java/org/apache/tika/parser/font/TrueTypeParser.java:[69,26]
cannot find symbol
  symbol:   method parseTTF(java.io.InputStream)
  location: variable parser of type org.apache.fontbox.ttf.TTFParser
[ERROR] /srv/gump/public/workspace/tika/tika-parsers/src/main/java/org/apache/tika/parser/utils/CommonsDigester.java:[136,41]
cannot find symbol
  symbol:   method md2Hex(java.io.InputStream)
  location: class org.apache.commons.codec.digest.DigestUtils
[ERROR] /srv/gump/public/workspace/tika/tika-parsers/src/main/java/org/apache/tika/parser/utils/CommonsDigester.java:[142,41]
cannot find symbol
  symbol:   method sha1Hex(java.io.InputStream)
  location: class org.apache.commons.codec.digest.DigestUtils
[INFO] 7 errors 
[INFO] -------------------------------------------------------------
[INFO] ------------------------------------------------------------------------
[INFO] BUILD FAILURE
[INFO] ------------------------------------------------------------------------
[INFO] Total time: 01:26 min
[INFO] Finished at: 2015-08-22T01:52:52+00:00
[INFO] Final Memory: 33M/98M
[INFO] ------------------------------------------------------------------------
[ERROR] Failed to execute goal org.apache.maven.plugins:maven-compiler-plugin:3.2:compile
(default-compile) on project tika-parsers: Compilation failure: Compilation failure:
[ERROR] /srv/gump/public/workspace/tika/tika-parsers/src/main/java/org/apache/tika/parser/font/AdobeFontMetricParser.java:[26,30]
cannot find symbol
[ERROR] symbol:   class FontMetric
[ERROR] location: package org.apache.fontbox.afm
[ERROR] /srv/gump/public/workspace/tika/tika-parsers/src/main/java/org/apache/tika/parser/font/AdobeFontMetricParser.java:[70,8]
cannot find symbol
[ERROR] symbol:   class FontMetric
[ERROR] location: class org.apache.tika.parser.font.AdobeFontMetricParser
[ERROR] /srv/gump/public/workspace/tika/tika-parsers/src/main/java/org/apache/tika/parser/font/AdobeFontMetricParser.java:[75,28]
cannot find symbol
[ERROR] symbol:   method getResult()
[ERROR] location: variable parser of type org.apache.fontbox.afm.AFMParser
[ERROR] /srv/gump/public/workspace/tika/tika-parsers/src/main/java/org/apache/tika/parser/font/TrueTypeParser.java:[67,26]
cannot find symbol
[ERROR] symbol:   method parseTTF(java.io.File)
[ERROR] location: variable parser of type org.apache.fontbox.ttf.TTFParser
[ERROR] /srv/gump/public/workspace/tika/tika-parsers/src/main/java/org/apache/tika/parser/font/TrueTypeParser.java:[69,26]
cannot find symbol
[ERROR] symbol:   method parseTTF(java.io.InputStream)
[ERROR] location: variable parser of type org.apache.fontbox.ttf.TTFParser
[ERROR] /srv/gump/public/workspace/tika/tika-parsers/src/main/java/org/apache/tika/parser/utils/CommonsDigester.java:[136,41]
cannot find symbol
[ERROR] symbol:   method md2Hex(java.io.InputStream)
[ERROR] location: class org.apache.commons.codec.digest.DigestUtils
[ERROR] /srv/gump/public/workspace/tika/tika-parsers/src/main/java/org/apache/tika/parser/utils/CommonsDigester.java:[142,41]
cannot find symbol
[ERROR] symbol:   method sha1Hex(java.io.InputStream)
[ERROR] location: class org.apache.commons.codec.digest.DigestUtils
[ERROR] -> [Help 1]
[ERROR] 
[ERROR] To see the full stack trace of the errors, re-run Maven with the -e switch.
[ERROR] Re-run Maven using the -X switch to enable full debug logging.
[ERROR] 
[ERROR] For more information about the errors and possible solutions, please read the following
articles:
[ERROR] [Help 1] http://cwiki.apache.org/confluence/display/MAVEN/MojoFailureException
---------------------------------------------

To subscribe to this information via syndicated feeds:
- RSS: http://vmgump.apache.org/gump/public/tika/tika-parsers/rss.xml
- Atom: http://vmgump.apache.org/gump/public/tika/tika-parsers/atom.xml

============================== Gump Tracking Only ===
Produced by Apache Gump(TM) version 2.3.
Gump Run 20150822000005, vmgump.apache.org:vmgump:20150822000005
Gump E-mail Identifier (unique within run) #3.

*********************************************************** G U M P
[GUMP@vmgump]: Project tika-reactor (in module tika) failed
To whom it may engage...
        
This is an automated request, but not an unsolicited one. For 
more information please visit http://gump.apache.org/nagged.html, 
and/or contact the folk at general@gump.apache.org.

Project tika-reactor has an issue affecting its community integration.
This issue affects 1 projects,
 and has been outstanding for 326 runs.
The current state of this project is 'Failed', with reason 'Build Failed'.
For reference only, the following projects are affected by this:
    - tika-reactor :  Apache Tika is a toolkit for detecting and extracting metada...


Full details are available at:
    http://vmgump.apache.org/gump/public/tika/tika-reactor/index.html

That said, some information snippets are provided here.

The following annotations (debug/informational/warning/error messages) were provided:
 -INFO- Optional dependency tika-parsers failed with reason build failed
 -DEBUG- (Apache Gump generated) Apache Maven Settings in: /srv/gump/public/workspace/tika/gump_mvn_settings.xml
 -INFO- Failed with reason build failed
 -DEBUG- Maven POM in: /srv/gump/public/workspace/tika/pom.xml



The following work was performed:
http://vmgump.apache.org/gump/public/tika/tika-reactor/gump_work/build_tika_tika-reactor.html
Work Name: build_tika_tika-reactor (Type: Build)
Work ended in a state of : Failed
Elapsed: 1 min 17 secs
Command Line: /opt/maven3/bin/mvn --batch-mode -DskipTests=true --settings /srv/gump/public/workspace/tika/gump_mvn_settings.xml
install 
[Working Directory: /srv/gump/public/workspace/tika]
MAVEN_OPTS: -Xmx512m 
M2_HOME: /opt/maven3
---------------------------------------------
[INFO] Apache Tika parsers ................................ FAILURE [ 31.260 s]
[INFO] Apache Tika XMP .................................... SKIPPED
[INFO] Apache Tika serialization .......................... SKIPPED
[INFO] Apache Tika batch .................................. SKIPPED
[INFO] Apache Tika application ............................ SKIPPED
[INFO] Apache Tika OSGi bundle ............................ SKIPPED
[INFO] Apache Tika translate .............................. SKIPPED
[INFO] Apache Tika server ................................. SKIPPED
[INFO] Apache Tika examples ............................... SKIPPED
[INFO] Apache Tika Java-7 Components ...................... SKIPPED
[INFO] Apache Tika ........................................ SKIPPED
[INFO] ------------------------------------------------------------------------
[INFO] BUILD FAILURE
[INFO] ------------------------------------------------------------------------
[INFO] Total time: 01:09 min
[INFO] Finished at: 2015-08-22T01:54:09+00:00
[INFO] Final Memory: 43M/127M
[INFO] ------------------------------------------------------------------------
[ERROR] Failed to execute goal org.apache.maven.plugins:maven-compiler-plugin:3.2:compile
(default-compile) on project tika-parsers: Compilation failure: Compilation failure:
[ERROR] /srv/gump/public/workspace/tika/tika-parsers/src/main/java/org/apache/tika/parser/font/AdobeFontMetricParser.java:[26,30]
cannot find symbol
[ERROR] symbol:   class FontMetric
[ERROR] location: package org.apache.fontbox.afm
[ERROR] /srv/gump/public/workspace/tika/tika-parsers/src/main/java/org/apache/tika/parser/font/AdobeFontMetricParser.java:[70,8]
cannot find symbol
[ERROR] symbol:   class FontMetric
[ERROR] location: class org.apache.tika.parser.font.AdobeFontMetricParser
[ERROR] /srv/gump/public/workspace/tika/tika-parsers/src/main/java/org/apache/tika/parser/font/AdobeFontMetricParser.java:[75,28]
cannot find symbol
[ERROR] symbol:   method getResult()
[ERROR] location: variable parser of type org.apache.fontbox.afm.AFMParser
[ERROR] /srv/gump/public/workspace/tika/tika-parsers/src/main/java/org/apache/tika/parser/font/TrueTypeParser.java:[67,26]
cannot find symbol
[ERROR] symbol:   method parseTTF(java.io.File)
[ERROR] location: variable parser of type org.apache.fontbox.ttf.TTFParser
[ERROR] /srv/gump/public/workspace/tika/tika-parsers/src/main/java/org/apache/tika/parser/font/TrueTypeParser.java:[69,26]
cannot find symbol
[ERROR] symbol:   method parseTTF(java.io.InputStream)
[ERROR] location: variable parser of type org.apache.fontbox.ttf.TTFParser
[ERROR] /srv/gump/public/workspace/tika/tika-parsers/src/main/java/org/apache/tika/parser/utils/CommonsDigester.java:[136,41]
cannot find symbol
[ERROR] symbol:   method md2Hex(java.io.InputStream)
[ERROR] location: class org.apache.commons.codec.digest.DigestUtils
[ERROR] /srv/gump/public/workspace/tika/tika-parsers/src/main/java/org/apache/tika/parser/utils/CommonsDigester.java:[142,41]
cannot find symbol
[ERROR] symbol:   method sha1Hex(java.io.InputStream)
[ERROR] location: class org.apache.commons.codec.digest.DigestUtils
[ERROR] -> [Help 1]
[ERROR] 
[ERROR] To see the full stack trace of the errors, re-run Maven with the -e switch.
[ERROR] Re-run Maven using the -X switch to enable full debug logging.
[ERROR] 
[ERROR] For more information about the errors and possible solutions, please read the following
articles:
[ERROR] [Help 1] http://cwiki.apache.org/confluence/display/MAVEN/MojoFailureException
[ERROR] 
[ERROR] After correcting the problems, you can resume the build with the command
[ERROR]   mvn <goals> -rf :tika-parsers
---------------------------------------------

To subscribe to this information via syndicated feeds:
- RSS: http://vmgump.apache.org/gump/public/tika/tika-reactor/rss.xml
- Atom: http://vmgump.apache.org/gump/public/tika/tika-reactor/atom.xml

============================== Gump Tracking Only ===
Produced by Apache Gump(TM) version 2.3.
Gump Run 20150822000005, vmgump.apache.org:vmgump:20150822000005
Gump E-mail Identifier (unique within run) #4.


--
Apache Gump
http://gump.apache.org/ [Instance: vmgump]

---------------------------------------------------------------------
To unsubscribe, e-mail: general-unsubscribe@gump.apache.org
For additional commands, e-mail: general-help@gump.apache.org


Mime
View raw message