gump-general mailing list archives

Site index · List index
Message view « Date » · « Thread »
Top « Date » · « Thread »
Subject BATCH: All dressed up, with nowhere to go...
Date Thu, 20 Aug 2015 11:45:02 GMT
Dear Gumpmeisters,
The following 1 notifys should have been sent

*********************************************************** G U M P
[GUMP@vmgump]: Project checkstyle (in module checkstyle) failed
*********************************************************** G U M P
[GUMP@vmgump]: Project checkstyle (in module checkstyle) failed
To whom it may engage...
This is an automated request, but not an unsolicited one. For 
more information please visit, 
and/or contact the folk at

Project checkstyle has an issue affecting its community integration.
This issue affects 5 projects.
The current state of this project is 'Failed', with reason 'Build Failed'.
For reference only, the following projects are affected by this:
    - checkstyle :  Java style checker
    - tomcat-tc7.0.x-validate :  Tomcat 7.x, a web server implementing Java Servlet 3.0,
    - tomcat-tc8.0.x-validate :  Tomcat 8.x, a web server implementing the Java Servlet 3.1,
    - tomcat-trunk-validate :  Tomcat 9.x, a web server implementing the Java Servlet 4.0,
    - xmlgraphics-commons-test :  Apache XML Graphics Commons - Common Components for Batik

Full details are available at:

That said, some information snippets are provided here.

The following annotations (debug/informational/warning/error messages) were provided:
 -DEBUG- (Apache Gump generated) Apache Maven Settings in: /srv/gump/public/workspace/checkstyle/gump_mvn_settings.xml
 -INFO- Failed with reason build failed
 -DEBUG- Maven POM in: /srv/gump/public/workspace/checkstyle/pom.xml
 -INFO- Failed to extract fallback artifacts from Gump Repository

The following work was performed:
Work Name: build_checkstyle_checkstyle (Type: Build)
Work ended in a state of : Failed
Elapsed: 7 mins 44 secs
Command Line: /opt/maven3/bin/mvn --batch-mode -Dcobertura.skip=true -DskipTests=true --settings
/srv/gump/public/workspace/checkstyle/gump_mvn_settings.xml install 
[Working Directory: /srv/gump/public/workspace/checkstyle]
M2_HOME: /opt/maven3
[INFO] Downloaded: http://localhost:8192/maven2/net/sourceforge/pmd/pmd-jsp/5.3.2/pmd-jsp-5.3.2.pom
(5 KB at 43.1 KB/sec)
[INFO] Downloading:
[INFO] Downloading:
[INFO] Downloading:
[INFO] Downloading:
[INFO] Downloading:
[INFO] Downloading:
[INFO] Downloading:
[INFO] Downloading:
[INFO] Downloading:
[INFO] Downloading:
[INFO] Downloading:
[INFO] Downloading:
[INFO] Downloading: http://localhost:8192/maven2/dom4j/dom4j/1.6.1/dom4j-1.6.1.jar
[INFO] Downloading: http://localhost:8192/maven2/org/codehaus/plexus/plexus-resources/1.0.1/plexus-resources-1.0.1.jar
[INFO] Downloading: http://localhost:8192/maven2/net/sourceforge/pmd/pmd-core/5.3.2/pmd-core-5.3.2.jar
[INFO] Downloading: http://localhost:8192/maven2/jaxen/jaxen/1.1.4/jaxen-1.1.4.jar
[INFO] Downloading: http://localhost:8192/maven2/net/java/dev/javacc/javacc/5.0/javacc-5.0.jar
[INFO] Downloading: http://localhost:8192/maven2/net/sourceforge/saxon/saxon/
[INFO] Downloaded: http://localhost:8192/maven2/dom4j/dom4j/1.6.1/dom4j-1.6.1.jar (307 KB
at 400.7 KB/sec)
[INFO] Downloading: http://localhost:8192/maven2/org/apache/commons/commons-lang3/3.3.2/commons-lang3-3.3.2.jar
[INFO] Downloaded: http://localhost:8192/maven2/jaxen/jaxen/1.1.4/jaxen-1.1.4.jar (221 KB
at 282.1 KB/sec)
[INFO] Downloading: http://localhost:8192/maven2/net/sourceforge/saxon/saxon/
[INFO] Downloaded: http://localhost:8192/maven2/net/java/dev/javacc/javacc/5.0/javacc-5.0.jar
(292 KB at 354.7 KB/sec)
[INFO] Downloading: http://localhost:8192/maven2/net/sourceforge/pmd/pmd-java/5.3.2/pmd-java-5.3.2.jar
[INFO] Downloaded: http://localhost:8192/maven2/net/sourceforge/pmd/pmd-core/5.3.2/pmd-core-5.3.2.jar
(658 KB at 759.2 KB/sec)
[INFO] Downloading: http://localhost:8192/maven2/net/sourceforge/pmd/pmd-javascript/5.3.2/pmd-javascript-5.3.2.jar
[INFO] Downloaded: http://localhost:8192/maven2/org/apache/commons/commons-lang3/3.3.2/commons-lang3-3.3.2.jar
(443 KB at 3913.7 KB/sec)
[INFO] Downloading: http://localhost:8192/maven2/org/mozilla/rhino/1.7R4/rhino-1.7R4.jar
[INFO] Downloaded: http://localhost:8192/maven2/net/sourceforge/saxon/saxon/
(127 KB at 137.9 KB/sec)
[INFO] Downloading: http://localhost:8192/maven2/net/sourceforge/pmd/pmd-jsp/5.3.2/pmd-jsp-5.3.2.jar
[INFO] Downloaded: http://localhost:8192/maven2/net/sourceforge/pmd/pmd-java/5.3.2/pmd-java-5.3.2.jar
(702 KB at 719.5 KB/sec)
[INFO] Downloaded: http://localhost:8192/maven2/net/sourceforge/pmd/pmd-javascript/5.3.2/pmd-javascript-5.3.2.jar
(96 KB at 98.0 KB/sec)
[INFO] Downloaded: http://localhost:8192/maven2/net/sourceforge/saxon/saxon/
(4929 KB at 2684.2 KB/sec)
[INFO] Downloaded: http://localhost:8192/maven2/net/sourceforge/pmd/pmd-jsp/5.3.2/pmd-jsp-5.3.2.jar
(91 KB at 339.5 KB/sec)
[INFO] Downloaded: http://localhost:8192/maven2/org/mozilla/rhino/1.7R4/rhino-1.7R4.jar (1109
KB at 895.1 KB/sec)
[INFO] ------------------------------------------------------------------------
[INFO] ------------------------------------------------------------------------
[INFO] Total time: 07:41 min
[INFO] Finished at: 2015-08-20T08:29:05+00:00
[INFO] Final Memory: 33M/184M
[INFO] ------------------------------------------------------------------------
[ERROR] Failed to execute goal org.apache.maven.plugins:maven-pmd-plugin:3.5:pmd (pmd) on
project checkstyle: Execution pmd of goal org.apache.maven.plugins:maven-pmd-plugin:3.5:pmd
failed: Plugin org.apache.maven.plugins:maven-pmd-plugin:3.5 or one of its dependencies could
not be resolved: Could not transfer artifact org.codehaus.plexus:plexus-resources:jar:1.0.1
from/to nexus-snapshot (
Unknown host -> [Help 1]
[ERROR] To see the full stack trace of the errors, re-run Maven with the -e switch.
[ERROR] Re-run Maven using the -X switch to enable full debug logging.
[ERROR] For more information about the errors and possible solutions, please read the following
[ERROR] [Help 1]

To subscribe to this information via syndicated feeds:
- RSS:
- Atom:

============================== Gump Tracking Only ===
Produced by Apache Gump(TM) version 2.3.
Gump Run 20150820060003,
Gump E-mail Identifier (unique within run) #2.

Apache Gump [Instance: vmgump]

To unsubscribe, e-mail:
For additional commands, e-mail:

View raw message