gump-general mailing list archives

Site index · List index
Message view « Date » · « Thread »
Top « Date » · « Thread »
From g...@vmgump.apache.org
Subject BATCH: All dressed up, with nowhere to go...
Date Sat, 13 Jun 2015 02:01:47 GMT
Dear Gumpmeisters,
            
The following 20 notifys should have been sent

*********************************************************** G U M P
[GUMP@vmgump]: Module apache-commons failed
[GUMP@vmgump]: Project commons-daemon-native-buildconf (in module apache-commons) failed
[GUMP@vmgump]: Project commons-daemon-native (in module apache-commons) failed
[GUMP@vmgump]: Project bcel (in module apache-commons) failed
[GUMP@vmgump]: Project commons-io (in module apache-commons) failed
[GUMP@vmgump]: Project commons-fileupload (in module apache-commons) failed
[GUMP@vmgump]: Project commons-net (in module apache-commons) failed
[GUMP@vmgump]: Project commons-daemon (in module apache-commons) failed
[GUMP@vmgump]: Project commons-pool2 (in module apache-commons) failed
[GUMP@vmgump]: Project commons-launcher (in module apache-commons) failed
[GUMP@vmgump]: Project commons-logging-step-1 (in module apache-commons) failed
[GUMP@vmgump]: Project commons-compress (in module apache-commons) failed
[GUMP@vmgump]: Project commons-logging (in module apache-commons) failed
[GUMP@vmgump]: Project commons-beanutils (in module apache-commons) failed
[GUMP@vmgump]: Project commons-jxpath (in module apache-commons) failed
[GUMP@vmgump]: Project test-ant (in module ant) failed
[GUMP@vmgump]: Project commons-cli (in module apache-commons) failed
[GUMP@vmgump]: Project tika-parsers (in module tika) failed
[GUMP@vmgump]: Project tika-reactor (in module tika) failed
[GUMP@vmgump]: Project commons-exec (in module apache-commons) failed
*********************************************************** G U M P
[GUMP@vmgump]: Module apache-commons failed
To whom it may engage...
        
This is an automated request, but not an unsolicited one. For 
more information please visit http://gump.apache.org/nagged.html, 
and/or contact the folk at general@gump.apache.org.

Module apache-commons has an issue affecting its community integration,
 and has been outstanding for 7 runs.
The current state of this module is 'Failed', with reason 'Update Failed'.

Full details are available at:
    http://vmgump.apache.org/gump/public/apache-commons/index.html

That said, some information snippets are provided here.

The following annotations (debug/informational/warning/error messages) were provided:
 -INFO- Failed with reason update failed



The following work was performed:
http://vmgump.apache.org/gump/public/apache-commons/gump_work/update_apache-commons.html
Work Name: update_apache-commons (Type: Update)
Work ended in a state of : Failed
Elapsed: 10 secs
Command Line: svn --quiet update --non-interactive apache-commons 
[Working Directory: /srv/gump/public/workspace/cvs]
---------------------------------------------
svn: E205011: Failure occurred processing one or more externals definitions
---------------------------------------------

To subscribe to this information via syndicated feeds:
- RSS: http://vmgump.apache.org/gump/public/apache-commons/rss.xml
- Atom: http://vmgump.apache.org/gump/public/apache-commons/atom.xml

============================== Gump Tracking Only ===
Produced by Apache Gump(TM) version 2.3.
Gump Run 20150613000015, vmgump.apache.org:vmgump:20150613000015
Gump E-mail Identifier (unique within run) #1.

*********************************************************** G U M P
[GUMP@vmgump]: Project commons-daemon-native-buildconf (in module apache-commons) failed
To whom it may engage...
        
This is an automated request, but not an unsolicited one. For 
more information please visit http://gump.apache.org/nagged.html, 
and/or contact the folk at general@gump.apache.org.

Project commons-daemon-native-buildconf has an issue affecting its community integration,
 and has been outstanding for 7 runs.
The current state of this project is 'Failed', with reason 'Update Failed'.

Full details are available at:
    http://vmgump.apache.org/gump/public/apache-commons/commons-daemon-native-buildconf/index.html

That said, some information snippets are provided here.

The following annotations (debug/informational/warning/error messages) were provided:
 -INFO- Failed with reason update failed

To subscribe to this information via syndicated feeds:
- RSS: http://vmgump.apache.org/gump/public/apache-commons/commons-daemon-native-buildconf/rss.xml
- Atom: http://vmgump.apache.org/gump/public/apache-commons/commons-daemon-native-buildconf/atom.xml

============================== Gump Tracking Only ===
Produced by Apache Gump(TM) version 2.3.
Gump Run 20150613000015, vmgump.apache.org:vmgump:20150613000015
Gump E-mail Identifier (unique within run) #2.

*********************************************************** G U M P
[GUMP@vmgump]: Project commons-daemon-native (in module apache-commons) failed
To whom it may engage...
        
This is an automated request, but not an unsolicited one. For 
more information please visit http://gump.apache.org/nagged.html, 
and/or contact the folk at general@gump.apache.org.

Project commons-daemon-native has an issue affecting its community integration,
 and has been outstanding for 7 runs.
The current state of this project is 'Failed', with reason 'Update Failed'.

Full details are available at:
    http://vmgump.apache.org/gump/public/apache-commons/commons-daemon-native/index.html

That said, some information snippets are provided here.

The following annotations (debug/informational/warning/error messages) were provided:
 -INFO- Failed with reason update failed

To subscribe to this information via syndicated feeds:
- RSS: http://vmgump.apache.org/gump/public/apache-commons/commons-daemon-native/rss.xml
- Atom: http://vmgump.apache.org/gump/public/apache-commons/commons-daemon-native/atom.xml

============================== Gump Tracking Only ===
Produced by Apache Gump(TM) version 2.3.
Gump Run 20150613000015, vmgump.apache.org:vmgump:20150613000015
Gump E-mail Identifier (unique within run) #3.

*********************************************************** G U M P
[GUMP@vmgump]: Project bcel (in module apache-commons) failed
To whom it may engage...
        
This is an automated request, but not an unsolicited one. For 
more information please visit http://gump.apache.org/nagged.html, 
and/or contact the folk at general@gump.apache.org.

Project bcel has an issue affecting its community integration,
 and has been outstanding for 7 runs.
The current state of this project is 'Failed', with reason 'Update Failed'.

Full details are available at:
    http://vmgump.apache.org/gump/public/apache-commons/bcel/index.html

That said, some information snippets are provided here.

The following annotations (debug/informational/warning/error messages) were provided:
 -DEBUG- Sole jar output [bcel-[0-9]*[0-9T].jar] identifier set to project name
 -INFO- Failed with reason update failed
 -INFO- Failed to extract fallback artifacts from Gump Repository

To subscribe to this information via syndicated feeds:
- RSS: http://vmgump.apache.org/gump/public/apache-commons/bcel/rss.xml
- Atom: http://vmgump.apache.org/gump/public/apache-commons/bcel/atom.xml

============================== Gump Tracking Only ===
Produced by Apache Gump(TM) version 2.3.
Gump Run 20150613000015, vmgump.apache.org:vmgump:20150613000015
Gump E-mail Identifier (unique within run) #4.

*********************************************************** G U M P
[GUMP@vmgump]: Project commons-io (in module apache-commons) failed
To whom it may engage...
        
This is an automated request, but not an unsolicited one. For 
more information please visit http://gump.apache.org/nagged.html, 
and/or contact the folk at general@gump.apache.org.

Project commons-io has an issue affecting its community integration,
 and has been outstanding for 7 runs.
The current state of this project is 'Failed', with reason 'Update Failed'.

Full details are available at:
    http://vmgump.apache.org/gump/public/apache-commons/commons-io/index.html

That said, some information snippets are provided here.

The following annotations (debug/informational/warning/error messages) were provided:
 -DEBUG- Sole jar output [commons-io-*[0-9T].jar] identifier set to project name
 -INFO- Failed with reason update failed
 -INFO- Failed to extract fallback artifacts from Gump Repository

To subscribe to this information via syndicated feeds:
- RSS: http://vmgump.apache.org/gump/public/apache-commons/commons-io/rss.xml
- Atom: http://vmgump.apache.org/gump/public/apache-commons/commons-io/atom.xml

============================== Gump Tracking Only ===
Produced by Apache Gump(TM) version 2.3.
Gump Run 20150613000015, vmgump.apache.org:vmgump:20150613000015
Gump E-mail Identifier (unique within run) #5.

*********************************************************** G U M P
[GUMP@vmgump]: Project commons-fileupload (in module apache-commons) failed
To whom it may engage...
        
This is an automated request, but not an unsolicited one. For 
more information please visit http://gump.apache.org/nagged.html, 
and/or contact the folk at general@gump.apache.org.

Project commons-fileupload has an issue affecting its community integration,
 and has been outstanding for 7 runs.
The current state of this project is 'Failed', with reason 'Update Failed'.

Full details are available at:
    http://vmgump.apache.org/gump/public/apache-commons/commons-fileupload/index.html

That said, some information snippets are provided here.

The following annotations (debug/informational/warning/error messages) were provided:
 -DEBUG- Sole jar output [commons-fileupload-*[0-9T].jar] identifier set to project name
 -INFO- Optional dependency commons-io failed with reason update failed
 -INFO- Failed with reason update failed
 -INFO- Failed to extract fallback artifacts from Gump Repository

To subscribe to this information via syndicated feeds:
- RSS: http://vmgump.apache.org/gump/public/apache-commons/commons-fileupload/rss.xml
- Atom: http://vmgump.apache.org/gump/public/apache-commons/commons-fileupload/atom.xml

============================== Gump Tracking Only ===
Produced by Apache Gump(TM) version 2.3.
Gump Run 20150613000015, vmgump.apache.org:vmgump:20150613000015
Gump E-mail Identifier (unique within run) #6.

*********************************************************** G U M P
[GUMP@vmgump]: Project commons-net (in module apache-commons) failed
To whom it may engage...
        
This is an automated request, but not an unsolicited one. For 
more information please visit http://gump.apache.org/nagged.html, 
and/or contact the folk at general@gump.apache.org.

Project commons-net has an issue affecting its community integration,
 and has been outstanding for 7 runs.
The current state of this project is 'Failed', with reason 'Update Failed'.

Full details are available at:
    http://vmgump.apache.org/gump/public/apache-commons/commons-net/index.html

That said, some information snippets are provided here.

The following annotations (debug/informational/warning/error messages) were provided:
 -INFO- Failed with reason update failed
 -INFO- Failed to extract fallback artifacts from Gump Repository

To subscribe to this information via syndicated feeds:
- RSS: http://vmgump.apache.org/gump/public/apache-commons/commons-net/rss.xml
- Atom: http://vmgump.apache.org/gump/public/apache-commons/commons-net/atom.xml

============================== Gump Tracking Only ===
Produced by Apache Gump(TM) version 2.3.
Gump Run 20150613000015, vmgump.apache.org:vmgump:20150613000015
Gump E-mail Identifier (unique within run) #7.

*********************************************************** G U M P
[GUMP@vmgump]: Project commons-daemon (in module apache-commons) failed
To whom it may engage...
        
This is an automated request, but not an unsolicited one. For 
more information please visit http://gump.apache.org/nagged.html, 
and/or contact the folk at general@gump.apache.org.

Project commons-daemon has an issue affecting its community integration,
 and has been outstanding for 7 runs.
The current state of this project is 'Failed', with reason 'Update Failed'.

Full details are available at:
    http://vmgump.apache.org/gump/public/apache-commons/commons-daemon/index.html

That said, some information snippets are provided here.

The following annotations (debug/informational/warning/error messages) were provided:
 -INFO- Failed with reason update failed
 -INFO- Failed to extract fallback artifacts from Gump Repository

To subscribe to this information via syndicated feeds:
- RSS: http://vmgump.apache.org/gump/public/apache-commons/commons-daemon/rss.xml
- Atom: http://vmgump.apache.org/gump/public/apache-commons/commons-daemon/atom.xml

============================== Gump Tracking Only ===
Produced by Apache Gump(TM) version 2.3.
Gump Run 20150613000015, vmgump.apache.org:vmgump:20150613000015
Gump E-mail Identifier (unique within run) #8.

*********************************************************** G U M P
[GUMP@vmgump]: Project commons-pool2 (in module apache-commons) failed
To whom it may engage...
        
This is an automated request, but not an unsolicited one. For 
more information please visit http://gump.apache.org/nagged.html, 
and/or contact the folk at general@gump.apache.org.

Project commons-pool2 has an issue affecting its community integration,
 and has been outstanding for 7 runs.
The current state of this project is 'Failed', with reason 'Update Failed'.

Full details are available at:
    http://vmgump.apache.org/gump/public/apache-commons/commons-pool2/index.html

That said, some information snippets are provided here.

The following annotations (debug/informational/warning/error messages) were provided:
 -DEBUG- Sole jar output [commons-pool?-*[0-9T].jar] identifier set to project name
 -INFO- Failed with reason update failed
 -INFO- Failed to extract fallback artifacts from Gump Repository

To subscribe to this information via syndicated feeds:
- RSS: http://vmgump.apache.org/gump/public/apache-commons/commons-pool2/rss.xml
- Atom: http://vmgump.apache.org/gump/public/apache-commons/commons-pool2/atom.xml

============================== Gump Tracking Only ===
Produced by Apache Gump(TM) version 2.3.
Gump Run 20150613000015, vmgump.apache.org:vmgump:20150613000015
Gump E-mail Identifier (unique within run) #9.

*********************************************************** G U M P
[GUMP@vmgump]: Project commons-launcher (in module apache-commons) failed
To whom it may engage...
        
This is an automated request, but not an unsolicited one. For 
more information please visit http://gump.apache.org/nagged.html, 
and/or contact the folk at general@gump.apache.org.

Project commons-launcher has an issue affecting its community integration,
 and has been outstanding for 7 runs.
The current state of this project is 'Failed', with reason 'Update Failed'.

Full details are available at:
    http://vmgump.apache.org/gump/public/apache-commons/commons-launcher/index.html

That said, some information snippets are provided here.

The following annotations (debug/informational/warning/error messages) were provided:
 -DEBUG- Sole jar output [commons-launcher-20150613.jar] identifier set to project name
 -DEBUG- Dependency on ant exists, no need to add for property ant.home.
 -INFO- Failed with reason update failed
 -INFO- Failed to extract fallback artifacts from Gump Repository

To subscribe to this information via syndicated feeds:
- RSS: http://vmgump.apache.org/gump/public/apache-commons/commons-launcher/rss.xml
- Atom: http://vmgump.apache.org/gump/public/apache-commons/commons-launcher/atom.xml

============================== Gump Tracking Only ===
Produced by Apache Gump(TM) version 2.3.
Gump Run 20150613000015, vmgump.apache.org:vmgump:20150613000015
Gump E-mail Identifier (unique within run) #10.

*********************************************************** G U M P
[GUMP@vmgump]: Project commons-logging-step-1 (in module apache-commons) failed
To whom it may engage...
        
This is an automated request, but not an unsolicited one. For 
more information please visit http://gump.apache.org/nagged.html, 
and/or contact the folk at general@gump.apache.org.

Project commons-logging-step-1 has an issue affecting its community integration,
 and has been outstanding for 7 runs.
The current state of this project is 'Failed', with reason 'Update Failed'.

Full details are available at:
    http://vmgump.apache.org/gump/public/apache-commons/commons-logging-step-1/index.html

That said, some information snippets are provided here.

The following annotations (debug/informational/warning/error messages) were provided:
 -DEBUG- Dependency on logging-log4j-12 exists, no need to add for property log4j12.jar.
 -DEBUG- Dependency on avalon-logkit exists, no need to add for property logkit.jar.
 -DEBUG- Dependency on avalon-framework-api exists, no need to add for property avalon-framework.jar.
 -INFO- Failed with reason update failed

To subscribe to this information via syndicated feeds:
- RSS: http://vmgump.apache.org/gump/public/apache-commons/commons-logging-step-1/rss.xml
- Atom: http://vmgump.apache.org/gump/public/apache-commons/commons-logging-step-1/atom.xml

============================== Gump Tracking Only ===
Produced by Apache Gump(TM) version 2.3.
Gump Run 20150613000015, vmgump.apache.org:vmgump:20150613000015
Gump E-mail Identifier (unique within run) #11.

*********************************************************** G U M P
[GUMP@vmgump]: Project commons-compress (in module apache-commons) failed
To whom it may engage...
        
This is an automated request, but not an unsolicited one. For 
more information please visit http://gump.apache.org/nagged.html, 
and/or contact the folk at general@gump.apache.org.

Project commons-compress has an issue affecting its community integration,
 and has been outstanding for 7 runs.
The current state of this project is 'Failed', with reason 'Update Failed'.

Full details are available at:
    http://vmgump.apache.org/gump/public/apache-commons/commons-compress/index.html

That said, some information snippets are provided here.

The following annotations (debug/informational/warning/error messages) were provided:
 -DEBUG- Sole jar output [commons-compress-*[0-9T].jar] identifier set to project name
 -INFO- Failed with reason update failed
 -INFO- Failed to extract fallback artifacts from Gump Repository

To subscribe to this information via syndicated feeds:
- RSS: http://vmgump.apache.org/gump/public/apache-commons/commons-compress/rss.xml
- Atom: http://vmgump.apache.org/gump/public/apache-commons/commons-compress/atom.xml

============================== Gump Tracking Only ===
Produced by Apache Gump(TM) version 2.3.
Gump Run 20150613000015, vmgump.apache.org:vmgump:20150613000015
Gump E-mail Identifier (unique within run) #12.

*********************************************************** G U M P
[GUMP@vmgump]: Project commons-logging (in module apache-commons) failed
To whom it may engage...
        
This is an automated request, but not an unsolicited one. For 
more information please visit http://gump.apache.org/nagged.html, 
and/or contact the folk at general@gump.apache.org.

Project commons-logging has an issue affecting its community integration,
 and has been outstanding for 7 runs.
The current state of this project is 'Failed', with reason 'Update Failed'.

Full details are available at:
    http://vmgump.apache.org/gump/public/apache-commons/commons-logging/index.html

That said, some information snippets are provided here.

The following annotations (debug/informational/warning/error messages) were provided:
 -DEBUG- Dependency on logging-log4j-12 exists, no need to add for property log4j13.jar.
 -DEBUG- Dependency on avalon-logkit exists, no need to add for property logkit.jar.
 -DEBUG- Dependency on avalon-framework-api exists, no need to add for property avalon-framework.jar.
 -INFO- Failed with reason update failed
 -INFO- Failed to extract fallback artifacts from Gump Repository

To subscribe to this information via syndicated feeds:
- RSS: http://vmgump.apache.org/gump/public/apache-commons/commons-logging/rss.xml
- Atom: http://vmgump.apache.org/gump/public/apache-commons/commons-logging/atom.xml

============================== Gump Tracking Only ===
Produced by Apache Gump(TM) version 2.3.
Gump Run 20150613000015, vmgump.apache.org:vmgump:20150613000015
Gump E-mail Identifier (unique within run) #13.

*********************************************************** G U M P
[GUMP@vmgump]: Project commons-beanutils (in module apache-commons) failed
To whom it may engage...
        
This is an automated request, but not an unsolicited one. For 
more information please visit http://gump.apache.org/nagged.html, 
and/or contact the folk at general@gump.apache.org.

Project commons-beanutils has an issue affecting its community integration,
 and has been outstanding for 7 runs.
The current state of this project is 'Failed', with reason 'Update Failed'.

Full details are available at:
    http://vmgump.apache.org/gump/public/apache-commons/commons-beanutils/index.html

That said, some information snippets are provided here.

The following annotations (debug/informational/warning/error messages) were provided:
 -DEBUG- Sole pom output [pom.xml] identifier set to project name
 -DEBUG- Dependency on junit exists, no need to add for property junit.home.
 -INFO- Failed with reason update failed
 -INFO- Failed to extract fallback artifacts from Gump Repository

To subscribe to this information via syndicated feeds:
- RSS: http://vmgump.apache.org/gump/public/apache-commons/commons-beanutils/rss.xml
- Atom: http://vmgump.apache.org/gump/public/apache-commons/commons-beanutils/atom.xml

============================== Gump Tracking Only ===
Produced by Apache Gump(TM) version 2.3.
Gump Run 20150613000015, vmgump.apache.org:vmgump:20150613000015
Gump E-mail Identifier (unique within run) #14.

*********************************************************** G U M P
[GUMP@vmgump]: Project commons-jxpath (in module apache-commons) failed
To whom it may engage...
        
This is an automated request, but not an unsolicited one. For 
more information please visit http://gump.apache.org/nagged.html, 
and/or contact the folk at general@gump.apache.org.

Project commons-jxpath has an issue affecting its community integration,
 and has been outstanding for 7 runs.
The current state of this project is 'Failed', with reason 'Update Failed'.

Full details are available at:
    http://vmgump.apache.org/gump/public/apache-commons/commons-jxpath/index.html

That said, some information snippets are provided here.

The following annotations (debug/informational/warning/error messages) were provided:
 -DEBUG- Sole jar output [commons-jxpath-*[0-9T].jar] identifier set to project name
 -INFO- Optional dependency commons-beanutils failed with reason update failed
 -INFO- Failed with reason update failed
 -INFO- Failed to extract fallback artifacts from Gump Repository

To subscribe to this information via syndicated feeds:
- RSS: http://vmgump.apache.org/gump/public/apache-commons/commons-jxpath/rss.xml
- Atom: http://vmgump.apache.org/gump/public/apache-commons/commons-jxpath/atom.xml

============================== Gump Tracking Only ===
Produced by Apache Gump(TM) version 2.3.
Gump Run 20150613000015, vmgump.apache.org:vmgump:20150613000015
Gump E-mail Identifier (unique within run) #15.

*********************************************************** G U M P
[GUMP@vmgump]: Project test-ant (in module ant) failed
To whom it may engage...
        
This is an automated request, but not an unsolicited one. For 
more information please visit http://gump.apache.org/nagged.html, 
and/or contact the folk at general@gump.apache.org.

Project test-ant has an issue affecting its community integration.
This issue affects 1 projects,
 and has been outstanding for 7 runs.
The current state of this project is 'Failed', with reason 'Build Failed'.
For reference only, the following projects are affected by this:
    - test-ant :  Java based build tool


Full details are available at:
    http://vmgump.apache.org/gump/public/ant/test-ant/index.html

That said, some information snippets are provided here.

The following annotations (debug/informational/warning/error messages) were provided:
 -WARNING- Bad *Optional* Dependency. Project: bsh : unknown to *this* workspace
 -INFO- Optional dependency xalan prerequisite failed with reason update failed
 -INFO- Failed with reason build failed



The following work was performed:
http://vmgump.apache.org/gump/public/ant/test-ant/gump_work/build_ant_test-ant.html
Work Name: build_ant_test-ant (Type: Build)
Work ended in a state of : Failed
Elapsed: 16 mins 45 secs
Command Line: /usr/lib/jvm/java-8-oracle/bin/java -Djava.awt.headless=true -Dbuild.sysclasspath=only
-Xbootclasspath/p:/srv/gump/public/workspace/xml-xerces2/build/xercesImpl.jar:/srv/gump/public/workspace/xml-commons/java/external/build/xml-apis.jar:/srv/gump/public/workspace/xml-xalan/build/xalan-unbundled.jar:/srv/gump/public/workspace/xml-xalan/build/serializer.jar
org.apache.tools.ant.Main -Dgump.merge=/srv/gump/public/gump/work/merge.xml -Dtest.haltonfailure=false
-Dant.home=/srv/gump/public/workspace/ant/dist run-tests 
[Working Directory: /srv/gump/public/workspace/ant]
CLASSPATH: /usr/lib/jvm/java-8-oracle/lib/tools.jar:/srv/gump/public/workspace/ant/build/testcases:/srv/gump/public/workspace/ant/src/tests/junit:/srv/gump/public/workspace/ant/src/etc/testcases:/srv/gump/public/workspace/ant/src/etc/testcases/taskdefs/optional/out:/srv/gump/public/workspace/ant/src/tests/antunit/filters:/srv/gump/public/workspace/ant/src/tests/antunit/taskdefs/importtests:/srv/gump/public/workspace/ant/src/tests/antunit/filters/foo:/srv/gump/public/workspace/ant/src/tests/antunit/taskdefs/foo:/srv/gump/public/workspace/ant/build/antunit/tmp/testinput/build:/srv/gump/public/workspace/ant/build/antunit/tmp/testoutput:/srv/gump/public/workspace/ant/build/antunit/tmp/test.jar:/srv/gump/public/workspace/ant/build/antunit/tmp/test1.jar:/srv/gump/public/workspace/ant/build/antunit/tmp/test2.jar:/srv/gump/public/workspace/ant/build/antunit/tmp/test3.jar:/srv/gump/public/workspace/ant/build/antunit/tmp/test4.jar:/srv/gump/public/workspace/ant/build/antunit/tmp/test5.jar:/srv
 /gump/public/workspace/ant/build/antunit/tmp/resources:/srv/gump/public/workspace/ant/build/lib/ant.jar:/srv/gump/public/workspace/ant/build/lib/ant-launcher.jar:/srv/gump/public/workspace/ant/build/lib/ant-antlr.jar:/srv/gump/public/workspace/ant/build/lib/ant-apache-bcel.jar:/srv/gump/public/workspace/ant/build/lib/ant-apache-bsf.jar:/srv/gump/public/workspace/ant/build/lib/ant-apache-log4j.jar:/srv/gump/public/workspace/ant/build/lib/ant-apache-oro.jar:/srv/gump/public/workspace/ant/build/lib/ant-apache-regexp.jar:/srv/gump/public/workspace/ant/build/lib/ant-apache-resolver.jar:/srv/gump/public/workspace/ant/build/lib/ant-apache-xalan2.jar:/srv/gump/public/workspace/ant/build/lib/ant-commons-logging.jar:/srv/gump/public/workspace/ant/build/lib/ant-commons-net.jar:/srv/gump/public/workspace/ant/build/lib/ant-jai.jar:/srv/gump/public/workspace/ant/build/lib/ant-javamail.jar:/srv/gump/public/workspace/ant/build/lib/ant-jdepend.jar:/srv/gump/public/workspace/ant/build/lib/ant-jmf.jar
 :/srv/gump/public/workspace/ant/build/lib/ant-jsch.jar:/srv/gump/public/workspace/ant/build/lib/ant-junit.jar:/srv/gump/public/workspace/ant/build/lib/ant-junit4.jar:/srv/gump/public/workspace/ant/build/lib/ant-swing.jar:/srv/gump/packages/antlr/antlr-3.1.3.jar:/srv/gump/public/workspace/apache-commons/bcel/target/bcel-[0-9]*[0-9T].jar:/srv/gump/public/workspace/apache-commons/logging/target/commons-logging-20150613.jar:/srv/gump/public/workspace/apache-commons/logging/target/commons-logging-api-20150613.jar:/srv/gump/public/workspace/apache-commons/net/target/commons-net-[0-9T]*[0-9T].jar:/srv/gump/public/workspace/apache-commons/net/target/commons-net-ftp-*[0-9T].jar:/srv/gump/packages/jaf-1.1ea/activation.jar:/srv/gump/public/workspace/jakarta-bsf/build/lib/bsf.jar:/srv/gump/packages/apache-attic/jakarta-regexp-1.5.jar:/srv/gump/public/workspace/jakarta-servletapi-5/jsr154/dist/lib/servlet-api.jar:/srv/gump/packages/javamail-1.4/mail.jar:/srv/gump/packages/javamail-1.4/lib/mailap
 i.jar:/srv/gump/packages/jdepend-2.6/lib/jdepend.jar:/srv/gump/packages/jsch/jsch-0.1.45.jar:/srv/gump/public/workspace/logging-log4j-12/target/log4j-1.2.18-SNAPSHOT.jar:/srv/gump/packages/apache-attic/oro-2.0.8.jar:/srv/gump/public/workspace/antlibs-antunit/build/ant-antunit-20150613.jar:/srv/gump/packages/hamcrest/hamcrest-core-1.3.jar:/srv/gump/public/workspace/junit/target/junit-4.13-SNAPSHOT.jar:/srv/gump/public/workspace/xml-commons/java/external/build/xml-apis-ext.jar:/srv/gump/public/workspace/commons-codec-1.x/dist/commons-codec-20150613.jar
---------------------------------------------
[au:antunit] Target: testExplicitLines took 0.007 sec
[au:antunit] Build File: /srv/gump/public/workspace/ant/src/tests/antunit/types/selectors/depend-test.xml
[au:antunit] Tests run: 1, Failures: 0, Errors: 0, Time elapsed: 0.007 sec
[au:antunit] Target: testMapperByTypedef took 0.005 sec
[au:antunit] Build File: /srv/gump/public/workspace/ant/src/tests/antunit/types/selectors/different-test.xml
[au:antunit] Tests run: 1, Failures: 0, Errors: 0, Time elapsed: 0.006 sec
[au:antunit] Target: testMapperByTypedef took 0.005 sec
[au:antunit] Build File: /srv/gump/public/workspace/ant/src/tests/antunit/types/selectors/filename-test.xml
[au:antunit] Tests run: 2, Failures: 0, Errors: 0, Time elapsed: 0.011 sec
[au:antunit] Target: testRegex took 0.005 sec
[au:antunit] Target: testPattern took 0.002 sec
[au:antunit] Build File: /srv/gump/public/workspace/ant/src/tests/antunit/types/selectors/modified-test.xml
[au:antunit] Tests run: 1, Failures: 0, Errors: 0, Time elapsed: 0.029 sec
[au:antunit] Target: testUpdate took 0.027 sec
[au:antunit] Build File: /srv/gump/public/workspace/ant/src/tests/antunit/types/selectors/present-test.xml
[au:antunit] Tests run: 1, Failures: 0, Errors: 0, Time elapsed: 0.003 sec
[au:antunit] Target: testMapperByTypedef took 0.001 sec
[au:antunit] Build File: /srv/gump/public/workspace/ant/src/tests/antunit/types/selectors/readwrite-test.xml
[au:antunit] Tests run: 4, Failures: 0, Errors: 0, Time elapsed: 0.042 sec
[au:antunit] Target: testWritable took 0.001 sec
[au:antunit] Target: testAsConditions took 0.016 sec
[au:antunit] Target: testReadable took 0.001 sec
[au:antunit] Target: testUnwritable took 0.008 sec
[au:antunit] Build File: /srv/gump/public/workspace/ant/src/tests/antunit/types/selectors/select-test.xml
[au:antunit] Tests run: 4, Failures: 0, Errors: 0, Time elapsed: 0.036 sec
[au:antunit] Target: testIfFalse took 0.006 sec
[au:antunit] Target: testIfNotSet took 0.007 sec
[au:antunit] Target: testIfTrue took 0.004 sec
[au:antunit] Target: testIfSet took 0.01 sec
[au:antunit] Build File: /srv/gump/public/workspace/ant/src/tests/antunit/types/tarfileset-test.xml
[au:antunit] Tests run: 3, Failures: 0, Errors: 0, Time elapsed: 0.013 sec
[au:antunit] Target: test-refid-check-encoding took 0.002 sec
[au:antunit] Target: testMissingArchive took 0 sec
[au:antunit] Target: testMissingArchiveDoesntMatter took 0 sec
[au:antunit] Build File: /srv/gump/public/workspace/ant/src/tests/antunit/types/zipfileset-test.xml
[au:antunit] Tests run: 5, Failures: 0, Errors: 0, Time elapsed: 0.033 sec
[au:antunit] Target: testMissingArchive took 0.001 sec
[au:antunit] Target: test-refid-check-encoding took 0 sec
[au:antunit] Target: test-refid-modify took 0.015 sec
[au:antunit] Target: test-refid-check-prefix took 0.005 sec
[au:antunit] Target: testMissingArchiveDoesntMatter took 0 sec

check-failed:

run-tests:

BUILD FAILED
/srv/gump/public/workspace/ant/build.xml:1611: Unit tests failed

Total time: 16 minutes 44 seconds
---------------------------------------------

To subscribe to this information via syndicated feeds:
- RSS: http://vmgump.apache.org/gump/public/ant/test-ant/rss.xml
- Atom: http://vmgump.apache.org/gump/public/ant/test-ant/atom.xml

============================== Gump Tracking Only ===
Produced by Apache Gump(TM) version 2.3.
Gump Run 20150613000015, vmgump.apache.org:vmgump:20150613000015
Gump E-mail Identifier (unique within run) #16.

*********************************************************** G U M P
[GUMP@vmgump]: Project commons-cli (in module apache-commons) failed
To whom it may engage...
        
This is an automated request, but not an unsolicited one. For 
more information please visit http://gump.apache.org/nagged.html, 
and/or contact the folk at general@gump.apache.org.

Project commons-cli has an issue affecting its community integration,
 and has been outstanding for 7 runs.
The current state of this project is 'Failed', with reason 'Update Failed'.

Full details are available at:
    http://vmgump.apache.org/gump/public/apache-commons/commons-cli/index.html

That said, some information snippets are provided here.

The following annotations (debug/informational/warning/error messages) were provided:
 -DEBUG- Sole jar output [commons-cli-*[0-9T].jar] identifier set to project name
 -INFO- Failed with reason update failed
 -INFO- Failed to extract fallback artifacts from Gump Repository

To subscribe to this information via syndicated feeds:
- RSS: http://vmgump.apache.org/gump/public/apache-commons/commons-cli/rss.xml
- Atom: http://vmgump.apache.org/gump/public/apache-commons/commons-cli/atom.xml

============================== Gump Tracking Only ===
Produced by Apache Gump(TM) version 2.3.
Gump Run 20150613000015, vmgump.apache.org:vmgump:20150613000015
Gump E-mail Identifier (unique within run) #17.

*********************************************************** G U M P
[GUMP@vmgump]: Project tika-parsers (in module tika) failed
To whom it may engage...
        
This is an automated request, but not an unsolicited one. For 
more information please visit http://gump.apache.org/nagged.html, 
and/or contact the folk at general@gump.apache.org.

Project tika-parsers has an issue affecting its community integration.
This issue affects 2 projects,
 and has been outstanding for 148 runs.
The current state of this project is 'Failed', with reason 'Build Failed'.
For reference only, the following projects are affected by this:
    - tika-parsers :  Apache Tika is a toolkit for detecting and extracting metada...
    - tika-parsers-test :  Apache Tika is a toolkit for detecting and extracting metada...


Full details are available at:
    http://vmgump.apache.org/gump/public/tika/tika-parsers/index.html

That said, some information snippets are provided here.

The following annotations (debug/informational/warning/error messages) were provided:
 -DEBUG- Sole jar output [tika-parsers-*[0-9T].jar] identifier set to project name
 -INFO- Optional dependency org.apache.poi prerequisite failed with reason update failed
 -INFO- Optional dependency commons-compress failed with reason update failed
 -DEBUG- (Apache Gump generated) Apache Maven Settings in: /srv/gump/public/workspace/tika/tika-parsers/gump_mvn_settings.xml
 -INFO- Failed with reason build failed
 -DEBUG- Maven POM in: /srv/gump/public/workspace/tika/tika-parsers/pom.xml
 -INFO- Failed to extract fallback artifacts from Gump Repository



The following work was performed:
http://vmgump.apache.org/gump/public/tika/tika-parsers/gump_work/build_tika_tika-parsers.html
Work Name: build_tika_tika-parsers (Type: Build)
Work ended in a state of : Failed
Elapsed: 1 min 32 secs
Command Line: /opt/maven3/bin/mvn --batch-mode -DskipTests=true --settings /srv/gump/public/workspace/tika/tika-parsers/gump_mvn_settings.xml
package 
[Working Directory: /srv/gump/public/workspace/tika/tika-parsers]
M2_HOME: /opt/maven3
---------------------------------------------
[INFO] -------------------------------------------------------------
[ERROR] COMPILATION ERROR : 
[INFO] -------------------------------------------------------------
[ERROR] /srv/gump/public/workspace/tika/tika-parsers/src/main/java/org/apache/tika/parser/font/AdobeFontMetricParser.java:[26,30]
cannot find symbol
  symbol:   class FontMetric
  location: package org.apache.fontbox.afm
[ERROR] /srv/gump/public/workspace/tika/tika-parsers/src/main/java/org/apache/tika/parser/font/AdobeFontMetricParser.java:[70,8]
cannot find symbol
  symbol:   class FontMetric
  location: class org.apache.tika.parser.font.AdobeFontMetricParser
[ERROR] /srv/gump/public/workspace/tika/tika-parsers/src/main/java/org/apache/tika/parser/font/AdobeFontMetricParser.java:[75,28]
cannot find symbol
  symbol:   method getResult()
  location: variable parser of type org.apache.fontbox.afm.AFMParser
[ERROR] /srv/gump/public/workspace/tika/tika-parsers/src/main/java/org/apache/tika/parser/font/TrueTypeParser.java:[67,26]
cannot find symbol
  symbol:   method parseTTF(java.io.File)
  location: variable parser of type org.apache.fontbox.ttf.TTFParser
[ERROR] /srv/gump/public/workspace/tika/tika-parsers/src/main/java/org/apache/tika/parser/font/TrueTypeParser.java:[69,26]
cannot find symbol
  symbol:   method parseTTF(java.io.InputStream)
  location: variable parser of type org.apache.fontbox.ttf.TTFParser
[INFO] 5 errors 
[INFO] -------------------------------------------------------------
[INFO] ------------------------------------------------------------------------
[INFO] BUILD FAILURE
[INFO] ------------------------------------------------------------------------
[INFO] Total time: 01:23 min
[INFO] Finished at: 2015-06-13T01:52:49+00:00
[INFO] Final Memory: 35M/133M
[INFO] ------------------------------------------------------------------------
[ERROR] Failed to execute goal org.apache.maven.plugins:maven-compiler-plugin:3.2:compile
(default-compile) on project tika-parsers: Compilation failure: Compilation failure:
[ERROR] /srv/gump/public/workspace/tika/tika-parsers/src/main/java/org/apache/tika/parser/font/AdobeFontMetricParser.java:[26,30]
cannot find symbol
[ERROR] symbol:   class FontMetric
[ERROR] location: package org.apache.fontbox.afm
[ERROR] /srv/gump/public/workspace/tika/tika-parsers/src/main/java/org/apache/tika/parser/font/AdobeFontMetricParser.java:[70,8]
cannot find symbol
[ERROR] symbol:   class FontMetric
[ERROR] location: class org.apache.tika.parser.font.AdobeFontMetricParser
[ERROR] /srv/gump/public/workspace/tika/tika-parsers/src/main/java/org/apache/tika/parser/font/AdobeFontMetricParser.java:[75,28]
cannot find symbol
[ERROR] symbol:   method getResult()
[ERROR] location: variable parser of type org.apache.fontbox.afm.AFMParser
[ERROR] /srv/gump/public/workspace/tika/tika-parsers/src/main/java/org/apache/tika/parser/font/TrueTypeParser.java:[67,26]
cannot find symbol
[ERROR] symbol:   method parseTTF(java.io.File)
[ERROR] location: variable parser of type org.apache.fontbox.ttf.TTFParser
[ERROR] /srv/gump/public/workspace/tika/tika-parsers/src/main/java/org/apache/tika/parser/font/TrueTypeParser.java:[69,26]
cannot find symbol
[ERROR] symbol:   method parseTTF(java.io.InputStream)
[ERROR] location: variable parser of type org.apache.fontbox.ttf.TTFParser
[ERROR] -> [Help 1]
[ERROR] 
[ERROR] To see the full stack trace of the errors, re-run Maven with the -e switch.
[ERROR] Re-run Maven using the -X switch to enable full debug logging.
[ERROR] 
[ERROR] For more information about the errors and possible solutions, please read the following
articles:
[ERROR] [Help 1] http://cwiki.apache.org/confluence/display/MAVEN/MojoFailureException
---------------------------------------------

To subscribe to this information via syndicated feeds:
- RSS: http://vmgump.apache.org/gump/public/tika/tika-parsers/rss.xml
- Atom: http://vmgump.apache.org/gump/public/tika/tika-parsers/atom.xml

============================== Gump Tracking Only ===
Produced by Apache Gump(TM) version 2.3.
Gump Run 20150613000015, vmgump.apache.org:vmgump:20150613000015
Gump E-mail Identifier (unique within run) #18.

*********************************************************** G U M P
[GUMP@vmgump]: Project tika-reactor (in module tika) failed
To whom it may engage...
        
This is an automated request, but not an unsolicited one. For 
more information please visit http://gump.apache.org/nagged.html, 
and/or contact the folk at general@gump.apache.org.

Project tika-reactor has an issue affecting its community integration.
This issue affects 1 projects,
 and has been outstanding for 148 runs.
The current state of this project is 'Failed', with reason 'Build Failed'.
For reference only, the following projects are affected by this:
    - tika-reactor :  Apache Tika is a toolkit for detecting and extracting metada...


Full details are available at:
    http://vmgump.apache.org/gump/public/tika/tika-reactor/index.html

That said, some information snippets are provided here.

The following annotations (debug/informational/warning/error messages) were provided:
 -INFO- Optional dependency tika-parsers failed with reason build failed
 -DEBUG- (Apache Gump generated) Apache Maven Settings in: /srv/gump/public/workspace/tika/gump_mvn_settings.xml
 -INFO- Failed with reason build failed
 -DEBUG- Maven POM in: /srv/gump/public/workspace/tika/pom.xml



The following work was performed:
http://vmgump.apache.org/gump/public/tika/tika-reactor/gump_work/build_tika_tika-reactor.html
Work Name: build_tika_tika-reactor (Type: Build)
Work ended in a state of : Failed
Elapsed: 1 min 36 secs
Command Line: /opt/maven3/bin/mvn --batch-mode -DskipTests=true --settings /srv/gump/public/workspace/tika/gump_mvn_settings.xml
install 
[Working Directory: /srv/gump/public/workspace/tika]
MAVEN_OPTS: -Xmx512m 
M2_HOME: /opt/maven3
---------------------------------------------
[INFO] -------------------------------------------------------------
[INFO] ------------------------------------------------------------------------
[INFO] Reactor Summary:
[INFO] 
[INFO] Apache Tika parent ................................. SUCCESS [  8.417 s]
[INFO] Apache Tika core ................................... SUCCESS [ 39.243 s]
[INFO] Apache Tika parsers ................................ FAILURE [ 35.891 s]
[INFO] Apache Tika XMP .................................... SKIPPED
[INFO] Apache Tika serialization .......................... SKIPPED
[INFO] Apache Tika batch .................................. SKIPPED
[INFO] Apache Tika application ............................ SKIPPED
[INFO] Apache Tika OSGi bundle ............................ SKIPPED
[INFO] Apache Tika translate .............................. SKIPPED
[INFO] Apache Tika server ................................. SKIPPED
[INFO] Apache Tika examples ............................... SKIPPED
[INFO] Apache Tika Java-7 Components ...................... SKIPPED
[INFO] Apache Tika ........................................ SKIPPED
[INFO] ------------------------------------------------------------------------
[INFO] BUILD FAILURE
[INFO] ------------------------------------------------------------------------
[INFO] Total time: 01:27 min
[INFO] Finished at: 2015-06-13T01:54:26+00:00
[INFO] Final Memory: 46M/132M
[INFO] ------------------------------------------------------------------------
[ERROR] Failed to execute goal org.apache.maven.plugins:maven-compiler-plugin:3.2:compile
(default-compile) on project tika-parsers: Compilation failure: Compilation failure:
[ERROR] /srv/gump/public/workspace/tika/tika-parsers/src/main/java/org/apache/tika/parser/font/AdobeFontMetricParser.java:[26,30]
cannot find symbol
[ERROR] symbol:   class FontMetric
[ERROR] location: package org.apache.fontbox.afm
[ERROR] /srv/gump/public/workspace/tika/tika-parsers/src/main/java/org/apache/tika/parser/font/AdobeFontMetricParser.java:[70,8]
cannot find symbol
[ERROR] symbol:   class FontMetric
[ERROR] location: class org.apache.tika.parser.font.AdobeFontMetricParser
[ERROR] /srv/gump/public/workspace/tika/tika-parsers/src/main/java/org/apache/tika/parser/font/AdobeFontMetricParser.java:[75,28]
cannot find symbol
[ERROR] symbol:   method getResult()
[ERROR] location: variable parser of type org.apache.fontbox.afm.AFMParser
[ERROR] /srv/gump/public/workspace/tika/tika-parsers/src/main/java/org/apache/tika/parser/font/TrueTypeParser.java:[67,26]
cannot find symbol
[ERROR] symbol:   method parseTTF(java.io.File)
[ERROR] location: variable parser of type org.apache.fontbox.ttf.TTFParser
[ERROR] /srv/gump/public/workspace/tika/tika-parsers/src/main/java/org/apache/tika/parser/font/TrueTypeParser.java:[69,26]
cannot find symbol
[ERROR] symbol:   method parseTTF(java.io.InputStream)
[ERROR] location: variable parser of type org.apache.fontbox.ttf.TTFParser
[ERROR] -> [Help 1]
[ERROR] 
[ERROR] To see the full stack trace of the errors, re-run Maven with the -e switch.
[ERROR] Re-run Maven using the -X switch to enable full debug logging.
[ERROR] 
[ERROR] For more information about the errors and possible solutions, please read the following
articles:
[ERROR] [Help 1] http://cwiki.apache.org/confluence/display/MAVEN/MojoFailureException
[ERROR] 
[ERROR] After correcting the problems, you can resume the build with the command
[ERROR]   mvn <goals> -rf :tika-parsers
---------------------------------------------

To subscribe to this information via syndicated feeds:
- RSS: http://vmgump.apache.org/gump/public/tika/tika-reactor/rss.xml
- Atom: http://vmgump.apache.org/gump/public/tika/tika-reactor/atom.xml

============================== Gump Tracking Only ===
Produced by Apache Gump(TM) version 2.3.
Gump Run 20150613000015, vmgump.apache.org:vmgump:20150613000015
Gump E-mail Identifier (unique within run) #19.

*********************************************************** G U M P
[GUMP@vmgump]: Project commons-exec (in module apache-commons) failed
To whom it may engage...
        
This is an automated request, but not an unsolicited one. For 
more information please visit http://gump.apache.org/nagged.html, 
and/or contact the folk at general@gump.apache.org.

Project commons-exec has an issue affecting its community integration,
 and has been outstanding for 7 runs.
The current state of this project is 'Failed', with reason 'Update Failed'.

Full details are available at:
    http://vmgump.apache.org/gump/public/apache-commons/commons-exec/index.html

That said, some information snippets are provided here.

The following annotations (debug/informational/warning/error messages) were provided:
 -DEBUG- Sole jar output [commons-exec-*[0-9T].jar] identifier set to project name
 -INFO- Optional dependency commons-cli failed with reason update failed
 -INFO- Failed with reason update failed
 -INFO- Failed to extract fallback artifacts from Gump Repository

To subscribe to this information via syndicated feeds:
- RSS: http://vmgump.apache.org/gump/public/apache-commons/commons-exec/rss.xml
- Atom: http://vmgump.apache.org/gump/public/apache-commons/commons-exec/atom.xml

============================== Gump Tracking Only ===
Produced by Apache Gump(TM) version 2.3.
Gump Run 20150613000015, vmgump.apache.org:vmgump:20150613000015
Gump E-mail Identifier (unique within run) #20.


--
Apache Gump
http://gump.apache.org/ [Instance: vmgump]

---------------------------------------------------------------------
To unsubscribe, e-mail: general-unsubscribe@gump.apache.org
For additional commands, e-mail: general-help@gump.apache.org


Mime
View raw message