gump-general mailing list archives

Site index · List index
Message view « Date » · « Thread »
Top « Date » · « Thread »
From g...@vmgump.apache.org
Subject BATCH: All dressed up, with nowhere to go...
Date Tue, 28 Apr 2015 08:55:10 GMT
Dear Gumpmeisters,
            
The following 5 notifys should have been sent

*********************************************************** G U M P
[GUMP@vmgump]: Module xz-java failed
[GUMP@vmgump]: Project ooxml-schemas (in module poi) failed
[GUMP@vmgump]: Project test-ant (in module ant) failed
[GUMP@vmgump]: Project tika-parsers (in module tika) failed
[GUMP@vmgump]: Project tika-reactor (in module tika) failed
*********************************************************** G U M P
[GUMP@vmgump]: Module xz-java failed
To whom it may engage...
        
This is an automated request, but not an unsolicited one. For 
more information please visit http://gump.apache.org/nagged.html, 
and/or contact the folk at general@gump.apache.org.

Module xz-java has an issue affecting its community integration,
 and has been outstanding for 469 runs.
The current state of this module is 'Failed', with reason 'Update Failed'.

Full details are available at:
    http://vmgump.apache.org/gump/public/xz-java/index.html

That said, some information snippets are provided here.

The following annotations (debug/informational/warning/error messages) were provided:
 -INFO- Failed with reason update failed



The following work was performed:
http://vmgump.apache.org/gump/public/xz-java/gump_work/update_xz-java.html
Work Name: update_xz-java (Type: Update)
Work ended in a state of : Failed
Elapsed: 20 secs
Command Line: git pull --quiet http://git.tukaani.org/xz-java.git master 
[Working Directory: /srv/gump/public/workspace/cvs/xz-java]
---------------------------------------------
fatal: unable to access 'http://git.tukaani.org/xz-java.git/': Could not resolve host: git.tukaani.org
---------------------------------------------

To subscribe to this information via syndicated feeds:
- RSS: http://vmgump.apache.org/gump/public/xz-java/rss.xml
- Atom: http://vmgump.apache.org/gump/public/xz-java/atom.xml

============================== Gump Tracking Only ===
Produced by Apache Gump(TM) version 2.3.
Gump Run 20150428000005, vmgump.apache.org:vmgump:20150428000005
Gump E-mail Identifier (unique within run) #1.

*********************************************************** G U M P
[GUMP@vmgump]: Project ooxml-schemas (in module poi) failed
To whom it may engage...
        
This is an automated request, but not an unsolicited one. For 
more information please visit http://gump.apache.org/nagged.html, 
and/or contact the folk at general@gump.apache.org.

Project ooxml-schemas has an issue affecting its community integration.
This issue affects 5 projects,
 and has been outstanding for 13 runs.
The current state of this project is 'Failed', with reason 'Build Failed'.
For reference only, the following projects are affected by this:
    - ooxml-schemas :  POI
    - org.apache.poi :  POI
    - poi :  POI
    - poi-ooxml-schemas :  POI
    - poi-test :  POI


Full details are available at:
    http://vmgump.apache.org/gump/public/poi/ooxml-schemas/index.html

That said, some information snippets are provided here.

The following annotations (debug/informational/warning/error messages) were provided:
 -DEBUG- Sole jar output [ooxml-schemas-[0-9]*[0-9T].jar] identifier set to project name
 -INFO- Failed with reason build failed
 -INFO- Failed to extract fallback artifacts from Gump Repository



The following work was performed:
http://vmgump.apache.org/gump/public/poi/ooxml-schemas/gump_work/build_poi_ooxml-schemas.html
Work Name: build_poi_ooxml-schemas (Type: Build)
Work ended in a state of : Failed
Elapsed: 3 mins 36 secs
Command Line: /usr/lib/jvm/java-8-oracle/bin/java -Djava.awt.headless=true -Dbuild.sysclasspath=only
-Dant.build.clonevm=true org.apache.tools.ant.Main -Dgump.merge=/srv/gump/public/gump/work/merge.xml
compile-ooxml-xsds 
[Working Directory: /srv/gump/public/workspace/poi]
CLASSPATH: /usr/lib/jvm/java-8-oracle/lib/tools.jar:/srv/gump/public/workspace/ant/dist/lib/ant.jar:/srv/gump/public/workspace/ant/dist/lib/ant-launcher.jar:/srv/gump/public/workspace/ant/dist/lib/ant-jmf.jar:/srv/gump/public/workspace/ant/dist/lib/ant-junit.jar:/srv/gump/public/workspace/ant/dist/lib/ant-junit4.jar:/srv/gump/public/workspace/ant/dist/lib/ant-swing.jar:/srv/gump/public/workspace/ant/dist/lib/ant-apache-resolver.jar:/srv/gump/public/workspace/ant/dist/lib/ant-apache-xalan2.jar:/srv/gump/public/workspace/xml-commons/java/build/resolver.jar:/srv/gump/public/workspace/poi/ooxml-lib/xmlbeans-2.6.0.jar:/srv/gump/public/workspace/poi/compile-lib/bcpkix-jdk15on-1.51.jar:/srv/gump/public/workspace/poi/compile-lib/bcprov-ext-jdk15on-1.51.jar:/srv/gump/public/workspace/poi/compile-lib/slf4j-api-1.7.7.jar:/srv/gump/public/workspace/poi/compile-lib/xmlsec-2.0.1.jar
---------------------------------------------
Buildfile: /srv/gump/public/workspace/poi/build.xml

check-jars:

fetch-jars:

check-ooxml-xsds:

fetch-ooxml-xsds:
      [get] Getting: http://www.ecma-international.org/publications/files/ECMA-ST/Office%20Open%20XML%201st%20edition%20Part%204%20(PDF).zip
      [get] To: /srv/gump/public/workspace/poi/ooxml-lib/OfficeOpenXML-Part4.zip
      [get] Getting: http://www.ecma-international.org/publications/files/ECMA-ST/Office%20Open%20XML%201st%20edition%20Part%202%20(PDF).zip
      [get] To: /srv/gump/public/workspace/poi/ooxml-lib/OfficeOpenXML-Part2.zip
      [get] Getting: http://dublincore.org/schemas/xmls/qdc/2003/04/02/dc.xsd
      [get] To: /srv/gump/public/workspace/poi/ooxml-lib/dc.xsd
      [get] Getting: http://dublincore.org/schemas/xmls/qdc/2003/04/02/dcterms.xsd
      [get] To: /srv/gump/public/workspace/poi/ooxml-lib/dcterms.xsd
      [get] Getting: http://dublincore.org/schemas/xmls/qdc/2003/04/02/dcmitype.xsd
      [get] To: /srv/gump/public/workspace/poi/ooxml-lib/dcmitype.xsd
      [get] Getting: http://www.w3.org/TR/2002/REC-xmldsig-core-20020212/xmldsig-core-schema.xsd
      [get] To: /srv/gump/public/workspace/poi/ooxml-lib/xmldsig-core-schema.xsd
      [get] Error getting http://www.w3.org/TR/2002/REC-xmldsig-core-20020212/xmldsig-core-schema.xsd
to /srv/gump/public/workspace/poi/ooxml-lib/xmldsig-core-schema.xsd

BUILD FAILED
/srv/gump/public/workspace/poi/build.xml:554: java.net.ConnectException: Connection timed
out
	at java.net.PlainSocketImpl.socketConnect(Native Method)
	at java.net.AbstractPlainSocketImpl.doConnect(AbstractPlainSocketImpl.java:345)
	at java.net.AbstractPlainSocketImpl.connectToAddress(AbstractPlainSocketImpl.java:206)
	at java.net.AbstractPlainSocketImpl.connect(AbstractPlainSocketImpl.java:188)
	at java.net.SocksSocketImpl.connect(SocksSocketImpl.java:392)
	at java.net.Socket.connect(Socket.java:589)
	at java.net.Socket.connect(Socket.java:538)
	at sun.net.NetworkClient.doConnect(NetworkClient.java:180)
	at sun.net.www.http.HttpClient.openServer(HttpClient.java:432)
	at sun.net.www.http.HttpClient.openServer(HttpClient.java:527)
	at sun.net.www.http.HttpClient.<init>(HttpClient.java:211)
	at sun.net.www.http.HttpClient.New(HttpClient.java:308)
	at sun.net.www.http.HttpClient.New(HttpClient.java:326)
	at sun.net.www.protocol.http.HttpURLConnection.getNewHttpClient(HttpURLConnection.java:1167)
	at sun.net.www.protocol.http.HttpURLConnection.plainConnect0(HttpURLConnection.java:1103)
	at sun.net.www.protocol.http.HttpURLConnection.plainConnect(HttpURLConnection.java:997)
	at sun.net.www.protocol.http.HttpURLConnection.connect(HttpURLConnection.java:931)
	at org.apache.tools.ant.taskdefs.Get$GetThread.openConnection(Get.java:728)
	at org.apache.tools.ant.taskdefs.Get$GetThread.get(Get.java:641)
	at org.apache.tools.ant.taskdefs.Get$GetThread.run(Get.java:631)

Total time: 3 minutes 36 seconds
---------------------------------------------

To subscribe to this information via syndicated feeds:
- RSS: http://vmgump.apache.org/gump/public/poi/ooxml-schemas/rss.xml
- Atom: http://vmgump.apache.org/gump/public/poi/ooxml-schemas/atom.xml

============================== Gump Tracking Only ===
Produced by Apache Gump(TM) version 2.3.
Gump Run 20150428000005, vmgump.apache.org:vmgump:20150428000005
Gump E-mail Identifier (unique within run) #3.

*********************************************************** G U M P
[GUMP@vmgump]: Project test-ant (in module ant) failed
To whom it may engage...
        
This is an automated request, but not an unsolicited one. For 
more information please visit http://gump.apache.org/nagged.html, 
and/or contact the folk at general@gump.apache.org.

Project test-ant has an issue affecting its community integration.
This issue affects 1 projects,
 and has been outstanding for 3 runs.
The current state of this project is 'Failed', with reason 'Build Failed'.
For reference only, the following projects are affected by this:
    - test-ant :  Java based build tool


Full details are available at:
    http://vmgump.apache.org/gump/public/ant/test-ant/index.html

That said, some information snippets are provided here.

The following annotations (debug/informational/warning/error messages) were provided:
 -WARNING- Bad *Optional* Dependency. Project: bsh : unknown to *this* workspace
 -INFO- Failed with reason build failed



The following work was performed:
http://vmgump.apache.org/gump/public/ant/test-ant/gump_work/build_ant_test-ant.html
Work Name: build_ant_test-ant (Type: Build)
Work ended in a state of : Failed
Elapsed: 16 mins 50 secs
Command Line: /usr/lib/jvm/java-8-oracle/bin/java -Djava.awt.headless=true -Dbuild.sysclasspath=only
-Xbootclasspath/p:/srv/gump/public/workspace/xml-xerces2/build/xercesImpl.jar:/srv/gump/public/workspace/xml-commons/java/external/build/xml-apis.jar:/srv/gump/public/workspace/xml-xalan/build/xalan-unbundled.jar:/srv/gump/public/workspace/xml-xalan/build/serializer.jar
org.apache.tools.ant.Main -Dgump.merge=/srv/gump/public/gump/work/merge.xml -Dtest.haltonfailure=false
-Dant.home=/srv/gump/public/workspace/ant/dist run-tests 
[Working Directory: /srv/gump/public/workspace/ant]
CLASSPATH: /usr/lib/jvm/java-8-oracle/lib/tools.jar:/srv/gump/public/workspace/ant/build/testcases:/srv/gump/public/workspace/ant/src/tests/junit:/srv/gump/public/workspace/ant/src/etc/testcases:/srv/gump/public/workspace/ant/src/etc/testcases/taskdefs/optional/out:/srv/gump/public/workspace/ant/src/tests/antunit/filters:/srv/gump/public/workspace/ant/src/tests/antunit/taskdefs/importtests:/srv/gump/public/workspace/ant/src/tests/antunit/filters/foo:/srv/gump/public/workspace/ant/src/tests/antunit/taskdefs/foo:/srv/gump/public/workspace/ant/build/antunit/tmp/testinput/build:/srv/gump/public/workspace/ant/build/antunit/tmp/testoutput:/srv/gump/public/workspace/ant/build/antunit/tmp/test.jar:/srv/gump/public/workspace/ant/build/antunit/tmp/test1.jar:/srv/gump/public/workspace/ant/build/antunit/tmp/test2.jar:/srv/gump/public/workspace/ant/build/antunit/tmp/test3.jar:/srv/gump/public/workspace/ant/build/antunit/tmp/test4.jar:/srv/gump/public/workspace/ant/build/antunit/tmp/test5.jar:/srv
 /gump/public/workspace/ant/build/antunit/tmp/resources:/srv/gump/public/workspace/ant/build/lib/ant.jar:/srv/gump/public/workspace/ant/build/lib/ant-launcher.jar:/srv/gump/public/workspace/ant/build/lib/ant-antlr.jar:/srv/gump/public/workspace/ant/build/lib/ant-apache-bcel.jar:/srv/gump/public/workspace/ant/build/lib/ant-apache-bsf.jar:/srv/gump/public/workspace/ant/build/lib/ant-apache-log4j.jar:/srv/gump/public/workspace/ant/build/lib/ant-apache-oro.jar:/srv/gump/public/workspace/ant/build/lib/ant-apache-regexp.jar:/srv/gump/public/workspace/ant/build/lib/ant-apache-resolver.jar:/srv/gump/public/workspace/ant/build/lib/ant-apache-xalan2.jar:/srv/gump/public/workspace/ant/build/lib/ant-commons-logging.jar:/srv/gump/public/workspace/ant/build/lib/ant-commons-net.jar:/srv/gump/public/workspace/ant/build/lib/ant-jai.jar:/srv/gump/public/workspace/ant/build/lib/ant-javamail.jar:/srv/gump/public/workspace/ant/build/lib/ant-jdepend.jar:/srv/gump/public/workspace/ant/build/lib/ant-jmf.jar
 :/srv/gump/public/workspace/ant/build/lib/ant-jsch.jar:/srv/gump/public/workspace/ant/build/lib/ant-junit.jar:/srv/gump/public/workspace/ant/build/lib/ant-junit4.jar:/srv/gump/public/workspace/ant/build/lib/ant-swing.jar:/srv/gump/packages/antlr/antlr-3.1.3.jar:/srv/gump/public/workspace/apache-commons/bcel/target/bcel-6.0-SNAPSHOT.jar:/srv/gump/public/workspace/apache-commons/logging/target/commons-logging-20150428.jar:/srv/gump/public/workspace/apache-commons/logging/target/commons-logging-api-20150428.jar:/srv/gump/public/workspace/apache-commons/net/target/commons-net-3.4-SNAPSHOT.jar:/srv/gump/public/workspace/apache-commons/net/target/commons-net-ftp-3.4-SNAPSHOT.jar:/srv/gump/packages/jaf-1.1ea/activation.jar:/srv/gump/public/workspace/jakarta-bsf/build/lib/bsf.jar:/srv/gump/packages/apache-attic/jakarta-regexp-1.5.jar:/srv/gump/public/workspace/jakarta-servletapi-5/jsr154/dist/lib/servlet-api.jar:/srv/gump/packages/javamail-1.4/mail.jar:/srv/gump/packages/javamail-1.4/lib/ma
 ilapi.jar:/srv/gump/packages/jdepend-2.6/lib/jdepend.jar:/srv/gump/packages/jsch/jsch-0.1.45.jar:/srv/gump/public/workspace/logging-log4j-12/target/log4j-1.2.18-SNAPSHOT.jar:/srv/gump/packages/apache-attic/oro-2.0.8.jar:/srv/gump/public/workspace/antlibs-antunit/build/ant-antunit-20150428.jar:/srv/gump/packages/hamcrest/hamcrest-core-1.3.jar:/srv/gump/public/workspace/junit/target/junit-4.13-SNAPSHOT.jar:/srv/gump/public/workspace/xml-commons/java/external/build/xml-apis-ext.jar:/srv/gump/public/workspace/commons-codec-1.x/dist/commons-codec-20150428.jar
---------------------------------------------
[au:antunit] Target: testExplicitLines took 0.001 sec
[au:antunit] Build File: /srv/gump/public/workspace/ant/src/tests/antunit/types/selectors/depend-test.xml
[au:antunit] Tests run: 1, Failures: 0, Errors: 0, Time elapsed: 0.002 sec
[au:antunit] Target: testMapperByTypedef took 0.001 sec
[au:antunit] Build File: /srv/gump/public/workspace/ant/src/tests/antunit/types/selectors/different-test.xml
[au:antunit] Tests run: 1, Failures: 0, Errors: 0, Time elapsed: 0.002 sec
[au:antunit] Target: testMapperByTypedef took 0.001 sec
[au:antunit] Build File: /srv/gump/public/workspace/ant/src/tests/antunit/types/selectors/filename-test.xml
[au:antunit] Tests run: 2, Failures: 0, Errors: 0, Time elapsed: 0.013 sec
[au:antunit] Target: testRegex took 0.003 sec
[au:antunit] Target: testPattern took 0.004 sec
[au:antunit] Build File: /srv/gump/public/workspace/ant/src/tests/antunit/types/selectors/modified-test.xml
[au:antunit] Tests run: 1, Failures: 0, Errors: 0, Time elapsed: 0.029 sec
[au:antunit] Target: testUpdate took 0.026 sec
[au:antunit] Build File: /srv/gump/public/workspace/ant/src/tests/antunit/types/selectors/present-test.xml
[au:antunit] Tests run: 1, Failures: 0, Errors: 0, Time elapsed: 0.003 sec
[au:antunit] Target: testMapperByTypedef took 0.002 sec
[au:antunit] Build File: /srv/gump/public/workspace/ant/src/tests/antunit/types/selectors/readwrite-test.xml
[au:antunit] Tests run: 4, Failures: 0, Errors: 0, Time elapsed: 0.059 sec
[au:antunit] Target: testWritable took 0.002 sec
[au:antunit] Target: testAsConditions took 0.002 sec
[au:antunit] Target: testReadable took 0.001 sec
[au:antunit] Target: testUnwritable took 0.04 sec
[au:antunit] Build File: /srv/gump/public/workspace/ant/src/tests/antunit/types/selectors/select-test.xml
[au:antunit] Tests run: 4, Failures: 0, Errors: 0, Time elapsed: 0.031 sec
[au:antunit] Target: testIfFalse took 0.005 sec
[au:antunit] Target: testIfNotSet took 0.001 sec
[au:antunit] Target: testIfTrue took 0.001 sec
[au:antunit] Target: testIfSet took 0.002 sec
[au:antunit] Build File: /srv/gump/public/workspace/ant/src/tests/antunit/types/tarfileset-test.xml
[au:antunit] Tests run: 3, Failures: 0, Errors: 0, Time elapsed: 0.016 sec
[au:antunit] Target: test-refid-check-encoding took 0 sec
[au:antunit] Target: testMissingArchive took 0.001 sec
[au:antunit] Target: testMissingArchiveDoesntMatter took 0.001 sec
[au:antunit] Build File: /srv/gump/public/workspace/ant/src/tests/antunit/types/zipfileset-test.xml
[au:antunit] Tests run: 5, Failures: 0, Errors: 0, Time elapsed: 0.097 sec
[au:antunit] Target: testMissingArchive took 0.002 sec
[au:antunit] Target: test-refid-check-encoding took 0.006 sec
[au:antunit] Target: test-refid-modify took 0.078 sec
[au:antunit] Target: test-refid-check-prefix took 0 sec
[au:antunit] Target: testMissingArchiveDoesntMatter took 0 sec

check-failed:

run-tests:

BUILD FAILED
/srv/gump/public/workspace/ant/build.xml:1611: Unit tests failed

Total time: 16 minutes 49 seconds
---------------------------------------------

To subscribe to this information via syndicated feeds:
- RSS: http://vmgump.apache.org/gump/public/ant/test-ant/rss.xml
- Atom: http://vmgump.apache.org/gump/public/ant/test-ant/atom.xml

============================== Gump Tracking Only ===
Produced by Apache Gump(TM) version 2.3.
Gump Run 20150428000005, vmgump.apache.org:vmgump:20150428000005
Gump E-mail Identifier (unique within run) #4.

*********************************************************** G U M P
[GUMP@vmgump]: Project tika-parsers (in module tika) failed
To whom it may engage...
        
This is an automated request, but not an unsolicited one. For 
more information please visit http://gump.apache.org/nagged.html, 
and/or contact the folk at general@gump.apache.org.

Project tika-parsers has an issue affecting its community integration.
This issue affects 2 projects,
 and has been outstanding for 65 runs.
The current state of this project is 'Failed', with reason 'Build Failed'.
For reference only, the following projects are affected by this:
    - tika-parsers :  Apache Tika is a toolkit for detecting and extracting metada...
    - tika-parsers-test :  Apache Tika is a toolkit for detecting and extracting metada...


Full details are available at:
    http://vmgump.apache.org/gump/public/tika/tika-parsers/index.html

That said, some information snippets are provided here.

The following annotations (debug/informational/warning/error messages) were provided:
 -DEBUG- Sole jar output [tika-parsers-*[0-9T].jar] identifier set to project name
 -INFO- Optional dependency org.apache.poi prerequisite failed with reason build failed
 -DEBUG- (Apache Gump generated) Apache Maven Settings in: /srv/gump/public/workspace/tika/tika-parsers/gump_mvn_settings.xml
 -INFO- Failed with reason build failed
 -DEBUG- Maven POM in: /srv/gump/public/workspace/tika/tika-parsers/pom.xml
 -INFO- Failed to extract fallback artifacts from Gump Repository



The following work was performed:
http://vmgump.apache.org/gump/public/tika/tika-parsers/gump_work/build_tika_tika-parsers.html
Work Name: build_tika_tika-parsers (Type: Build)
Work ended in a state of : Failed
Elapsed: 1 min 7 secs
Command Line: /opt/maven3/bin/mvn --batch-mode -DskipTests=true --settings /srv/gump/public/workspace/tika/tika-parsers/gump_mvn_settings.xml
package 
[Working Directory: /srv/gump/public/workspace/tika/tika-parsers]
M2_HOME: /opt/maven3
---------------------------------------------
[INFO] -------------------------------------------------------------
[ERROR] COMPILATION ERROR : 
[INFO] -------------------------------------------------------------
[ERROR] /srv/gump/public/workspace/tika/tika-parsers/src/main/java/org/apache/tika/parser/font/AdobeFontMetricParser.java:[26,30]
cannot find symbol
  symbol:   class FontMetric
  location: package org.apache.fontbox.afm
[ERROR] /srv/gump/public/workspace/tika/tika-parsers/src/main/java/org/apache/tika/parser/font/AdobeFontMetricParser.java:[70,8]
cannot find symbol
  symbol:   class FontMetric
  location: class org.apache.tika.parser.font.AdobeFontMetricParser
[ERROR] /srv/gump/public/workspace/tika/tika-parsers/src/main/java/org/apache/tika/parser/font/AdobeFontMetricParser.java:[75,28]
cannot find symbol
  symbol:   method getResult()
  location: variable parser of type org.apache.fontbox.afm.AFMParser
[ERROR] /srv/gump/public/workspace/tika/tika-parsers/src/main/java/org/apache/tika/parser/font/TrueTypeParser.java:[67,26]
cannot find symbol
  symbol:   method parseTTF(java.io.File)
  location: variable parser of type org.apache.fontbox.ttf.TTFParser
[ERROR] /srv/gump/public/workspace/tika/tika-parsers/src/main/java/org/apache/tika/parser/font/TrueTypeParser.java:[69,26]
cannot find symbol
  symbol:   method parseTTF(java.io.InputStream)
  location: variable parser of type org.apache.fontbox.ttf.TTFParser
[INFO] 5 errors 
[INFO] -------------------------------------------------------------
[INFO] ------------------------------------------------------------------------
[INFO] BUILD FAILURE
[INFO] ------------------------------------------------------------------------
[INFO] Total time: 01:00 min
[INFO] Finished at: 2015-04-28T02:09:16+00:00
[INFO] Final Memory: 29M/74M
[INFO] ------------------------------------------------------------------------
[ERROR] Failed to execute goal org.apache.maven.plugins:maven-compiler-plugin:3.2:compile
(default-compile) on project tika-parsers: Compilation failure: Compilation failure:
[ERROR] /srv/gump/public/workspace/tika/tika-parsers/src/main/java/org/apache/tika/parser/font/AdobeFontMetricParser.java:[26,30]
cannot find symbol
[ERROR] symbol:   class FontMetric
[ERROR] location: package org.apache.fontbox.afm
[ERROR] /srv/gump/public/workspace/tika/tika-parsers/src/main/java/org/apache/tika/parser/font/AdobeFontMetricParser.java:[70,8]
cannot find symbol
[ERROR] symbol:   class FontMetric
[ERROR] location: class org.apache.tika.parser.font.AdobeFontMetricParser
[ERROR] /srv/gump/public/workspace/tika/tika-parsers/src/main/java/org/apache/tika/parser/font/AdobeFontMetricParser.java:[75,28]
cannot find symbol
[ERROR] symbol:   method getResult()
[ERROR] location: variable parser of type org.apache.fontbox.afm.AFMParser
[ERROR] /srv/gump/public/workspace/tika/tika-parsers/src/main/java/org/apache/tika/parser/font/TrueTypeParser.java:[67,26]
cannot find symbol
[ERROR] symbol:   method parseTTF(java.io.File)
[ERROR] location: variable parser of type org.apache.fontbox.ttf.TTFParser
[ERROR] /srv/gump/public/workspace/tika/tika-parsers/src/main/java/org/apache/tika/parser/font/TrueTypeParser.java:[69,26]
cannot find symbol
[ERROR] symbol:   method parseTTF(java.io.InputStream)
[ERROR] location: variable parser of type org.apache.fontbox.ttf.TTFParser
[ERROR] -> [Help 1]
[ERROR] 
[ERROR] To see the full stack trace of the errors, re-run Maven with the -e switch.
[ERROR] Re-run Maven using the -X switch to enable full debug logging.
[ERROR] 
[ERROR] For more information about the errors and possible solutions, please read the following
articles:
[ERROR] [Help 1] http://cwiki.apache.org/confluence/display/MAVEN/MojoFailureException
---------------------------------------------

To subscribe to this information via syndicated feeds:
- RSS: http://vmgump.apache.org/gump/public/tika/tika-parsers/rss.xml
- Atom: http://vmgump.apache.org/gump/public/tika/tika-parsers/atom.xml

============================== Gump Tracking Only ===
Produced by Apache Gump(TM) version 2.3.
Gump Run 20150428000005, vmgump.apache.org:vmgump:20150428000005
Gump E-mail Identifier (unique within run) #5.

*********************************************************** G U M P
[GUMP@vmgump]: Project tika-reactor (in module tika) failed
To whom it may engage...
        
This is an automated request, but not an unsolicited one. For 
more information please visit http://gump.apache.org/nagged.html, 
and/or contact the folk at general@gump.apache.org.

Project tika-reactor has an issue affecting its community integration.
This issue affects 1 projects,
 and has been outstanding for 65 runs.
The current state of this project is 'Failed', with reason 'Build Failed'.
For reference only, the following projects are affected by this:
    - tika-reactor :  Apache Tika is a toolkit for detecting and extracting metada...


Full details are available at:
    http://vmgump.apache.org/gump/public/tika/tika-reactor/index.html

That said, some information snippets are provided here.

The following annotations (debug/informational/warning/error messages) were provided:
 -INFO- Optional dependency tika-parsers failed with reason build failed
 -DEBUG- (Apache Gump generated) Apache Maven Settings in: /srv/gump/public/workspace/tika/gump_mvn_settings.xml
 -INFO- Failed with reason build failed
 -DEBUG- Maven POM in: /srv/gump/public/workspace/tika/pom.xml



The following work was performed:
http://vmgump.apache.org/gump/public/tika/tika-reactor/gump_work/build_tika_tika-reactor.html
Work Name: build_tika_tika-reactor (Type: Build)
Work ended in a state of : Failed
Elapsed: 1 min 27 secs
Command Line: /opt/maven3/bin/mvn --batch-mode -DskipTests=true --settings /srv/gump/public/workspace/tika/gump_mvn_settings.xml
install 
[Working Directory: /srv/gump/public/workspace/tika]
MAVEN_OPTS: -Xmx512m 
M2_HOME: /opt/maven3
---------------------------------------------
[INFO] -------------------------------------------------------------
[INFO] ------------------------------------------------------------------------
[INFO] Reactor Summary:
[INFO] 
[INFO] Apache Tika parent ................................. SUCCESS [  9.617 s]
[INFO] Apache Tika core ................................... SUCCESS [ 36.562 s]
[INFO] Apache Tika parsers ................................ FAILURE [ 26.352 s]
[INFO] Apache Tika XMP .................................... SKIPPED
[INFO] Apache Tika serialization .......................... SKIPPED
[INFO] Apache Tika batch .................................. SKIPPED
[INFO] Apache Tika application ............................ SKIPPED
[INFO] Apache Tika OSGi bundle ............................ SKIPPED
[INFO] Apache Tika server ................................. SKIPPED
[INFO] Apache Tika translate .............................. SKIPPED
[INFO] Apache Tika examples ............................... SKIPPED
[INFO] Apache Tika Java-7 Components ...................... SKIPPED
[INFO] Apache Tika ........................................ SKIPPED
[INFO] ------------------------------------------------------------------------
[INFO] BUILD FAILURE
[INFO] ------------------------------------------------------------------------
[INFO] Total time: 01:18 min
[INFO] Finished at: 2015-04-28T02:10:43+00:00
[INFO] Final Memory: 40M/107M
[INFO] ------------------------------------------------------------------------
[ERROR] Failed to execute goal org.apache.maven.plugins:maven-compiler-plugin:3.2:compile
(default-compile) on project tika-parsers: Compilation failure: Compilation failure:
[ERROR] /srv/gump/public/workspace/tika/tika-parsers/src/main/java/org/apache/tika/parser/font/AdobeFontMetricParser.java:[26,30]
cannot find symbol
[ERROR] symbol:   class FontMetric
[ERROR] location: package org.apache.fontbox.afm
[ERROR] /srv/gump/public/workspace/tika/tika-parsers/src/main/java/org/apache/tika/parser/font/AdobeFontMetricParser.java:[70,8]
cannot find symbol
[ERROR] symbol:   class FontMetric
[ERROR] location: class org.apache.tika.parser.font.AdobeFontMetricParser
[ERROR] /srv/gump/public/workspace/tika/tika-parsers/src/main/java/org/apache/tika/parser/font/AdobeFontMetricParser.java:[75,28]
cannot find symbol
[ERROR] symbol:   method getResult()
[ERROR] location: variable parser of type org.apache.fontbox.afm.AFMParser
[ERROR] /srv/gump/public/workspace/tika/tika-parsers/src/main/java/org/apache/tika/parser/font/TrueTypeParser.java:[67,26]
cannot find symbol
[ERROR] symbol:   method parseTTF(java.io.File)
[ERROR] location: variable parser of type org.apache.fontbox.ttf.TTFParser
[ERROR] /srv/gump/public/workspace/tika/tika-parsers/src/main/java/org/apache/tika/parser/font/TrueTypeParser.java:[69,26]
cannot find symbol
[ERROR] symbol:   method parseTTF(java.io.InputStream)
[ERROR] location: variable parser of type org.apache.fontbox.ttf.TTFParser
[ERROR] -> [Help 1]
[ERROR] 
[ERROR] To see the full stack trace of the errors, re-run Maven with the -e switch.
[ERROR] Re-run Maven using the -X switch to enable full debug logging.
[ERROR] 
[ERROR] For more information about the errors and possible solutions, please read the following
articles:
[ERROR] [Help 1] http://cwiki.apache.org/confluence/display/MAVEN/MojoFailureException
[ERROR] 
[ERROR] After correcting the problems, you can resume the build with the command
[ERROR]   mvn <goals> -rf :tika-parsers
---------------------------------------------

To subscribe to this information via syndicated feeds:
- RSS: http://vmgump.apache.org/gump/public/tika/tika-reactor/rss.xml
- Atom: http://vmgump.apache.org/gump/public/tika/tika-reactor/atom.xml

============================== Gump Tracking Only ===
Produced by Apache Gump(TM) version 2.3.
Gump Run 20150428000005, vmgump.apache.org:vmgump:20150428000005
Gump E-mail Identifier (unique within run) #6.


--
Apache Gump
http://gump.apache.org/ [Instance: vmgump]

---------------------------------------------------------------------
To unsubscribe, e-mail: general-unsubscribe@gump.apache.org
For additional commands, e-mail: general-help@gump.apache.org


Mime
View raw message