gump-general mailing list archives

Site index · List index
Message view « Date » · « Thread »
Top « Date » · « Thread »
From g...@vmgump.apache.org
Subject BATCH: All dressed up, with nowhere to go...
Date Mon, 13 Apr 2015 05:49:18 GMT
Dear Gumpmeisters,
            
The following 3 notifys should have been sent

*********************************************************** G U M P
[GUMP@vmgump]: Project pcre-make (in module pcre) failed
[GUMP@vmgump]: Project tika-parsers (in module tika) failed
[GUMP@vmgump]: Project tika-reactor (in module tika) failed
*********************************************************** G U M P
[GUMP@vmgump]: Project pcre-make (in module pcre) failed
To whom it may engage...
        
This is an automated request, but not an unsolicited one. For 
more information please visit http://gump.apache.org/nagged.html, 
and/or contact the folk at general@gump.apache.org.

Project pcre-make has an issue affecting its community integration.
This issue affects 8 projects,
 and has been outstanding for 42 runs.
The current state of this project is 'Failed', with reason 'Build Failed'.
For reference only, the following projects are affected by this:
    - apache-httpd-configure :  Apache HTTP Server
    - apache-httpd-make :  Apache HTTP Server
    - apache-httpd-make-install :  Apache HTTP Server
    - pcre-make :  PCRE - Perl Compatible Regular Expressions
    - pcre-make-install :  PCRE - Perl Compatible Regular Expressions
    - tomcat-jk-native :  Connectors to various web servers
    - tomcat-jk-native-buildconf :  Connectors to various web servers
    - tomcat-jk-native-configure :  Connectors to various web servers


Full details are available at:
    http://vmgump.apache.org/gump/public/pcre/pcre-make/index.html

That said, some information snippets are provided here.

The following annotations (debug/informational/warning/error messages) were provided:
 -INFO- Failed with reason build failed



The following work was performed:
http://vmgump.apache.org/gump/public/pcre/pcre-make/gump_work/build_pcre_pcre-make.html
Work Name: build_pcre_pcre-make (Type: Build)
Work ended in a state of : Failed
Elapsed: 1 sec
Command Line: make 
[Working Directory: /srv/gump/public/workspace/pcre]
---------------------------------------------
rm -f pcre_chartables.c
ln -s ./pcre_chartables.c.dist pcre_chartables.c
make  all-am
make[1]: Entering directory `/srv/gump/public/workspace/pcre'
  CC       libpcre_la-pcre_byte_order.lo
  CC       libpcre_la-pcre_compile.lo
pcre_compile.c: In function 'compile_branch':
pcre_compile.c:5541:45: error: 'class_uchardata_base' undeclared (first use in this function)
       *lengthptr += (int)(class_uchardata - class_uchardata_base);
                                             ^
pcre_compile.c:5541:45: note: each undeclared identifier is reported only once for each function
it appears in
make[1]: *** [libpcre_la-pcre_compile.lo] Error 1
make[1]: Leaving directory `/srv/gump/public/workspace/pcre'
make: *** [all] Error 2
---------------------------------------------

To subscribe to this information via syndicated feeds:
- RSS: http://vmgump.apache.org/gump/public/pcre/pcre-make/rss.xml
- Atom: http://vmgump.apache.org/gump/public/pcre/pcre-make/atom.xml

============================== Gump Tracking Only ===
Produced by Apache Gump(TM) version 2.3.
Gump Run 20150413000005, vmgump.apache.org:vmgump:20150413000005
Gump E-mail Identifier (unique within run) #1.

*********************************************************** G U M P
[GUMP@vmgump]: Project tika-parsers (in module tika) failed
To whom it may engage...
        
This is an automated request, but not an unsolicited one. For 
more information please visit http://gump.apache.org/nagged.html, 
and/or contact the folk at general@gump.apache.org.

Project tika-parsers has an issue affecting its community integration.
This issue affects 2 projects,
 and has been outstanding for 41 runs.
The current state of this project is 'Failed', with reason 'Build Failed'.
For reference only, the following projects are affected by this:
    - tika-parsers :  Apache Tika is a toolkit for detecting and extracting metada...
    - tika-parsers-test :  Apache Tika is a toolkit for detecting and extracting metada...


Full details are available at:
    http://vmgump.apache.org/gump/public/tika/tika-parsers/index.html

That said, some information snippets are provided here.

The following annotations (debug/informational/warning/error messages) were provided:
 -DEBUG- Sole jar output [tika-parsers-*[0-9T].jar] identifier set to project name
 -DEBUG- (Apache Gump generated) Apache Maven Settings in: /srv/gump/public/workspace/tika/tika-parsers/gump_mvn_settings.xml
 -INFO- Failed with reason build failed
 -DEBUG- Maven POM in: /srv/gump/public/workspace/tika/tika-parsers/pom.xml
 -INFO- Failed to extract fallback artifacts from Gump Repository



The following work was performed:
http://vmgump.apache.org/gump/public/tika/tika-parsers/gump_work/build_tika_tika-parsers.html
Work Name: build_tika_tika-parsers (Type: Build)
Work ended in a state of : Failed
Elapsed: 34 secs
Command Line: /opt/maven3/bin/mvn --batch-mode -DskipTests=true --settings /srv/gump/public/workspace/tika/tika-parsers/gump_mvn_settings.xml
package 
[Working Directory: /srv/gump/public/workspace/tika/tika-parsers]
M2_HOME: /opt/maven3
---------------------------------------------
[INFO] Downloading: http://localhost:8192/maven2/org/itadaki/bzip2/0.9.1/bzip2-0.9.1.jar
[INFO] Downloaded: http://localhost:8192/maven2/org/jdom/jdom2/2.0.4/jdom2-2.0.4.jar (292
KB at 243.8 KB/sec)
[INFO] Downloading: http://localhost:8192/maven2/edu/ucar/cdm/4.5.5/cdm-4.5.5.jar
[INFO] Downloading: http://localhost:8192/maven2/edu/ucar/udunits/4.5.5/udunits-4.5.5.jar
[INFO] Downloaded: http://localhost:8192/maven2/org/jsoup/jsoup/1.7.2/jsoup-1.7.2.jar (287
KB at 240.0 KB/sec)
[INFO] Downloading: http://localhost:8192/maven2/org/apache/httpcomponents/httpcore/4.2.5/httpcore-4.2.5.jar
[INFO] Downloaded: http://localhost:8192/maven2/com/google/protobuf/protobuf-java/2.5.0/protobuf-java-2.5.0.jar
(521 KB at 416.1 KB/sec)
[INFO] Downloading: http://localhost:8192/maven2/joda-time/joda-time/2.2/joda-time-2.2.jar
[INFO] Downloading: http://localhost:8192/maven2/org/quartz-scheduler/quartz/2.2.0/quartz-2.2.0.jar
[INFO] Downloading: http://localhost:8192/maven2/c3p0/c3p0/0.9.1.1/c3p0-0.9.1.1.jar
[INFO] Downloaded: http://localhost:8192/maven2/org/apache/httpcomponents/httpcore/4.2.5/httpcore-4.2.5.jar
(223 KB at 421.2 KB/sec)
[INFO] Downloading: http://localhost:8192/maven2/net/sf/ehcache/ehcache-core/2.6.2/ehcache-core-2.6.2.jar
[INFO] Downloaded: http://localhost:8192/maven2/joda-time/joda-time/2.2/joda-time-2.2.jar
(561 KB at 1013.5 KB/sec)
[INFO] Downloading: http://localhost:8192/maven2/com/beust/jcommander/1.35/jcommander-1.35.jar
[INFO] Downloaded: http://localhost:8192/maven2/org/quartz-scheduler/quartz/2.2.0/quartz-2.2.0.jar
(639 KB at 1146.2 KB/sec)
[INFO] Downloading: http://localhost:8192/maven2/edu/ucar/httpservices/4.5.5/httpservices-4.5.5.jar
[INFO] Downloaded: http://localhost:8192/maven2/c3p0/c3p0/0.9.1.1/c3p0-0.9.1.1.jar (595 KB
at 1022.6 KB/sec)
[INFO] Downloading: http://localhost:8192/maven2/org/apache/httpcomponents/httpclient/4.2.6/httpclient-4.2.6.jar
[INFO] Downloaded: http://localhost:8192/maven2/net/sf/ehcache/ehcache-core/2.6.2/ehcache-core-2.6.2.jar
(1307 KB at 2424.4 KB/sec)
[INFO] Downloading: http://localhost:8192/maven2/org/apache/httpcomponents/httpmime/4.2.6/httpmime-4.2.6.jar
[INFO] Downloaded: http://localhost:8192/maven2/com/beust/jcommander/1.35/jcommander-1.35.jar
(60 KB at 108.1 KB/sec)
[INFO] Downloading: http://localhost:8192/maven2/com/google/guava/guava/10.0.1/guava-10.0.1.jar
[INFO] Downloaded: http://localhost:8192/maven2/edu/ucar/httpservices/4.5.5/httpservices-4.5.5.jar
(61 KB at 108.9 KB/sec)
[INFO] Downloading: http://localhost:8192/maven2/org/apache/commons/commons-csv/1.0/commons-csv-1.0.jar
[INFO] Downloaded: http://localhost:8192/maven2/org/apache/httpcomponents/httpclient/4.2.6/httpclient-4.2.6.jar
(426 KB at 749.0 KB/sec)
[INFO] Downloaded: http://localhost:8192/maven2/com/google/guava/guava/10.0.1/guava-10.0.1.jar
(2204 KB at 18361.1 KB/sec)
[INFO] Downloaded: http://localhost:8192/maven2/org/apache/httpcomponents/httpmime/4.2.6/httpmime-4.2.6.jar
(27 KB at 135.7 KB/sec)
[INFO] Downloaded: http://localhost:8192/maven2/org/apache/commons/commons-csv/1.0/commons-csv-1.0.jar
(35 KB at 209.9 KB/sec)
[INFO] Downloaded: http://localhost:8192/maven2/edu/ucar/cdm/4.5.5/cdm-4.5.5.jar (4084 KB
at 1364.0 KB/sec)
[INFO] Downloading: https://artifacts.unidata.ucar.edu/content/repositories/unidata/edu/ucar/jj2000/5.2/jj2000-5.2.jar
[INFO] Downloading: https://artifacts.unidata.ucar.edu/content/repositories/unidata/org/itadaki/bzip2/0.9.1/bzip2-0.9.1.jar
[INFO] Downloaded: https://artifacts.unidata.ucar.edu/content/repositories/unidata/org/itadaki/bzip2/0.9.1/bzip2-0.9.1.jar
(53 KB at 202.8 KB/sec)
[INFO] Downloaded: https://artifacts.unidata.ucar.edu/content/repositories/unidata/edu/ucar/jj2000/5.2/jj2000-5.2.jar
(518 KB at 1016.9 KB/sec)
[INFO] Downloading: http://download.oracle.com/maven/edu/ucar/udunits/4.5.5/udunits-4.5.5.jar
[INFO] Downloading: https://artifacts.unidata.ucar.edu/content/repositories/unidata/edu/ucar/udunits/4.5.5/udunits-4.5.5.jar
[INFO] Downloaded: https://artifacts.unidata.ucar.edu/content/repositories/unidata/edu/ucar/udunits/4.5.5/udunits-4.5.5.jar
(122 KB at 435.0 KB/sec)
[INFO] ------------------------------------------------------------------------
[INFO] BUILD FAILURE
[INFO] ------------------------------------------------------------------------
[INFO] Total time: 28.650 s
[INFO] Finished at: 2015-04-13T02:11:39+00:00
[INFO] Final Memory: 10M/24M
[INFO] ------------------------------------------------------------------------
[ERROR] Failed to execute goal on project tika-parsers: Could not resolve dependencies for
project org.apache.tika:tika-parsers:bundle:1.9-SNAPSHOT: Could not find artifact org.apache.tika:tika-core:jar:tests:1.9-SNAPSHOT
in gump-apache.snapshots (http://localhost:8192/repo/m2-snapshot-repository) -> [Help 1]
[ERROR] 
[ERROR] To see the full stack trace of the errors, re-run Maven with the -e switch.
[ERROR] Re-run Maven using the -X switch to enable full debug logging.
[ERROR] 
[ERROR] For more information about the errors and possible solutions, please read the following
articles:
[ERROR] [Help 1] http://cwiki.apache.org/confluence/display/MAVEN/DependencyResolutionException
---------------------------------------------

To subscribe to this information via syndicated feeds:
- RSS: http://vmgump.apache.org/gump/public/tika/tika-parsers/rss.xml
- Atom: http://vmgump.apache.org/gump/public/tika/tika-parsers/atom.xml

============================== Gump Tracking Only ===
Produced by Apache Gump(TM) version 2.3.
Gump Run 20150413000005, vmgump.apache.org:vmgump:20150413000005
Gump E-mail Identifier (unique within run) #3.

*********************************************************** G U M P
[GUMP@vmgump]: Project tika-reactor (in module tika) failed
To whom it may engage...
        
This is an automated request, but not an unsolicited one. For 
more information please visit http://gump.apache.org/nagged.html, 
and/or contact the folk at general@gump.apache.org.

Project tika-reactor has an issue affecting its community integration.
This issue affects 1 projects,
 and has been outstanding for 41 runs.
The current state of this project is 'Failed', with reason 'Build Failed'.
For reference only, the following projects are affected by this:
    - tika-reactor :  Apache Tika is a toolkit for detecting and extracting metada...


Full details are available at:
    http://vmgump.apache.org/gump/public/tika/tika-reactor/index.html

That said, some information snippets are provided here.

The following annotations (debug/informational/warning/error messages) were provided:
 -INFO- Optional dependency tika-parsers failed with reason build failed
 -DEBUG- (Apache Gump generated) Apache Maven Settings in: /srv/gump/public/workspace/tika/gump_mvn_settings.xml
 -INFO- Failed with reason build failed
 -DEBUG- Maven POM in: /srv/gump/public/workspace/tika/pom.xml



The following work was performed:
http://vmgump.apache.org/gump/public/tika/tika-reactor/gump_work/build_tika_tika-reactor.html
Work Name: build_tika_tika-reactor (Type: Build)
Work ended in a state of : Failed
Elapsed: 1 min 5 secs
Command Line: /opt/maven3/bin/mvn --batch-mode -DskipTests=true --settings /srv/gump/public/workspace/tika/gump_mvn_settings.xml
install 
[Working Directory: /srv/gump/public/workspace/tika]
MAVEN_OPTS: -Xmx512m 
M2_HOME: /opt/maven3
---------------------------------------------
[INFO] -------------------------------------------------------------
[INFO] ------------------------------------------------------------------------
[INFO] Reactor Summary:
[INFO] 
[INFO] Apache Tika parent ................................. SUCCESS [  9.716 s]
[INFO] Apache Tika core ................................... SUCCESS [ 28.137 s]
[INFO] Apache Tika parsers ................................ FAILURE [ 18.999 s]
[INFO] Apache Tika XMP .................................... SKIPPED
[INFO] Apache Tika serialization .......................... SKIPPED
[INFO] Apache Tika batch .................................. SKIPPED
[INFO] Apache Tika application ............................ SKIPPED
[INFO] Apache Tika OSGi bundle ............................ SKIPPED
[INFO] Apache Tika server ................................. SKIPPED
[INFO] Apache Tika translate .............................. SKIPPED
[INFO] Apache Tika examples ............................... SKIPPED
[INFO] Apache Tika Java-7 Components ...................... SKIPPED
[INFO] Apache Tika ........................................ SKIPPED
[INFO] ------------------------------------------------------------------------
[INFO] BUILD FAILURE
[INFO] ------------------------------------------------------------------------
[INFO] Total time: 01:02 min
[INFO] Finished at: 2015-04-13T02:12:45+00:00
[INFO] Final Memory: 40M/102M
[INFO] ------------------------------------------------------------------------
[ERROR] Failed to execute goal org.apache.maven.plugins:maven-compiler-plugin:3.2:compile
(default-compile) on project tika-parsers: Compilation failure: Compilation failure:
[ERROR] /srv/gump/public/workspace/tika/tika-parsers/src/main/java/org/apache/tika/parser/font/AdobeFontMetricParser.java:[26,30]
cannot find symbol
[ERROR] symbol:   class FontMetric
[ERROR] location: package org.apache.fontbox.afm
[ERROR] /srv/gump/public/workspace/tika/tika-parsers/src/main/java/org/apache/tika/parser/font/AdobeFontMetricParser.java:[70,8]
cannot find symbol
[ERROR] symbol:   class FontMetric
[ERROR] location: class org.apache.tika.parser.font.AdobeFontMetricParser
[ERROR] /srv/gump/public/workspace/tika/tika-parsers/src/main/java/org/apache/tika/parser/font/AdobeFontMetricParser.java:[75,28]
cannot find symbol
[ERROR] symbol:   method getResult()
[ERROR] location: variable parser of type org.apache.fontbox.afm.AFMParser
[ERROR] /srv/gump/public/workspace/tika/tika-parsers/src/main/java/org/apache/tika/parser/font/TrueTypeParser.java:[67,26]
cannot find symbol
[ERROR] symbol:   method parseTTF(java.io.File)
[ERROR] location: variable parser of type org.apache.fontbox.ttf.TTFParser
[ERROR] /srv/gump/public/workspace/tika/tika-parsers/src/main/java/org/apache/tika/parser/font/TrueTypeParser.java:[69,26]
cannot find symbol
[ERROR] symbol:   method parseTTF(java.io.InputStream)
[ERROR] location: variable parser of type org.apache.fontbox.ttf.TTFParser
[ERROR] -> [Help 1]
[ERROR] 
[ERROR] To see the full stack trace of the errors, re-run Maven with the -e switch.
[ERROR] Re-run Maven using the -X switch to enable full debug logging.
[ERROR] 
[ERROR] For more information about the errors and possible solutions, please read the following
articles:
[ERROR] [Help 1] http://cwiki.apache.org/confluence/display/MAVEN/MojoFailureException
[ERROR] 
[ERROR] After correcting the problems, you can resume the build with the command
[ERROR]   mvn <goals> -rf :tika-parsers
---------------------------------------------

To subscribe to this information via syndicated feeds:
- RSS: http://vmgump.apache.org/gump/public/tika/tika-reactor/rss.xml
- Atom: http://vmgump.apache.org/gump/public/tika/tika-reactor/atom.xml

============================== Gump Tracking Only ===
Produced by Apache Gump(TM) version 2.3.
Gump Run 20150413000005, vmgump.apache.org:vmgump:20150413000005
Gump E-mail Identifier (unique within run) #4.


--
Apache Gump
http://gump.apache.org/ [Instance: vmgump]

---------------------------------------------------------------------
To unsubscribe, e-mail: general-unsubscribe@gump.apache.org
For additional commands, e-mail: general-help@gump.apache.org


Mime
View raw message