gump-general mailing list archives

Site index · List index
Message view « Date » · « Thread »
Top « Date » · « Thread »
From g...@vmgump.apache.org
Subject BATCH: All dressed up, with nowhere to go...
Date Mon, 16 Mar 2015 12:54:04 GMT
Dear Gumpmeisters,
            
The following 3 notifys should have been sent

*********************************************************** G U M P
[GUMP@vmgump]: Project tika-parsers (in module tika) failed
[GUMP@vmgump]: Project tika-reactor (in module tika) failed
[GUMP@vmgump]: Project checkstyle (in module checkstyle) failed
*********************************************************** G U M P
[GUMP@vmgump]: Project tika-parsers (in module tika) failed
To whom it may engage...
        
This is an automated request, but not an unsolicited one. For 
more information please visit http://gump.apache.org/nagged.html, 
and/or contact the folk at general@gump.apache.org.

Project tika-parsers has an issue affecting its community integration.
This issue affects 2 projects,
 and has been outstanding for 203 runs.
The current state of this project is 'Failed', with reason 'Build Failed'.
For reference only, the following projects are affected by this:
    - tika-parsers :  Apache Tika is a toolkit for detecting and extracting metada...
    - tika-parsers-test :  Apache Tika is a toolkit for detecting and extracting metada...


Full details are available at:
    http://vmgump.apache.org/gump/public/tika/tika-parsers/index.html

That said, some information snippets are provided here.

The following annotations (debug/informational/warning/error messages) were provided:
 -DEBUG- Sole jar output [tika-parsers-*[0-9T].jar] identifier set to project name
 -DEBUG- (Apache Gump generated) Apache Maven Settings in: /srv/gump/public/workspace/tika/tika-parsers/gump_mvn_settings.xml
 -INFO- Failed with reason build failed
 -DEBUG- Maven POM in: /srv/gump/public/workspace/tika/tika-parsers/pom.xml
 -INFO- Failed to extract fallback artifacts from Gump Repository



The following work was performed:
http://vmgump.apache.org/gump/public/tika/tika-parsers/gump_work/build_tika_tika-parsers.html
Work Name: build_tika_tika-parsers (Type: Build)
Work ended in a state of : Failed
Elapsed: 51 secs
Command Line: /opt/maven3/bin/mvn --batch-mode -DskipTests=true --settings /srv/gump/public/workspace/tika/tika-parsers/gump_mvn_settings.xml
package 
[Working Directory: /srv/gump/public/workspace/tika/tika-parsers]
M2_HOME: /opt/maven3
---------------------------------------------
[INFO] Downloading: http://localhost:8192/maven2/edu/ucar/jj2000/5.2/jj2000-5.2.jar
[INFO] Downloaded: http://localhost:8192/maven2/com/google/protobuf/protobuf-java/2.5.0/protobuf-java-2.5.0.jar
(521 KB at 1186.7 KB/sec)
[INFO] Downloading: http://localhost:8192/maven2/org/itadaki/bzip2/0.9.1/bzip2-0.9.1.jar
[INFO] Downloaded: http://localhost:8192/maven2/org/jdom/jdom2/2.0.4/jdom2-2.0.4.jar (292
KB at 627.9 KB/sec)
[INFO] Downloading: http://localhost:8192/maven2/edu/ucar/cdm/4.5.5/cdm-4.5.5.jar
[INFO] Downloaded: http://localhost:8192/maven2/org/jsoup/jsoup/1.7.2/jsoup-1.7.2.jar (287
KB at 605.0 KB/sec)
[INFO] Downloading: http://localhost:8192/maven2/edu/ucar/udunits/4.5.5/udunits-4.5.5.jar
[INFO] Downloading: http://localhost:8192/maven2/org/apache/httpcomponents/httpcore/4.2.5/httpcore-4.2.5.jar
[INFO] Downloading: http://localhost:8192/maven2/joda-time/joda-time/2.2/joda-time-2.2.jar
[INFO] Downloading: http://localhost:8192/maven2/org/quartz-scheduler/quartz/2.2.0/quartz-2.2.0.jar
[INFO] Downloaded: http://localhost:8192/maven2/edu/ucar/cdm/4.5.5/cdm-4.5.5.jar (4084 KB
at 3911.8 KB/sec)
[INFO] Downloading: http://localhost:8192/maven2/c3p0/c3p0/0.9.1.1/c3p0-0.9.1.1.jar
[INFO] Downloaded: http://localhost:8192/maven2/org/apache/httpcomponents/httpcore/4.2.5/httpcore-4.2.5.jar
(223 KB at 197.5 KB/sec)
[INFO] Downloading: http://localhost:8192/maven2/net/sf/ehcache/ehcache-core/2.6.2/ehcache-core-2.6.2.jar
[INFO] Downloaded: http://localhost:8192/maven2/joda-time/joda-time/2.2/joda-time-2.2.jar
(561 KB at 495.5 KB/sec)
[INFO] Downloading: http://localhost:8192/maven2/com/beust/jcommander/1.35/jcommander-1.35.jar
[INFO] Downloaded: http://localhost:8192/maven2/org/quartz-scheduler/quartz/2.2.0/quartz-2.2.0.jar
(639 KB at 873.4 KB/sec)
[INFO] Downloading: http://localhost:8192/maven2/edu/ucar/httpservices/4.5.5/httpservices-4.5.5.jar
[INFO] Downloaded: http://localhost:8192/maven2/c3p0/c3p0/0.9.1.1/c3p0-0.9.1.1.jar (595 KB
at 940.1 KB/sec)
[INFO] Downloading: http://localhost:8192/maven2/org/apache/httpcomponents/httpclient/4.2.6/httpclient-4.2.6.jar
[INFO] Downloaded: http://localhost:8192/maven2/net/sf/ehcache/ehcache-core/2.6.2/ehcache-core-2.6.2.jar
(1307 KB at 2522.7 KB/sec)
[INFO] Downloading: http://localhost:8192/maven2/org/apache/httpcomponents/httpmime/4.2.6/httpmime-4.2.6.jar
[INFO] Downloaded: http://localhost:8192/maven2/com/beust/jcommander/1.35/jcommander-1.35.jar
(60 KB at 108.7 KB/sec)
[INFO] Downloading: http://localhost:8192/maven2/com/google/guava/guava/10.0.1/guava-10.0.1.jar
[INFO] Downloaded: http://localhost:8192/maven2/com/google/guava/guava/10.0.1/guava-10.0.1.jar
(2204 KB at 10695.8 KB/sec)
[INFO] Downloaded: http://localhost:8192/maven2/edu/ucar/httpservices/4.5.5/httpservices-4.5.5.jar
(61 KB at 145.0 KB/sec)
[INFO] Downloaded: http://localhost:8192/maven2/org/apache/httpcomponents/httpclient/4.2.6/httpclient-4.2.6.jar
(426 KB at 1325.3 KB/sec)
[INFO] Downloaded: http://localhost:8192/maven2/org/apache/httpcomponents/httpmime/4.2.6/httpmime-4.2.6.jar
(27 KB at 63.3 KB/sec)
[INFO] Downloaded: http://localhost:8192/maven2/edu/ucar/grib/4.5.5/grib-4.5.5.jar (5007 KB
at 1904.3 KB/sec)
[INFO] Downloading: https://artifacts.unidata.ucar.edu/content/repositories/unidata/edu/ucar/jj2000/5.2/jj2000-5.2.jar
[INFO] Downloading: https://artifacts.unidata.ucar.edu/content/repositories/unidata/org/itadaki/bzip2/0.9.1/bzip2-0.9.1.jar
[INFO] Downloaded: https://artifacts.unidata.ucar.edu/content/repositories/unidata/org/itadaki/bzip2/0.9.1/bzip2-0.9.1.jar
(53 KB at 154.3 KB/sec)
[INFO] Downloaded: https://artifacts.unidata.ucar.edu/content/repositories/unidata/edu/ucar/jj2000/5.2/jj2000-5.2.jar
(518 KB at 1089.6 KB/sec)
[INFO] Downloading: http://download.oracle.com/maven/edu/ucar/udunits/4.5.5/udunits-4.5.5.jar
[INFO] Downloading: https://artifacts.unidata.ucar.edu/content/repositories/unidata/edu/ucar/udunits/4.5.5/udunits-4.5.5.jar
[INFO] Downloaded: https://artifacts.unidata.ucar.edu/content/repositories/unidata/edu/ucar/udunits/4.5.5/udunits-4.5.5.jar
(122 KB at 553.6 KB/sec)
[INFO] ------------------------------------------------------------------------
[INFO] BUILD FAILURE
[INFO] ------------------------------------------------------------------------
[INFO] Total time: 42.229 s
[INFO] Finished at: 2015-03-16T03:32:11+00:00
[INFO] Final Memory: 10M/25M
[INFO] ------------------------------------------------------------------------
[ERROR] Failed to execute goal on project tika-parsers: Could not resolve dependencies for
project org.apache.tika:tika-parsers:bundle:1.8-SNAPSHOT: Could not find artifact org.apache.tika:tika-core:jar:tests:1.8-SNAPSHOT
in gump-apache.snapshots (http://localhost:8192/repo/m2-snapshot-repository) -> [Help 1]
[ERROR] 
[ERROR] To see the full stack trace of the errors, re-run Maven with the -e switch.
[ERROR] Re-run Maven using the -X switch to enable full debug logging.
[ERROR] 
[ERROR] For more information about the errors and possible solutions, please read the following
articles:
[ERROR] [Help 1] http://cwiki.apache.org/confluence/display/MAVEN/DependencyResolutionException
---------------------------------------------

To subscribe to this information via syndicated feeds:
- RSS: http://vmgump.apache.org/gump/public/tika/tika-parsers/rss.xml
- Atom: http://vmgump.apache.org/gump/public/tika/tika-parsers/atom.xml

============================== Gump Tracking Only ===
Produced by Apache Gump(TM) version 2.3.
Gump Run 20150316000005, vmgump.apache.org:vmgump:20150316000005
Gump E-mail Identifier (unique within run) #1.

*********************************************************** G U M P
[GUMP@vmgump]: Project tika-reactor (in module tika) failed
To whom it may engage...
        
This is an automated request, but not an unsolicited one. For 
more information please visit http://gump.apache.org/nagged.html, 
and/or contact the folk at general@gump.apache.org.

Project tika-reactor has an issue affecting its community integration.
This issue affects 1 projects,
 and has been outstanding for 203 runs.
The current state of this project is 'Failed', with reason 'Build Failed'.
For reference only, the following projects are affected by this:
    - tika-reactor :  Apache Tika is a toolkit for detecting and extracting metada...


Full details are available at:
    http://vmgump.apache.org/gump/public/tika/tika-reactor/index.html

That said, some information snippets are provided here.

The following annotations (debug/informational/warning/error messages) were provided:
 -INFO- Optional dependency tika-parsers failed with reason build failed
 -DEBUG- (Apache Gump generated) Apache Maven Settings in: /srv/gump/public/workspace/tika/gump_mvn_settings.xml
 -INFO- Failed with reason build failed
 -DEBUG- Maven POM in: /srv/gump/public/workspace/tika/pom.xml



The following work was performed:
http://vmgump.apache.org/gump/public/tika/tika-reactor/gump_work/build_tika_tika-reactor.html
Work Name: build_tika_tika-reactor (Type: Build)
Work ended in a state of : Failed
Elapsed: 1 min 56 secs
Command Line: /opt/maven3/bin/mvn --batch-mode -DskipTests=true --settings /srv/gump/public/workspace/tika/gump_mvn_settings.xml
install 
[Working Directory: /srv/gump/public/workspace/tika]
MAVEN_OPTS: -Xmx512m 
M2_HOME: /opt/maven3
---------------------------------------------
[INFO] 5 errors 
[INFO] -------------------------------------------------------------
[INFO] ------------------------------------------------------------------------
[INFO] Reactor Summary:
[INFO] 
[INFO] Apache Tika parent ................................. SUCCESS [ 15.853 s]
[INFO] Apache Tika core ................................... SUCCESS [ 42.397 s]
[INFO] Apache Tika parsers ................................ FAILURE [ 44.556 s]
[INFO] Apache Tika XMP .................................... SKIPPED
[INFO] Apache Tika serialization .......................... SKIPPED
[INFO] Apache Tika application ............................ SKIPPED
[INFO] Apache Tika OSGi bundle ............................ SKIPPED
[INFO] Apache Tika server ................................. SKIPPED
[INFO] Apache Tika translate .............................. SKIPPED
[INFO] Apache Tika examples ............................... SKIPPED
[INFO] Apache Tika Java-7 Components ...................... SKIPPED
[INFO] Apache Tika ........................................ SKIPPED
[INFO] ------------------------------------------------------------------------
[INFO] BUILD FAILURE
[INFO] ------------------------------------------------------------------------
[INFO] Total time: 01:50 min
[INFO] Finished at: 2015-03-16T03:34:08+00:00
[INFO] Final Memory: 41M/139M
[INFO] ------------------------------------------------------------------------
[ERROR] Failed to execute goal org.apache.maven.plugins:maven-compiler-plugin:3.2:compile
(default-compile) on project tika-parsers: Compilation failure: Compilation failure:
[ERROR] /srv/gump/public/workspace/tika/tika-parsers/src/main/java/org/apache/tika/parser/font/AdobeFontMetricParser.java:[26,30]
cannot find symbol
[ERROR] symbol:   class FontMetric
[ERROR] location: package org.apache.fontbox.afm
[ERROR] /srv/gump/public/workspace/tika/tika-parsers/src/main/java/org/apache/tika/parser/font/AdobeFontMetricParser.java:[70,8]
cannot find symbol
[ERROR] symbol:   class FontMetric
[ERROR] location: class org.apache.tika.parser.font.AdobeFontMetricParser
[ERROR] /srv/gump/public/workspace/tika/tika-parsers/src/main/java/org/apache/tika/parser/font/AdobeFontMetricParser.java:[75,28]
cannot find symbol
[ERROR] symbol:   method getResult()
[ERROR] location: variable parser of type org.apache.fontbox.afm.AFMParser
[ERROR] /srv/gump/public/workspace/tika/tika-parsers/src/main/java/org/apache/tika/parser/font/TrueTypeParser.java:[67,26]
cannot find symbol
[ERROR] symbol:   method parseTTF(java.io.File)
[ERROR] location: variable parser of type org.apache.fontbox.ttf.TTFParser
[ERROR] /srv/gump/public/workspace/tika/tika-parsers/src/main/java/org/apache/tika/parser/font/TrueTypeParser.java:[69,26]
cannot find symbol
[ERROR] symbol:   method parseTTF(java.io.InputStream)
[ERROR] location: variable parser of type org.apache.fontbox.ttf.TTFParser
[ERROR] -> [Help 1]
[ERROR] 
[ERROR] To see the full stack trace of the errors, re-run Maven with the -e switch.
[ERROR] Re-run Maven using the -X switch to enable full debug logging.
[ERROR] 
[ERROR] For more information about the errors and possible solutions, please read the following
articles:
[ERROR] [Help 1] http://cwiki.apache.org/confluence/display/MAVEN/MojoFailureException
[ERROR] 
[ERROR] After correcting the problems, you can resume the build with the command
[ERROR]   mvn <goals> -rf :tika-parsers
---------------------------------------------

To subscribe to this information via syndicated feeds:
- RSS: http://vmgump.apache.org/gump/public/tika/tika-reactor/rss.xml
- Atom: http://vmgump.apache.org/gump/public/tika/tika-reactor/atom.xml

============================== Gump Tracking Only ===
Produced by Apache Gump(TM) version 2.3.
Gump Run 20150316000005, vmgump.apache.org:vmgump:20150316000005
Gump E-mail Identifier (unique within run) #2.

*********************************************************** G U M P
[GUMP@vmgump]: Project checkstyle (in module checkstyle) failed
To whom it may engage...
        
This is an automated request, but not an unsolicited one. For 
more information please visit http://gump.apache.org/nagged.html, 
and/or contact the folk at general@gump.apache.org.

Project checkstyle has an issue affecting its community integration.
This issue affects 5 projects,
 and has been outstanding for 5 runs.
The current state of this project is 'Failed', with reason 'Build Failed'.
For reference only, the following projects are affected by this:
    - checkstyle :  Java style checker
    - tomcat-tc7.0.x-validate :  Tomcat 7.x, a web server implementing Java Servlet 3.0,
    ...
    - tomcat-tc8.0.x-validate :  Tomcat 8.x, a web server implementing the Java Servlet 3.1,
...
    - tomcat-trunk-validate :  Tomcat 9.x, a web server implementing the Java Servlet 4.0,
...
    - xmlgraphics-commons-test :  Apache XML Graphics Commons - Common Components for Batik
an...


Full details are available at:
    http://vmgump.apache.org/gump/public/checkstyle/checkstyle/index.html

That said, some information snippets are provided here.

The following annotations (debug/informational/warning/error messages) were provided:
 -DEBUG- (Apache Gump generated) Apache Maven Settings in: /srv/gump/public/workspace/checkstyle/gump_mvn_settings.xml
 -INFO- Failed with reason build failed
 -DEBUG- Maven POM in: /srv/gump/public/workspace/checkstyle/pom.xml
 -INFO- Failed to extract fallback artifacts from Gump Repository



The following work was performed:
http://vmgump.apache.org/gump/public/checkstyle/checkstyle/gump_work/build_checkstyle_checkstyle.html
Work Name: build_checkstyle_checkstyle (Type: Build)
Work ended in a state of : Failed
Elapsed: 5 mins 33 secs
Command Line: /opt/maven3/bin/mvn --batch-mode -DskipTests=true --settings /srv/gump/public/workspace/checkstyle/gump_mvn_settings.xml
install 
[Working Directory: /srv/gump/public/workspace/checkstyle]
M2_HOME: /opt/maven3
---------------------------------------------
com.puppycrawl.tools.checkstyle.checks.coding.NoCloneCheck failed check. Line coverage rate
of 0.0% is below 100.0%
com.puppycrawl.tools.checkstyle.checks.AbstractTypeAwareCheck$ClassAlias failed check. Line
coverage rate of 0.0% is below 80.0%
com.puppycrawl.tools.checkstyle.checks.coding.ExplicitInitializationCheck failed check. Branch
coverage rate of 0.0% is below 90.0%
com.puppycrawl.tools.checkstyle.checks.coding.ExplicitInitializationCheck failed check. Line
coverage rate of 0.0% is below 90.0%
com.puppycrawl.tools.checkstyle.checks.coding.AbstractIllegalCheck failed check. Branch coverage
rate of 0.0% is below 64.0%
com.puppycrawl.tools.checkstyle.checks.coding.AbstractIllegalCheck failed check. Line coverage
rate of 0.0% is below 100.0%
com.puppycrawl.tools.checkstyle.checks.metrics.JavaNCSSCheck$Counter failed check. Line coverage
rate of 0.0% is below 100.0%
com.puppycrawl.tools.checkstyle.checks.annotation.AnnotationUseStyleCheck$TrailingArrayComma
failed check. Line coverage rate of 0.0% is below 100.0%
com.puppycrawl.tools.checkstyle.checks.naming.PackageNameCheck failed check. Branch coverage
rate of 0.0% is below 100.0%
com.puppycrawl.tools.checkstyle.checks.naming.PackageNameCheck failed check. Line coverage
rate of 0.0% is below 88.0%
com.puppycrawl.tools.checkstyle.checks.indentation.LineWrappingHandler failed check. Branch
coverage rate of 0.0% is below 87.0%
com.puppycrawl.tools.checkstyle.checks.indentation.LineWrappingHandler failed check. Line
coverage rate of 0.0% is below 91.0%
com.puppycrawl.tools.checkstyle.checks.regexp.SinglelineDetector failed check. Branch coverage
rate of 0.0% is below 93.0%
com.puppycrawl.tools.checkstyle.checks.regexp.SinglelineDetector failed check. Line coverage
rate of 0.0% is below 96.0%
com.puppycrawl.tools.checkstyle.checks.indentation.ClassDefHandler failed check. Branch coverage
rate of 0.0% is below 100.0%
com.puppycrawl.tools.checkstyle.checks.indentation.ClassDefHandler failed check. Line coverage
rate of 0.0% is below 100.0%
com.puppycrawl.tools.checkstyle.checks.javadoc.SummaryJavadocCheck failed check. Branch coverage
rate of 0.0% is below 93.0%
com.puppycrawl.tools.checkstyle.checks.javadoc.SummaryJavadocCheck failed check. Line coverage
rate of 0.0% is below 100.0%
com.puppycrawl.tools.checkstyle.checks.annotation.AnnotationUseStyleCheck$ElementStyle failed
check. Line coverage rate of 0.0% is below 100.0%
com.puppycrawl.tools.checkstyle.api.JavadocTagInfo$19 failed check. Line coverage rate of
0.0% is below 8.0%
com.puppycrawl.tools.checkstyle.api.JavadocTagInfo$17 failed check. Line coverage rate of
0.0% is below 8.0%
com.puppycrawl.tools.checkstyle.checks.coding.AbstractSuperCheck$MethodNode failed check.
Line coverage rate of 0.0% is below 100.0%
com.puppycrawl.tools.checkstyle.api.JavadocTagInfo$18 failed check. Line coverage rate of
0.0% is below 8.0%
com.puppycrawl.tools.checkstyle.PackageNamesLoader failed check. Branch coverage rate of 0.0%
is below 78.0%
com.puppycrawl.tools.checkstyle.PackageNamesLoader failed check. Line coverage rate of 0.0%
is below 72.0%
com.puppycrawl.tools.checkstyle.filters.CSVFilter failed check. Branch coverage rate of 0.0%
is below 100.0%
com.puppycrawl.tools.checkstyle.filters.CSVFilter failed check. Line coverage rate of 0.0%
is below 93.0%
com.puppycrawl.tools.checkstyle.checks.naming.LocalFinalVariableNameCheck failed check. Branch
coverage rate of 0.0% is below 87.0%
com.puppycrawl.tools.checkstyle.checks.naming.LocalFinalVariableNameCheck failed check. Line
coverage rate of 0.0% is below 85.0%
com.puppycrawl.tools.checkstyle.checks.sizes.MethodLengthCheck failed check. Branch coverage
rate of 0.0% is below 100.0%
com.puppycrawl.tools.checkstyle.checks.sizes.MethodLengthCheck failed check. Line coverage
rate of 0.0% is below 95.0%
com.puppycrawl.tools.checkstyle.checks.coding.ModifiedControlVariableCheck failed check. Branch
coverage rate of 0.0% is below 83.0%
com.puppycrawl.tools.checkstyle.checks.coding.ModifiedControlVariableCheck failed check. Line
coverage rate of 0.0% is below 93.0%
Project failed check. Total branch coverage rate of 0.0% is below 83.0%
Project failed check. Total line coverage rate of 0.0% is below 89.0%

[INFO] ------------------------------------------------------------------------
[INFO] BUILD FAILURE
[INFO] ------------------------------------------------------------------------
[INFO] Total time: 05:25 min
[INFO] Finished at: 2015-03-16T03:42:34+00:00
[INFO] Final Memory: 43M/167M
[INFO] ------------------------------------------------------------------------
[ERROR] Failed to execute goal org.codehaus.mojo:cobertura-maven-plugin:2.6:check (default)
on project checkstyle: Coverage check failed. See messages above. -> [Help 1]
[ERROR] 
[ERROR] To see the full stack trace of the errors, re-run Maven with the -e switch.
[ERROR] Re-run Maven using the -X switch to enable full debug logging.
[ERROR] 
[ERROR] For more information about the errors and possible solutions, please read the following
articles:
[ERROR] [Help 1] http://cwiki.apache.org/confluence/display/MAVEN/MojoFailureException
---------------------------------------------

To subscribe to this information via syndicated feeds:
- RSS: http://vmgump.apache.org/gump/public/checkstyle/checkstyle/rss.xml
- Atom: http://vmgump.apache.org/gump/public/checkstyle/checkstyle/atom.xml

============================== Gump Tracking Only ===
Produced by Apache Gump(TM) version 2.3.
Gump Run 20150316000005, vmgump.apache.org:vmgump:20150316000005
Gump E-mail Identifier (unique within run) #3.


--
Apache Gump
http://gump.apache.org/ [Instance: vmgump]

---------------------------------------------------------------------
To unsubscribe, e-mail: general-unsubscribe@gump.apache.org
For additional commands, e-mail: general-help@gump.apache.org


Mime
View raw message