gump-general mailing list archives

Site index · List index
Message view « Date » · « Thread »
Top « Date » · « Thread »
From g...@vmgump.apache.org
Subject BATCH: All dressed up, with nowhere to go...
Date Sun, 08 Mar 2015 07:20:02 GMT
Dear Gumpmeisters,
            
The following 3 notifys should have been sent

*********************************************************** G U M P
[GUMP@vmgump]: Project openssl-make-test (in module openssl) failed
[GUMP@vmgump]: Project tika-parsers (in module tika) failed
[GUMP@vmgump]: Project tika-reactor (in module tika) failed
*********************************************************** G U M P
[GUMP@vmgump]: Project openssl-make-test (in module openssl) failed
To whom it may engage...
        
This is an automated request, but not an unsolicited one. For 
more information please visit http://gump.apache.org/nagged.html, 
and/or contact the folk at general@gump.apache.org.

Project openssl-make-test has an issue affecting its community integration.
This issue affects 10 projects,
 and has been outstanding for 15 runs.
The current state of this project is 'Failed', with reason 'Build Failed'.
For reference only, the following projects are affected by this:
    - openssl-make-install :  OpenSSL Encryption Library
    - openssl-make-test :  OpenSSL Encryption Library
    - tomcat-native-configure :  Tomcat native library using Apache Portable Runtime
    - tomcat-native-make :  Tomcat native library using Apache Portable Runtime
    - tomcat-native-make-install :  Tomcat native library using Apache Portable Runtime
    - tomcat-tc7.0.x-test-apr :  Tomcat 7.x, a web server implementing Java Servlet 3.0,
    ...
    - tomcat-tc8.0.x-test-apr :  Tomcat 8.x, a web server implementing the Java Servlet 3.1,
...
    - tomcat-trunk-test-apr :  Tomcat 9.x, a web server implementing the Java Servlet 4.0,
...
    - tomcat-trunk-test-nio :  Tomcat 9.x, a web server implementing the Java Servlet 4.0,
...
    - tomcat-trunk-test-nio2 :  Tomcat 9.x, a web server implementing the Java Servlet 4.0,
...


Full details are available at:
    http://vmgump.apache.org/gump/public/openssl/openssl-make-test/index.html

That said, some information snippets are provided here.

The following annotations (debug/informational/warning/error messages) were provided:
 -INFO- Failed with reason build failed



The following work was performed:
http://vmgump.apache.org/gump/public/openssl/openssl-make-test/gump_work/build_openssl_openssl-make-test.html
Work Name: build_openssl_openssl-make-test (Type: Build)
Work ended in a state of : Failed
Elapsed: 1 min 9 secs
Command Line: make test 
[Working Directory: /srv/gump/public/workspace/openssl]
---------------------------------------------
end of list
listing available engine types
engine 0, id = "test_id2", name = "Third test item"
end of list
listing available engine types
engine 0, id = "test_id2", name = "Third test item"
engine 1, id = "test_id3", name = "Fourth test item"
end of list
Add that should fail did.
Remove that should fail did.
listing available engine types
engine 0, id = "test_id3", name = "Fourth test item"
end of list
listing available engine types
end of list
listing available engine types
end of list
Successfully added and removed to an empty list!
About to beef up the engine-type list
................................................................................................................................................................................................................................................................................................................................................................................................................................................................................................................................
About to empty the engine-type list
................................................................................................................................................................................................................................................................................................................................................................................................................................................................................................................................
Tests completed happily
../util/shlib_wrap.sh ./evp_test evptests.txt
337 tests completed with 0 errors, 0 skipped
../util/shlib_wrap.sh ./evp_extra_test
PASS
test SSL protocol
../util/shlib_wrap.sh ./ssltest -test_cipherlist
testing SSLv3 cipher list order: ok
testing TLSv1 cipher list order: ok
Testing cipherlist order only. Ignoring all other options.
test sslv3
Available compression methods:
  NONE
SSLv3, cipher TLSv1/SSLv3 DHE-RSA-AES256-SHA, 1024 bits RSA, temp key: 512 bits DH
1 handshakes of 256 bytes done
test sslv3 with server authentication
Available compression methods:
  NONE
server authentication
depth=1 /C=AU/O=Dodgy Brothers/CN=Dodgy CA
depth=0 /C=AU/O=Dodgy Brothers/CN=Brother 1/CN=Brother 2
ERROR in SERVER
47073234116256:error:1408F119:SSL routines:SSL3_GET_RECORD:decryption failed or bad record
mac:s3_pkt.c:538:
SSLv3, cipher TLSv1/SSLv3 DHE-RSA-AES256-SHA, 1024 bits RSA, temp key: 512 bits DH
1 handshakes of 256 bytes done
make[1]: *** [test_ssl] Error 1
make[1]: Leaving directory `/srv/gump/public/workspace/openssl/test'
make: *** [tests] Error 2
---------------------------------------------

To subscribe to this information via syndicated feeds:
- RSS: http://vmgump.apache.org/gump/public/openssl/openssl-make-test/rss.xml
- Atom: http://vmgump.apache.org/gump/public/openssl/openssl-make-test/atom.xml

============================== Gump Tracking Only ===
Produced by Apache Gump(TM) version 2.3.
Gump Run 20150308000004, vmgump.apache.org:vmgump:20150308000004
Gump E-mail Identifier (unique within run) #1.

*********************************************************** G U M P
[GUMP@vmgump]: Project tika-parsers (in module tika) failed
To whom it may engage...
        
This is an automated request, but not an unsolicited one. For 
more information please visit http://gump.apache.org/nagged.html, 
and/or contact the folk at general@gump.apache.org.

Project tika-parsers has an issue affecting its community integration.
This issue affects 2 projects,
 and has been outstanding for 190 runs.
The current state of this project is 'Failed', with reason 'Build Failed'.
For reference only, the following projects are affected by this:
    - tika-parsers :  Apache Tika is a toolkit for detecting and extracting metada...
    - tika-parsers-test :  Apache Tika is a toolkit for detecting and extracting metada...


Full details are available at:
    http://vmgump.apache.org/gump/public/tika/tika-parsers/index.html

That said, some information snippets are provided here.

The following annotations (debug/informational/warning/error messages) were provided:
 -DEBUG- Sole jar output [tika-parsers-*[0-9T].jar] identifier set to project name
 -DEBUG- (Apache Gump generated) Apache Maven Settings in: /srv/gump/public/workspace/tika/tika-parsers/gump_mvn_settings.xml
 -INFO- Failed with reason build failed
 -DEBUG- Maven POM in: /srv/gump/public/workspace/tika/tika-parsers/pom.xml
 -INFO- Failed to extract fallback artifacts from Gump Repository



The following work was performed:
http://vmgump.apache.org/gump/public/tika/tika-parsers/gump_work/build_tika_tika-parsers.html
Work Name: build_tika_tika-parsers (Type: Build)
Work ended in a state of : Failed
Elapsed: 50 secs
Command Line: /opt/maven3/bin/mvn --batch-mode -DskipTests=true --settings /srv/gump/public/workspace/tika/tika-parsers/gump_mvn_settings.xml
package 
[Working Directory: /srv/gump/public/workspace/tika/tika-parsers]
M2_HOME: /opt/maven3
---------------------------------------------
[INFO] Downloading: http://localhost:8192/maven2/edu/ucar/jj2000/5.2/jj2000-5.2.jar
[INFO] Downloaded: http://localhost:8192/maven2/com/google/protobuf/protobuf-java/2.5.0/protobuf-java-2.5.0.jar
(521 KB at 955.9 KB/sec)
[INFO] Downloading: http://localhost:8192/maven2/org/itadaki/bzip2/0.9.1/bzip2-0.9.1.jar
[INFO] Downloaded: http://localhost:8192/maven2/org/jdom/jdom2/2.0.4/jdom2-2.0.4.jar (292
KB at 535.6 KB/sec)
[INFO] Downloading: http://localhost:8192/maven2/edu/ucar/cdm/4.5.4/cdm-4.5.4.jar
[INFO] Downloaded: http://localhost:8192/maven2/org/jsoup/jsoup/1.7.2/jsoup-1.7.2.jar (287
KB at 538.1 KB/sec)
[INFO] Downloading: http://localhost:8192/maven2/edu/ucar/udunits/4.5.4/udunits-4.5.4.jar
[INFO] Downloading: http://localhost:8192/maven2/org/apache/httpcomponents/httpcore/4.2.5/httpcore-4.2.5.jar
[INFO] Downloading: http://localhost:8192/maven2/joda-time/joda-time/2.2/joda-time-2.2.jar
[INFO] Downloading: http://localhost:8192/maven2/org/quartz-scheduler/quartz/2.2.0/quartz-2.2.0.jar
[INFO] Downloaded: http://localhost:8192/maven2/edu/ucar/grib/4.5.4/grib-4.5.4.jar (5007 KB
at 4168.6 KB/sec)
[INFO] Downloading: http://localhost:8192/maven2/c3p0/c3p0/0.9.1.1/c3p0-0.9.1.1.jar
[INFO] Downloaded: http://localhost:8192/maven2/org/apache/httpcomponents/httpcore/4.2.5/httpcore-4.2.5.jar
(223 KB at 287.7 KB/sec)
[INFO] Downloading: http://localhost:8192/maven2/net/sf/ehcache/ehcache-core/2.6.2/ehcache-core-2.6.2.jar
[INFO] Downloaded: http://localhost:8192/maven2/joda-time/joda-time/2.2/joda-time-2.2.jar
(561 KB at 793.9 KB/sec)
[INFO] Downloading: http://localhost:8192/maven2/com/beust/jcommander/1.35/jcommander-1.35.jar
[INFO] Downloaded: http://localhost:8192/maven2/org/quartz-scheduler/quartz/2.2.0/quartz-2.2.0.jar
(639 KB at 1195.6 KB/sec)
[INFO] Downloading: http://localhost:8192/maven2/edu/ucar/httpservices/4.5.4/httpservices-4.5.4.jar
[INFO] Downloaded: http://localhost:8192/maven2/edu/ucar/cdm/4.5.4/cdm-4.5.4.jar (4084 KB
at 4236.3 KB/sec)
[INFO] Downloading: http://localhost:8192/maven2/org/apache/httpcomponents/httpclient/4.2.6/httpclient-4.2.6.jar
[INFO] Downloaded: http://localhost:8192/maven2/c3p0/c3p0/0.9.1.1/c3p0-0.9.1.1.jar (595 KB
at 736.2 KB/sec)
[INFO] Downloading: http://localhost:8192/maven2/org/apache/httpcomponents/httpmime/4.2.6/httpmime-4.2.6.jar
[INFO] Downloaded: http://localhost:8192/maven2/com/beust/jcommander/1.35/jcommander-1.35.jar
(60 KB at 94.9 KB/sec)
[INFO] Downloading: http://localhost:8192/maven2/com/google/guava/guava/10.0.1/guava-10.0.1.jar
[INFO] Downloaded: http://localhost:8192/maven2/edu/ucar/httpservices/4.5.4/httpservices-4.5.4.jar
(61 KB at 98.2 KB/sec)
[INFO] Downloaded: http://localhost:8192/maven2/org/apache/httpcomponents/httpclient/4.2.6/httpclient-4.2.6.jar
(426 KB at 731.0 KB/sec)
[INFO] Downloaded: http://localhost:8192/maven2/net/sf/ehcache/ehcache-core/2.6.2/ehcache-core-2.6.2.jar
(1307 KB at 1782.8 KB/sec)
[INFO] Downloaded: http://localhost:8192/maven2/org/apache/httpcomponents/httpmime/4.2.6/httpmime-4.2.6.jar
(27 KB at 117.1 KB/sec)
[INFO] Downloaded: http://localhost:8192/maven2/com/google/guava/guava/10.0.1/guava-10.0.1.jar
(2204 KB at 20030.3 KB/sec)
[INFO] Downloading: https://artifacts.unidata.ucar.edu/content/repositories/unidata/edu/ucar/jj2000/5.2/jj2000-5.2.jar
[INFO] Downloading: https://artifacts.unidata.ucar.edu/content/repositories/unidata/org/itadaki/bzip2/0.9.1/bzip2-0.9.1.jar
[INFO] Downloaded: https://artifacts.unidata.ucar.edu/content/repositories/unidata/org/itadaki/bzip2/0.9.1/bzip2-0.9.1.jar
(53 KB at 146.6 KB/sec)
[INFO] Downloaded: https://artifacts.unidata.ucar.edu/content/repositories/unidata/edu/ucar/jj2000/5.2/jj2000-5.2.jar
(518 KB at 783.0 KB/sec)
[INFO] Downloading: http://download.oracle.com/maven/edu/ucar/udunits/4.5.4/udunits-4.5.4.jar
[INFO] Downloading: https://artifacts.unidata.ucar.edu/content/repositories/unidata/edu/ucar/udunits/4.5.4/udunits-4.5.4.jar
[INFO] Downloaded: https://artifacts.unidata.ucar.edu/content/repositories/unidata/edu/ucar/udunits/4.5.4/udunits-4.5.4.jar
(122 KB at 497.1 KB/sec)
[INFO] ------------------------------------------------------------------------
[INFO] BUILD FAILURE
[INFO] ------------------------------------------------------------------------
[INFO] Total time: 39.137 s
[INFO] Finished at: 2015-03-08T03:40:56+00:00
[INFO] Final Memory: 10M/24M
[INFO] ------------------------------------------------------------------------
[ERROR] Failed to execute goal on project tika-parsers: Could not resolve dependencies for
project org.apache.tika:tika-parsers:bundle:1.8-SNAPSHOT: Could not find artifact org.apache.tika:tika-core:jar:tests:1.8-SNAPSHOT
in gump-apache.snapshots (http://localhost:8192/repo/m2-snapshot-repository) -> [Help 1]
[ERROR] 
[ERROR] To see the full stack trace of the errors, re-run Maven with the -e switch.
[ERROR] Re-run Maven using the -X switch to enable full debug logging.
[ERROR] 
[ERROR] For more information about the errors and possible solutions, please read the following
articles:
[ERROR] [Help 1] http://cwiki.apache.org/confluence/display/MAVEN/DependencyResolutionException
---------------------------------------------

To subscribe to this information via syndicated feeds:
- RSS: http://vmgump.apache.org/gump/public/tika/tika-parsers/rss.xml
- Atom: http://vmgump.apache.org/gump/public/tika/tika-parsers/atom.xml

============================== Gump Tracking Only ===
Produced by Apache Gump(TM) version 2.3.
Gump Run 20150308000004, vmgump.apache.org:vmgump:20150308000004
Gump E-mail Identifier (unique within run) #3.

*********************************************************** G U M P
[GUMP@vmgump]: Project tika-reactor (in module tika) failed
To whom it may engage...
        
This is an automated request, but not an unsolicited one. For 
more information please visit http://gump.apache.org/nagged.html, 
and/or contact the folk at general@gump.apache.org.

Project tika-reactor has an issue affecting its community integration.
This issue affects 1 projects,
 and has been outstanding for 190 runs.
The current state of this project is 'Failed', with reason 'Build Failed'.
For reference only, the following projects are affected by this:
    - tika-reactor :  Apache Tika is a toolkit for detecting and extracting metada...


Full details are available at:
    http://vmgump.apache.org/gump/public/tika/tika-reactor/index.html

That said, some information snippets are provided here.

The following annotations (debug/informational/warning/error messages) were provided:
 -INFO- Optional dependency tika-parsers failed with reason build failed
 -DEBUG- (Apache Gump generated) Apache Maven Settings in: /srv/gump/public/workspace/tika/gump_mvn_settings.xml
 -INFO- Failed with reason build failed
 -DEBUG- Maven POM in: /srv/gump/public/workspace/tika/pom.xml



The following work was performed:
http://vmgump.apache.org/gump/public/tika/tika-reactor/gump_work/build_tika_tika-reactor.html
Work Name: build_tika_tika-reactor (Type: Build)
Work ended in a state of : Failed
Elapsed: 1 min 58 secs
Command Line: /opt/maven3/bin/mvn --batch-mode -DskipTests=true --settings /srv/gump/public/workspace/tika/gump_mvn_settings.xml
install 
[Working Directory: /srv/gump/public/workspace/tika]
MAVEN_OPTS: -Xmx512m 
M2_HOME: /opt/maven3
---------------------------------------------
[INFO] 5 errors 
[INFO] -------------------------------------------------------------
[INFO] ------------------------------------------------------------------------
[INFO] Reactor Summary:
[INFO] 
[INFO] Apache Tika parent ................................. SUCCESS [ 13.342 s]
[INFO] Apache Tika core ................................... SUCCESS [ 45.500 s]
[INFO] Apache Tika parsers ................................ FAILURE [ 43.816 s]
[INFO] Apache Tika XMP .................................... SKIPPED
[INFO] Apache Tika serialization .......................... SKIPPED
[INFO] Apache Tika application ............................ SKIPPED
[INFO] Apache Tika OSGi bundle ............................ SKIPPED
[INFO] Apache Tika server ................................. SKIPPED
[INFO] Apache Tika translate .............................. SKIPPED
[INFO] Apache Tika examples ............................... SKIPPED
[INFO] Apache Tika Java-7 Components ...................... SKIPPED
[INFO] Apache Tika ........................................ SKIPPED
[INFO] ------------------------------------------------------------------------
[INFO] BUILD FAILURE
[INFO] ------------------------------------------------------------------------
[INFO] Total time: 01:48 min
[INFO] Finished at: 2015-03-08T03:42:54+00:00
[INFO] Final Memory: 40M/115M
[INFO] ------------------------------------------------------------------------
[ERROR] Failed to execute goal org.apache.maven.plugins:maven-compiler-plugin:3.2:compile
(default-compile) on project tika-parsers: Compilation failure: Compilation failure:
[ERROR] /srv/gump/public/workspace/tika/tika-parsers/src/main/java/org/apache/tika/parser/font/AdobeFontMetricParser.java:[26,30]
cannot find symbol
[ERROR] symbol:   class FontMetric
[ERROR] location: package org.apache.fontbox.afm
[ERROR] /srv/gump/public/workspace/tika/tika-parsers/src/main/java/org/apache/tika/parser/font/AdobeFontMetricParser.java:[70,8]
cannot find symbol
[ERROR] symbol:   class FontMetric
[ERROR] location: class org.apache.tika.parser.font.AdobeFontMetricParser
[ERROR] /srv/gump/public/workspace/tika/tika-parsers/src/main/java/org/apache/tika/parser/font/AdobeFontMetricParser.java:[75,28]
cannot find symbol
[ERROR] symbol:   method getResult()
[ERROR] location: variable parser of type org.apache.fontbox.afm.AFMParser
[ERROR] /srv/gump/public/workspace/tika/tika-parsers/src/main/java/org/apache/tika/parser/font/TrueTypeParser.java:[67,26]
cannot find symbol
[ERROR] symbol:   method parseTTF(java.io.File)
[ERROR] location: variable parser of type org.apache.fontbox.ttf.TTFParser
[ERROR] /srv/gump/public/workspace/tika/tika-parsers/src/main/java/org/apache/tika/parser/font/TrueTypeParser.java:[69,26]
cannot find symbol
[ERROR] symbol:   method parseTTF(java.io.InputStream)
[ERROR] location: variable parser of type org.apache.fontbox.ttf.TTFParser
[ERROR] -> [Help 1]
[ERROR] 
[ERROR] To see the full stack trace of the errors, re-run Maven with the -e switch.
[ERROR] Re-run Maven using the -X switch to enable full debug logging.
[ERROR] 
[ERROR] For more information about the errors and possible solutions, please read the following
articles:
[ERROR] [Help 1] http://cwiki.apache.org/confluence/display/MAVEN/MojoFailureException
[ERROR] 
[ERROR] After correcting the problems, you can resume the build with the command
[ERROR]   mvn <goals> -rf :tika-parsers
---------------------------------------------

To subscribe to this information via syndicated feeds:
- RSS: http://vmgump.apache.org/gump/public/tika/tika-reactor/rss.xml
- Atom: http://vmgump.apache.org/gump/public/tika/tika-reactor/atom.xml

============================== Gump Tracking Only ===
Produced by Apache Gump(TM) version 2.3.
Gump Run 20150308000004, vmgump.apache.org:vmgump:20150308000004
Gump E-mail Identifier (unique within run) #4.


--
Apache Gump
http://gump.apache.org/ [Instance: vmgump]

---------------------------------------------------------------------
To unsubscribe, e-mail: general-unsubscribe@gump.apache.org
For additional commands, e-mail: general-help@gump.apache.org


Mime
View raw message