gump-general mailing list archives

Site index · List index
Message view « Date » · « Thread »
Top « Date » · « Thread »
From g...@vmgump.apache.org
Subject BATCH: All dressed up, with nowhere to go...
Date Thu, 12 Feb 2015 05:07:23 GMT
Dear Gumpmeisters,
            
The following 3 notifys should have been sent

*********************************************************** G U M P
[GUMP@vmgump]: Project java-hamcrest (in module java-hamcrest) failed
[GUMP@vmgump]: Project tika-parsers (in module tika) failed
[GUMP@vmgump]: Project tika-reactor (in module tika) failed
*********************************************************** G U M P
[GUMP@vmgump]: Project java-hamcrest (in module java-hamcrest) failed
To whom it may engage...
        
This is an automated request, but not an unsolicited one. For 
more information please visit http://gump.apache.org/nagged.html, 
and/or contact the folk at general@gump.apache.org.

Project java-hamcrest has an issue affecting its community integration.
This issue affects 1 projects,
 and has been outstanding for 3 runs.
The current state of this project is 'Failed', with reason 'Build Failed'.
For reference only, the following projects are affected by this:
    - java-hamcrest :  Provides a library of matcher objects (also known as constra...


Full details are available at:
    http://vmgump.apache.org/gump/public/java-hamcrest/java-hamcrest/index.html

That said, some information snippets are provided here.

The following annotations (debug/informational/warning/error messages) were provided:
 -DEBUG- Sole jar output [java-hamcrest-*[0-9T].jar] identifier set to project name
 -DEBUG- (Apache Gump generated) Gradle Init Script in: /srv/gump/public/workspace/java-hamcrest/gump_init_script.gradle
 -INFO- Failed with reason build failed
 -DEBUG- Gradle build in: /srv/gump/public/workspace/java-hamcrest/build.gradle
 -INFO- Failed to extract fallback artifacts from Gump Repository



The following work was performed:
http://vmgump.apache.org/gump/public/java-hamcrest/java-hamcrest/gump_work/build_java-hamcrest_java-hamcrest.html
Work Name: build_java-hamcrest_java-hamcrest (Type: Build)
Work ended in a state of : Failed
Elapsed: 44 secs
Command Line: gradle --debug -Djava.awt.headless=true -Dbuild.sysclasspath=only -Dmaven.repo.local=/srv/gump/public/workspace/mvnlocalrepo/java-hamcrest.mvnlocalrepo
--refresh-dependencies --init-script /srv/gump/public/workspace/java-hamcrest/gump_init_script.gradle
build 
[Working Directory: /srv/gump/public/workspace/java-hamcrest]
---------------------------------------------
00:27:03.965 [DEBUG] [org.apache.http.headers] << Last-Modified: Sun, 08 Feb 2015 12:00:35
GMT
00:27:03.965 [DEBUG] [org.apache.http.headers] << Content-Length: 23688
00:27:03.965 [DEBUG] [org.apache.http.headers] << Date: Thu, 12 Feb 2015 00:27:03 GMT
00:27:03.966 [DEBUG] [org.apache.http.headers] << Vary: Accept-Charset, Accept-Encoding,
Accept-Language, Accept
00:27:03.966 [DEBUG] [org.apache.http.headers] << Accept-Ranges: bytes
00:27:03.966 [DEBUG] [org.apache.http.headers] << Server: Noelios-Restlet-Engine/1.1.3
00:27:03.987 [DEBUG] [org.apache.http.impl.client.SystemDefaultHttpClient] Connection can
be kept alive indefinitely
00:27:03.990 [DEBUG] [org.apache.http.impl.conn.PoolingClientConnectionManager] Connection
[id: 0][route: {}->http://localhost:8192] can be kept alive indefinitely
00:27:03.990 [DEBUG] [org.apache.http.impl.conn.PoolingClientConnectionManager] Connection
released: [id: 0][route: {}->http://localhost:8192][total kept alive: 1; route allocated:
1 of 5; total allocated: 1 of 10]
00:27:04.008 [INFO] [org.gradle.internal.resource.transfer.DefaultCacheAwareExternalResourceAccessor]
Cached resource is up-to-date (lastModified: Sun Feb 08 12:00:35 UTC 2015). [HTTP: http://localhost:8192/maven2/junit/junit/4.12/junit-4.12.pom]
00:27:04.441 [DEBUG] [org.gradle.api.internal.artifacts.ivyservice.resolveengine.graph.ResolvedConfigurationDependencyGraphVisitor]
Attaching org.hamcrest:java-hamcrest:2.0.0.0(testCompile) to its parents.
00:27:04.523 [DEBUG] [org.gradle.api.internal.artifacts.ivyservice.resolveengine.oldresult.TransientConfigurationResultsBuilder]
Flushing resolved configuration data in Binary store in /tmp/gradle1113058043001155344.bin.
Wrote root org.hamcrest:java-hamcrest:2.0.0.0:testCompile.
00:27:04.534 [DEBUG] [org.gradle.api.internal.tasks.execution.ExecuteAtMostOnceTaskExecuter]
Finished executing task ':compileTestJava'
00:27:04.535 [INFO] [org.gradle.execution.taskgraph.AbstractTaskPlanExecutor] :compileTestJava
(Thread[main,5,main]) completed. Took 3.48 secs.
00:27:04.535 [DEBUG] [org.gradle.execution.taskgraph.AbstractTaskPlanExecutor] Task worker
[Thread[main,5,main]] finished, busy: 25.837 secs, idle: 0.012 secs
00:27:04.558 [ERROR] [org.gradle.BuildExceptionReporter] 
00:27:04.560 [ERROR] [org.gradle.BuildExceptionReporter] FAILURE: Build failed with an exception.
00:27:04.560 [ERROR] [org.gradle.BuildExceptionReporter] 
00:27:04.561 [ERROR] [org.gradle.BuildExceptionReporter] * What went wrong:
00:27:04.561 [ERROR] [org.gradle.BuildExceptionReporter] Could not resolve all dependencies
for configuration ':testCompile'.
00:27:04.561 [ERROR] [org.gradle.BuildExceptionReporter] > Could not resolve junit:junit:4.12.
00:27:04.561 [ERROR] [org.gradle.BuildExceptionReporter]   Required by:
00:27:04.562 [ERROR] [org.gradle.BuildExceptionReporter]       org.hamcrest:java-hamcrest:2.0.0.0
00:27:04.562 [ERROR] [org.gradle.BuildExceptionReporter]    > inconsistent module metadata
found. Descriptor: junit:junit:4.13-SNAPSHOT Errors: bad version: expected='4.12' found='4.13-SNAPSHOT'
00:27:04.562 [ERROR] [org.gradle.BuildExceptionReporter] 
00:27:04.562 [ERROR] [org.gradle.BuildExceptionReporter] * Try:
00:27:04.563 [ERROR] [org.gradle.BuildExceptionReporter] Run with --stacktrace option to get
the stack trace. 
00:27:04.564 [LIFECYCLE] [org.gradle.BuildResultLogger] 
00:27:04.565 [LIFECYCLE] [org.gradle.BuildResultLogger] BUILD FAILED
00:27:04.566 [LIFECYCLE] [org.gradle.BuildResultLogger] 
00:27:04.566 [LIFECYCLE] [org.gradle.BuildResultLogger] Total time: 44.114 secs
00:27:04.568 [DEBUG] [org.gradle.api.internal.tasks.compile.daemon.CompilerDaemonManager]
Stopping 0 compiler daemon(s).
00:27:04.569 [INFO] [org.gradle.api.internal.tasks.compile.daemon.CompilerDaemonManager] Stopped
0 compiler daemon(s).
00:27:04.570 [DEBUG] [org.gradle.cache.internal.DefaultCacheAccess] Cache Plugin Resolution
Cache (/home/gump/.gradle/caches/2.2.1/plugin-resolution) was closed 0 times.
00:27:04.571 [DEBUG] [org.gradle.cache.internal.btree.BTreePersistentIndexedCache] Closing
cache module-metadata.bin (/home/gump/.gradle/caches/modules-2/metadata-2.14/module-metadata.bin)
00:27:04.572 [DEBUG] [org.gradle.cache.internal.btree.BTreePersistentIndexedCache] Closing
cache artifact-at-url.bin (/home/gump/.gradle/caches/modules-2/metadata-2.14/artifact-at-url.bin)
00:27:04.572 [DEBUG] [org.gradle.cache.internal.DefaultFileLockManager] Releasing lock on
artifact cache (/home/gump/.gradle/caches/modules-2).
00:27:04.573 [DEBUG] [org.gradle.cache.internal.DefaultFileLockManager] Releasing lock on
initscript class cache for initialization script '/srv/gump/public/workspace/java-hamcrest/gump_init_script.gradle'
(/home/gump/.gradle/caches/2.2.1/scripts/gump_init_script_12yx9mtnnuqfgx94h66zzd6bx/InitScript/initscript).
00:27:04.574 [DEBUG] [org.gradle.cache.internal.DefaultFileLockManager] Releasing lock on
no_initscript class cache for initialization script '/srv/gump/public/workspace/java-hamcrest/gump_init_script.gradle'
(/home/gump/.gradle/caches/2.2.1/scripts/gump_init_script_12yx9mtnnuqfgx94h66zzd6bx/InitScript/no_initscript).
00:27:04.574 [DEBUG] [org.gradle.cache.internal.DefaultFileLockManager] Releasing lock on
buildscript class cache for build file '/srv/gump/public/workspace/java-hamcrest/build.gradle'
(/home/gump/.gradle/caches/2.2.1/scripts/build_el7aipplekpufwz1suifpnm7v/ProjectScript/buildscript).
00:27:04.575 [DEBUG] [org.gradle.cache.internal.DefaultFileLockManager] Releasing lock on
no_buildscript class cache for build file '/srv/gump/public/workspace/java-hamcrest/build.gradle'
(/home/gump/.gradle/caches/2.2.1/scripts/build_el7aipplekpufwz1suifpnm7v/ProjectScript/no_buildscript).
00:27:04.578 [DEBUG] [org.gradle.cache.internal.btree.BTreePersistentIndexedCache] Closing
cache outputFileStates.bin (/srv/gump/public/workspace/java-hamcrest/.gradle/2.2.1/taskArtifacts/outputFileStates.bin)
00:27:04.583 [DEBUG] [org.gradle.cache.internal.btree.BTreePersistentIndexedCache] Closing
cache fileHashes.bin (/srv/gump/public/workspace/java-hamcrest/.gradle/2.2.1/taskArtifacts/fileHashes.bin)
00:27:04.584 [DEBUG] [org.gradle.cache.internal.btree.BTreePersistentIndexedCache] Closing
cache taskArtifacts.bin (/srv/gump/public/workspace/java-hamcrest/.gradle/2.2.1/taskArtifacts/taskArtifacts.bin)
00:27:04.585 [DEBUG] [org.gradle.cache.internal.btree.BTreePersistentIndexedCache] Closing
cache fileSnapshots.bin (/srv/gump/public/workspace/java-hamcrest/.gradle/2.2.1/taskArtifacts/fileSnapshots.bin)
00:27:04.585 [DEBUG] [org.gradle.cache.internal.DefaultFileLockManager] Releasing lock on
task history cache (/srv/gump/public/workspace/java-hamcrest/.gradle/2.2.1/taskArtifacts).
00:27:04.586 [DEBUG] [org.gradle.api.internal.artifacts.ivyservice.ivyresolve.memcache.InMemoryCachedRepositoryFactory]
In-memory dependency metadata cache closed. Repos cached: 1, cache instances: 1, modules served
from cache: 0, artifacts: 0
00:27:04.593 [DEBUG] [org.gradle.api.internal.artifacts.ivyservice.resolveengine.store.CachedStoreFactory]
Resolution result cache closed. Cache reads: 0, disk reads: 0 (avg: 0.0 secs, total: 0.0 secs)
00:27:04.595 [DEBUG] [org.gradle.api.internal.artifacts.ivyservice.resolveengine.store.CachedStoreFactory]
Resolved configuration cache closed. Cache reads: 0, disk reads: 0 (avg: 0.0 secs, total:
0.0 secs)
00:27:04.595 [DEBUG] [org.gradle.api.internal.artifacts.ivyservice.resolveengine.store.ResolutionResultsStoreFactory]
Deleted 2 resolution results binary files in 0.004 secs
---------------------------------------------

To subscribe to this information via syndicated feeds:
- RSS: http://vmgump.apache.org/gump/public/java-hamcrest/java-hamcrest/rss.xml
- Atom: http://vmgump.apache.org/gump/public/java-hamcrest/java-hamcrest/atom.xml

============================== Gump Tracking Only ===
Produced by Apache Gump(TM) version 2.3.
Gump Run 20150212000005, vmgump.apache.org:vmgump:20150212000005
Gump E-mail Identifier (unique within run) #1.

*********************************************************** G U M P
[GUMP@vmgump]: Project tika-parsers (in module tika) failed
To whom it may engage...
        
This is an automated request, but not an unsolicited one. For 
more information please visit http://gump.apache.org/nagged.html, 
and/or contact the folk at general@gump.apache.org.

Project tika-parsers has an issue affecting its community integration.
This issue affects 2 projects,
 and has been outstanding for 136 runs.
The current state of this project is 'Failed', with reason 'Build Failed'.
For reference only, the following projects are affected by this:
    - tika-parsers :  Apache Tika is a toolkit for detecting and extracting metada...
    - tika-parsers-test :  Apache Tika is a toolkit for detecting and extracting metada...


Full details are available at:
    http://vmgump.apache.org/gump/public/tika/tika-parsers/index.html

That said, some information snippets are provided here.

The following annotations (debug/informational/warning/error messages) were provided:
 -DEBUG- Sole jar output [tika-parsers-*[0-9T].jar] identifier set to project name
 -DEBUG- (Apache Gump generated) Apache Maven Settings in: /srv/gump/public/workspace/tika/tika-parsers/gump_mvn_settings.xml
 -INFO- Failed with reason build failed
 -DEBUG- Maven POM in: /srv/gump/public/workspace/tika/tika-parsers/pom.xml
 -INFO- Failed to extract fallback artifacts from Gump Repository



The following work was performed:
http://vmgump.apache.org/gump/public/tika/tika-parsers/gump_work/build_tika_tika-parsers.html
Work Name: build_tika_tika-parsers (Type: Build)
Work ended in a state of : Failed
Elapsed: 49 secs
Command Line: /opt/maven3/bin/mvn --batch-mode -DskipTests=true --settings /srv/gump/public/workspace/tika/tika-parsers/gump_mvn_settings.xml
package 
[Working Directory: /srv/gump/public/workspace/tika/tika-parsers]
M2_HOME: /opt/maven3
---------------------------------------------
[INFO] -------------------------------------------------------------
[ERROR] COMPILATION ERROR : 
[INFO] -------------------------------------------------------------
[ERROR] /srv/gump/public/workspace/tika/tika-parsers/src/main/java/org/apache/tika/parser/font/AdobeFontMetricParser.java:[26,30]
cannot find symbol
  symbol:   class FontMetric
  location: package org.apache.fontbox.afm
[ERROR] /srv/gump/public/workspace/tika/tika-parsers/src/main/java/org/apache/tika/parser/font/AdobeFontMetricParser.java:[70,8]
cannot find symbol
  symbol:   class FontMetric
  location: class org.apache.tika.parser.font.AdobeFontMetricParser
[ERROR] /srv/gump/public/workspace/tika/tika-parsers/src/main/java/org/apache/tika/parser/font/AdobeFontMetricParser.java:[75,28]
cannot find symbol
  symbol:   method getResult()
  location: variable parser of type org.apache.fontbox.afm.AFMParser
[ERROR] /srv/gump/public/workspace/tika/tika-parsers/src/main/java/org/apache/tika/parser/font/TrueTypeParser.java:[67,26]
cannot find symbol
  symbol:   method parseTTF(java.io.File)
  location: variable parser of type org.apache.fontbox.ttf.TTFParser
[ERROR] /srv/gump/public/workspace/tika/tika-parsers/src/main/java/org/apache/tika/parser/font/TrueTypeParser.java:[69,26]
cannot find symbol
  symbol:   method parseTTF(java.io.InputStream)
  location: variable parser of type org.apache.fontbox.ttf.TTFParser
[INFO] 5 errors 
[INFO] -------------------------------------------------------------
[INFO] ------------------------------------------------------------------------
[INFO] BUILD FAILURE
[INFO] ------------------------------------------------------------------------
[INFO] Total time: 46.935 s
[INFO] Finished at: 2015-02-12T01:22:46+00:00
[INFO] Final Memory: 30M/112M
[INFO] ------------------------------------------------------------------------
[ERROR] Failed to execute goal org.apache.maven.plugins:maven-compiler-plugin:3.1:compile
(default-compile) on project tika-parsers: Compilation failure: Compilation failure:
[ERROR] /srv/gump/public/workspace/tika/tika-parsers/src/main/java/org/apache/tika/parser/font/AdobeFontMetricParser.java:[26,30]
cannot find symbol
[ERROR] symbol:   class FontMetric
[ERROR] location: package org.apache.fontbox.afm
[ERROR] /srv/gump/public/workspace/tika/tika-parsers/src/main/java/org/apache/tika/parser/font/AdobeFontMetricParser.java:[70,8]
cannot find symbol
[ERROR] symbol:   class FontMetric
[ERROR] location: class org.apache.tika.parser.font.AdobeFontMetricParser
[ERROR] /srv/gump/public/workspace/tika/tika-parsers/src/main/java/org/apache/tika/parser/font/AdobeFontMetricParser.java:[75,28]
cannot find symbol
[ERROR] symbol:   method getResult()
[ERROR] location: variable parser of type org.apache.fontbox.afm.AFMParser
[ERROR] /srv/gump/public/workspace/tika/tika-parsers/src/main/java/org/apache/tika/parser/font/TrueTypeParser.java:[67,26]
cannot find symbol
[ERROR] symbol:   method parseTTF(java.io.File)
[ERROR] location: variable parser of type org.apache.fontbox.ttf.TTFParser
[ERROR] /srv/gump/public/workspace/tika/tika-parsers/src/main/java/org/apache/tika/parser/font/TrueTypeParser.java:[69,26]
cannot find symbol
[ERROR] symbol:   method parseTTF(java.io.InputStream)
[ERROR] location: variable parser of type org.apache.fontbox.ttf.TTFParser
[ERROR] -> [Help 1]
[ERROR] 
[ERROR] To see the full stack trace of the errors, re-run Maven with the -e switch.
[ERROR] Re-run Maven using the -X switch to enable full debug logging.
[ERROR] 
[ERROR] For more information about the errors and possible solutions, please read the following
articles:
[ERROR] [Help 1] http://cwiki.apache.org/confluence/display/MAVEN/MojoFailureException
---------------------------------------------

To subscribe to this information via syndicated feeds:
- RSS: http://vmgump.apache.org/gump/public/tika/tika-parsers/rss.xml
- Atom: http://vmgump.apache.org/gump/public/tika/tika-parsers/atom.xml

============================== Gump Tracking Only ===
Produced by Apache Gump(TM) version 2.3.
Gump Run 20150212000005, vmgump.apache.org:vmgump:20150212000005
Gump E-mail Identifier (unique within run) #2.

*********************************************************** G U M P
[GUMP@vmgump]: Project tika-reactor (in module tika) failed
To whom it may engage...
        
This is an automated request, but not an unsolicited one. For 
more information please visit http://gump.apache.org/nagged.html, 
and/or contact the folk at general@gump.apache.org.

Project tika-reactor has an issue affecting its community integration.
This issue affects 1 projects,
 and has been outstanding for 136 runs.
The current state of this project is 'Failed', with reason 'Build Failed'.
For reference only, the following projects are affected by this:
    - tika-reactor :  Apache Tika is a toolkit for detecting and extracting metada...


Full details are available at:
    http://vmgump.apache.org/gump/public/tika/tika-reactor/index.html

That said, some information snippets are provided here.

The following annotations (debug/informational/warning/error messages) were provided:
 -INFO- Optional dependency tika-parsers failed with reason build failed
 -DEBUG- (Apache Gump generated) Apache Maven Settings in: /srv/gump/public/workspace/tika/gump_mvn_settings.xml
 -INFO- Failed with reason build failed
 -DEBUG- Maven POM in: /srv/gump/public/workspace/tika/pom.xml



The following work was performed:
http://vmgump.apache.org/gump/public/tika/tika-reactor/gump_work/build_tika_tika-reactor.html
Work Name: build_tika_tika-reactor (Type: Build)
Work ended in a state of : Failed
Elapsed: 33 secs
Command Line: /opt/maven3/bin/mvn --batch-mode -DskipTests=true --settings /srv/gump/public/workspace/tika/gump_mvn_settings.xml
install 
[Working Directory: /srv/gump/public/workspace/tika]
MAVEN_OPTS: -Xmx512m 
M2_HOME: /opt/maven3
---------------------------------------------
[INFO] 5 errors 
[INFO] -------------------------------------------------------------
[INFO] ------------------------------------------------------------------------
[INFO] Reactor Summary:
[INFO] 
[INFO] Apache Tika parent ................................. SUCCESS [  3.193 s]
[INFO] Apache Tika core ................................... SUCCESS [ 15.703 s]
[INFO] Apache Tika parsers ................................ FAILURE [ 10.243 s]
[INFO] Apache Tika XMP .................................... SKIPPED
[INFO] Apache Tika serialization .......................... SKIPPED
[INFO] Apache Tika application ............................ SKIPPED
[INFO] Apache Tika OSGi bundle ............................ SKIPPED
[INFO] Apache Tika server ................................. SKIPPED
[INFO] Apache Tika translate .............................. SKIPPED
[INFO] Apache Tika examples ............................... SKIPPED
[INFO] Apache Tika Java-7 Components ...................... SKIPPED
[INFO] Apache Tika ........................................ SKIPPED
[INFO] ------------------------------------------------------------------------
[INFO] BUILD FAILURE
[INFO] ------------------------------------------------------------------------
[INFO] Total time: 30.880 s
[INFO] Finished at: 2015-02-12T01:23:21+00:00
[INFO] Final Memory: 40M/146M
[INFO] ------------------------------------------------------------------------
[ERROR] Failed to execute goal org.apache.maven.plugins:maven-compiler-plugin:3.1:compile
(default-compile) on project tika-parsers: Compilation failure: Compilation failure:
[ERROR] /srv/gump/public/workspace/tika/tika-parsers/src/main/java/org/apache/tika/parser/font/AdobeFontMetricParser.java:[26,30]
cannot find symbol
[ERROR] symbol:   class FontMetric
[ERROR] location: package org.apache.fontbox.afm
[ERROR] /srv/gump/public/workspace/tika/tika-parsers/src/main/java/org/apache/tika/parser/font/AdobeFontMetricParser.java:[70,8]
cannot find symbol
[ERROR] symbol:   class FontMetric
[ERROR] location: class org.apache.tika.parser.font.AdobeFontMetricParser
[ERROR] /srv/gump/public/workspace/tika/tika-parsers/src/main/java/org/apache/tika/parser/font/AdobeFontMetricParser.java:[75,28]
cannot find symbol
[ERROR] symbol:   method getResult()
[ERROR] location: variable parser of type org.apache.fontbox.afm.AFMParser
[ERROR] /srv/gump/public/workspace/tika/tika-parsers/src/main/java/org/apache/tika/parser/font/TrueTypeParser.java:[67,26]
cannot find symbol
[ERROR] symbol:   method parseTTF(java.io.File)
[ERROR] location: variable parser of type org.apache.fontbox.ttf.TTFParser
[ERROR] /srv/gump/public/workspace/tika/tika-parsers/src/main/java/org/apache/tika/parser/font/TrueTypeParser.java:[69,26]
cannot find symbol
[ERROR] symbol:   method parseTTF(java.io.InputStream)
[ERROR] location: variable parser of type org.apache.fontbox.ttf.TTFParser
[ERROR] -> [Help 1]
[ERROR] 
[ERROR] To see the full stack trace of the errors, re-run Maven with the -e switch.
[ERROR] Re-run Maven using the -X switch to enable full debug logging.
[ERROR] 
[ERROR] For more information about the errors and possible solutions, please read the following
articles:
[ERROR] [Help 1] http://cwiki.apache.org/confluence/display/MAVEN/MojoFailureException
[ERROR] 
[ERROR] After correcting the problems, you can resume the build with the command
[ERROR]   mvn <goals> -rf :tika-parsers
---------------------------------------------

To subscribe to this information via syndicated feeds:
- RSS: http://vmgump.apache.org/gump/public/tika/tika-reactor/rss.xml
- Atom: http://vmgump.apache.org/gump/public/tika/tika-reactor/atom.xml

============================== Gump Tracking Only ===
Produced by Apache Gump(TM) version 2.3.
Gump Run 20150212000005, vmgump.apache.org:vmgump:20150212000005
Gump E-mail Identifier (unique within run) #3.


--
Apache Gump
http://gump.apache.org/ [Instance: vmgump]

---------------------------------------------------------------------
To unsubscribe, e-mail: general-unsubscribe@gump.apache.org
For additional commands, e-mail: general-help@gump.apache.org


Mime
View raw message