gump-general mailing list archives

Site index · List index
Message view « Date » · « Thread »
Top « Date » · « Thread »
From g...@vmgump.apache.org
Subject BATCH: All dressed up, with nowhere to go...
Date Wed, 11 Feb 2015 17:53:51 GMT
Dear Gumpmeisters,
            
The following 1 notifys should have been sent

*********************************************************** G U M P
[GUMP@vmgump]: Project java-hamcrest (in module java-hamcrest) failed
*********************************************************** G U M P
[GUMP@vmgump]: Project java-hamcrest (in module java-hamcrest) failed
To whom it may engage...
        
This is an automated request, but not an unsolicited one. For 
more information please visit http://gump.apache.org/nagged.html, 
and/or contact the folk at general@gump.apache.org.

Project java-hamcrest has an issue affecting its community integration.
This issue affects 1 projects.
The current state of this project is 'Failed', with reason 'Build Failed'.
For reference only, the following projects are affected by this:
    - java-hamcrest :  Provides a library of matcher objects (also known as constra...


Full details are available at:
    http://vmgump.apache.org/gump/public/java-hamcrest/java-hamcrest/index.html

That said, some information snippets are provided here.

The following annotations (debug/informational/warning/error messages) were provided:
 -DEBUG- Sole jar output [java-hamcrest-*[0-9T].jar] identifier set to project name
 -DEBUG- (Apache Gump generated) Gradle Init Script in: /srv/gump/public/workspace/java-hamcrest/gump_init_script.gradle
 -INFO- Failed with reason build failed
 -DEBUG- Gradle build in: /srv/gump/public/workspace/java-hamcrest/build.gradle
 -DEBUG- Extracted fallback artifacts from Gump Repository



The following work was performed:
http://vmgump.apache.org/gump/public/java-hamcrest/java-hamcrest/gump_work/build_java-hamcrest_java-hamcrest.html
Work Name: build_java-hamcrest_java-hamcrest (Type: Build)
Work ended in a state of : Failed
Elapsed: 32 secs
Command Line: gradle --debug -Djava.awt.headless=true -Dbuild.sysclasspath=only -Dmaven.repo.local=/srv/gump/public/workspace/mvnlocalrepo/java-hamcrest.mvnlocalrepo
--refresh-dependencies --init-script /srv/gump/public/workspace/java-hamcrest/gump_init_script.gradle
build 
[Working Directory: /srv/gump/public/workspace/java-hamcrest]
---------------------------------------------
12:24:19.818 [DEBUG] [org.apache.http.headers] << Vary: Accept-Charset, Accept-Encoding,
Accept-Language, Accept
12:24:19.818 [DEBUG] [org.apache.http.headers] << Accept-Ranges: bytes
12:24:19.818 [DEBUG] [org.apache.http.headers] << Server: Noelios-Restlet-Engine/1.1.3
12:24:19.818 [DEBUG] [org.apache.http.impl.client.SystemDefaultHttpClient] Connection can
be kept alive indefinitely
12:24:19.827 [DEBUG] [org.gradle.internal.resource.transfer.DefaultCacheAwareExternalResourceAccessor]
Downloading http://localhost:8192/maven2/junit/junit/4.12/junit-4.12.pom to /tmp/gradle_download3196789142312055657bin
12:24:19.829 [LIFECYCLE] [org.gradle.internal.resource.transfer.ProgressLoggingExternalResourceAccessor$ProgressLoggingExternalResource]
Download http://localhost:8192/maven2/junit/junit/4.12/junit-4.12.pom
12:24:19.830 [DEBUG] [org.gradle.internal.resource.transport.http.HttpResponseResource] Attempting
to download resource http://localhost:8192/maven2/junit/junit/4.12/junit-4.12.pom.
12:24:19.830 [DEBUG] [org.apache.http.impl.conn.PoolingClientConnectionManager] Connection
[id: 0][route: {}->http://localhost:8192] can be kept alive indefinitely
12:24:19.831 [DEBUG] [org.apache.http.impl.conn.PoolingClientConnectionManager] Connection
released: [id: 0][route: {}->http://localhost:8192][total kept alive: 1; route allocated:
1 of 5; total allocated: 1 of 10]
12:24:19.840 [DEBUG] [org.gradle.api.internal.file.copy.DeleteActionImpl] Deleting /home/gump/.gradle/caches/modules-2/files-2.1/junit/junit/4.12/f9ca9c7abd48a50bb2ab7f87392195b9dff784c7/junit-4.12.pom.fslck
12:24:20.088 [DEBUG] [org.gradle.api.internal.artifacts.ivyservice.resolveengine.graph.ResolvedConfigurationDependencyGraphVisitor]
Attaching org.hamcrest:java-hamcrest:2.0.0.0(testCompile) to its parents.
12:24:20.101 [DEBUG] [org.gradle.api.internal.artifacts.ivyservice.resolveengine.oldresult.TransientConfigurationResultsBuilder]
Flushing resolved configuration data in Binary store in /tmp/gradle453711460028730092.bin.
Wrote root org.hamcrest:java-hamcrest:2.0.0.0:testCompile.
12:24:20.136 [DEBUG] [org.gradle.api.internal.tasks.execution.ExecuteAtMostOnceTaskExecuter]
Finished executing task ':compileTestJava'
12:24:20.141 [INFO] [org.gradle.execution.taskgraph.AbstractTaskPlanExecutor] :compileTestJava
(Thread[main,5,main]) completed. Took 2.834 secs.
12:24:20.141 [DEBUG] [org.gradle.execution.taskgraph.AbstractTaskPlanExecutor] Task worker
[Thread[main,5,main]] finished, busy: 16.978 secs, idle: 0.007 secs
12:24:20.180 [ERROR] [org.gradle.BuildExceptionReporter] 
12:24:20.181 [ERROR] [org.gradle.BuildExceptionReporter] FAILURE: Build failed with an exception.
12:24:20.181 [ERROR] [org.gradle.BuildExceptionReporter] 
12:24:20.182 [ERROR] [org.gradle.BuildExceptionReporter] * What went wrong:
12:24:20.182 [ERROR] [org.gradle.BuildExceptionReporter] Could not resolve all dependencies
for configuration ':testCompile'.
12:24:20.182 [ERROR] [org.gradle.BuildExceptionReporter] > Could not resolve junit:junit:4.12.
12:24:20.182 [ERROR] [org.gradle.BuildExceptionReporter]   Required by:
12:24:20.183 [ERROR] [org.gradle.BuildExceptionReporter]       org.hamcrest:java-hamcrest:2.0.0.0
12:24:20.184 [ERROR] [org.gradle.BuildExceptionReporter]    > inconsistent module metadata
found. Descriptor: junit:junit:4.13-SNAPSHOT Errors: bad version: expected='4.12' found='4.13-SNAPSHOT'
12:24:20.184 [ERROR] [org.gradle.BuildExceptionReporter] 
12:24:20.184 [ERROR] [org.gradle.BuildExceptionReporter] * Try:
12:24:20.184 [ERROR] [org.gradle.BuildExceptionReporter] Run with --stacktrace option to get
the stack trace. 
12:24:20.192 [LIFECYCLE] [org.gradle.BuildResultLogger] 
12:24:20.192 [LIFECYCLE] [org.gradle.BuildResultLogger] BUILD FAILED
12:24:20.193 [LIFECYCLE] [org.gradle.BuildResultLogger] 
12:24:20.193 [LIFECYCLE] [org.gradle.BuildResultLogger] Total time: 31.615 secs
12:24:20.194 [DEBUG] [org.gradle.api.internal.tasks.compile.daemon.CompilerDaemonManager]
Stopping 0 compiler daemon(s).
12:24:20.194 [INFO] [org.gradle.api.internal.tasks.compile.daemon.CompilerDaemonManager] Stopped
0 compiler daemon(s).
12:24:20.194 [DEBUG] [org.gradle.cache.internal.DefaultFileLockManager] Releasing lock on
initscript class cache for initialization script '/srv/gump/public/workspace/java-hamcrest/gump_init_script.gradle'
(/home/gump/.gradle/caches/2.2.1/scripts/gump_init_script_12yx9mtnnuqfgx94h66zzd6bx/InitScript/initscript).
12:24:20.201 [DEBUG] [org.gradle.cache.internal.DefaultFileLockManager] Releasing lock on
no_initscript class cache for initialization script '/srv/gump/public/workspace/java-hamcrest/gump_init_script.gradle'
(/home/gump/.gradle/caches/2.2.1/scripts/gump_init_script_12yx9mtnnuqfgx94h66zzd6bx/InitScript/no_initscript).
12:24:20.201 [DEBUG] [org.gradle.cache.internal.DefaultFileLockManager] Releasing lock on
buildscript class cache for build file '/srv/gump/public/workspace/java-hamcrest/build.gradle'
(/home/gump/.gradle/caches/2.2.1/scripts/build_el7aipplekpufwz1suifpnm7v/ProjectScript/buildscript).
12:24:20.201 [DEBUG] [org.gradle.cache.internal.DefaultFileLockManager] Releasing lock on
no_buildscript class cache for build file '/srv/gump/public/workspace/java-hamcrest/build.gradle'
(/home/gump/.gradle/caches/2.2.1/scripts/build_el7aipplekpufwz1suifpnm7v/ProjectScript/no_buildscript).
12:24:20.202 [DEBUG] [org.gradle.cache.internal.DefaultCacheAccess] Cache Plugin Resolution
Cache (/home/gump/.gradle/caches/2.2.1/plugin-resolution) was closed 0 times.
12:24:20.203 [DEBUG] [org.gradle.cache.internal.btree.BTreePersistentIndexedCache] Closing
cache module-metadata.bin (/home/gump/.gradle/caches/modules-2/metadata-2.14/module-metadata.bin)
12:24:20.203 [DEBUG] [org.gradle.cache.internal.btree.BTreePersistentIndexedCache] Closing
cache artifact-at-url.bin (/home/gump/.gradle/caches/modules-2/metadata-2.14/artifact-at-url.bin)
12:24:20.203 [DEBUG] [org.gradle.cache.internal.DefaultFileLockManager] Releasing lock on
artifact cache (/home/gump/.gradle/caches/modules-2).
12:24:20.204 [DEBUG] [org.gradle.cache.internal.btree.BTreePersistentIndexedCache] Closing
cache fileSnapshots.bin (/srv/gump/public/workspace/java-hamcrest/.gradle/2.2.1/taskArtifacts/fileSnapshots.bin)
12:24:20.204 [DEBUG] [org.gradle.cache.internal.btree.BTreePersistentIndexedCache] Closing
cache taskArtifacts.bin (/srv/gump/public/workspace/java-hamcrest/.gradle/2.2.1/taskArtifacts/taskArtifacts.bin)
12:24:20.211 [DEBUG] [org.gradle.cache.internal.btree.BTreePersistentIndexedCache] Closing
cache outputFileStates.bin (/srv/gump/public/workspace/java-hamcrest/.gradle/2.2.1/taskArtifacts/outputFileStates.bin)
12:24:20.211 [DEBUG] [org.gradle.cache.internal.btree.BTreePersistentIndexedCache] Closing
cache fileHashes.bin (/srv/gump/public/workspace/java-hamcrest/.gradle/2.2.1/taskArtifacts/fileHashes.bin)
12:24:20.212 [DEBUG] [org.gradle.cache.internal.DefaultFileLockManager] Releasing lock on
task history cache (/srv/gump/public/workspace/java-hamcrest/.gradle/2.2.1/taskArtifacts).
12:24:20.221 [DEBUG] [org.gradle.api.internal.artifacts.ivyservice.resolveengine.store.CachedStoreFactory]
Resolution result cache closed. Cache reads: 0, disk reads: 0 (avg: 0.0 secs, total: 0.0 secs)
12:24:20.224 [DEBUG] [org.gradle.api.internal.artifacts.ivyservice.resolveengine.store.CachedStoreFactory]
Resolved configuration cache closed. Cache reads: 0, disk reads: 0 (avg: 0.0 secs, total:
0.0 secs)
12:24:20.224 [DEBUG] [org.gradle.api.internal.artifacts.ivyservice.resolveengine.store.ResolutionResultsStoreFactory]
Deleted 2 resolution results binary files in 0.005 secs
12:24:20.224 [DEBUG] [org.gradle.api.internal.artifacts.ivyservice.ivyresolve.memcache.InMemoryCachedRepositoryFactory]
In-memory dependency metadata cache closed. Repos cached: 1, cache instances: 1, modules served
from cache: 0, artifacts: 0
---------------------------------------------

To subscribe to this information via syndicated feeds:
- RSS: http://vmgump.apache.org/gump/public/java-hamcrest/java-hamcrest/rss.xml
- Atom: http://vmgump.apache.org/gump/public/java-hamcrest/java-hamcrest/atom.xml

============================== Gump Tracking Only ===
Produced by Apache Gump(TM) version 2.3.
Gump Run 20150211120004, vmgump.apache.org:vmgump:20150211120004
Gump E-mail Identifier (unique within run) #1.


--
Apache Gump
http://gump.apache.org/ [Instance: vmgump]

---------------------------------------------------------------------
To unsubscribe, e-mail: general-unsubscribe@gump.apache.org
For additional commands, e-mail: general-help@gump.apache.org


Mime
View raw message