gump-general mailing list archives

Site index · List index
Message view « Date » · « Thread »
Top « Date » · « Thread »
From g...@vmgump.apache.org
Subject BATCH: All dressed up, with nowhere to go...
Date Wed, 11 Feb 2015 11:54:43 GMT
Dear Gumpmeisters,
            
The following 1 notifys should have been sent

*********************************************************** G U M P
[GUMP@vmgump]: Project java-hamcrest (in module java-hamcrest) failed
*********************************************************** G U M P
[GUMP@vmgump]: Project java-hamcrest (in module java-hamcrest) failed
To whom it may engage...
        
This is an automated request, but not an unsolicited one. For 
more information please visit http://gump.apache.org/nagged.html, 
and/or contact the folk at general@gump.apache.org.

Project java-hamcrest has an issue affecting its community integration.
This issue affects 1 projects.
The current state of this project is 'Failed', with reason 'Build Failed'.
For reference only, the following projects are affected by this:
    - java-hamcrest :  Provides a library of matcher objects (also known as constra...


Full details are available at:
    http://vmgump.apache.org/gump/public/java-hamcrest/java-hamcrest/index.html

That said, some information snippets are provided here.

The following annotations (debug/informational/warning/error messages) were provided:
 -DEBUG- Sole jar output [java-hamcrest-*[0-9T].jar] identifier set to project name
 -DEBUG- (Apache Gump generated) Gradle Init Script in: /srv/gump/public/workspace/java-hamcrest/gump_init_script.gradle
 -INFO- Failed with reason build failed
 -DEBUG- Gradle build in: /srv/gump/public/workspace/java-hamcrest/build.gradle
 -DEBUG- Extracted fallback artifacts from Gump Repository



The following work was performed:
http://vmgump.apache.org/gump/public/java-hamcrest/java-hamcrest/gump_work/build_java-hamcrest_java-hamcrest.html
Work Name: build_java-hamcrest_java-hamcrest (Type: Build)
Work ended in a state of : Failed
Elapsed: 32 secs
Command Line: gradle --debug -Djava.awt.headless=true -Dbuild.sysclasspath=only -Dmaven.repo.local=/srv/gump/public/workspace/mvnlocalrepo/java-hamcrest.mvnlocalrepo
--refresh-dependencies --init-script /srv/gump/public/workspace/java-hamcrest/gump_init_script.gradle
build 
[Working Directory: /srv/gump/public/workspace/java-hamcrest]
---------------------------------------------
06:24:01.594 [DEBUG] [org.gradle.api.internal.artifacts.ivyservice.resolveengine.graph.DependencyGraphBuilder]
Visiting configuration org.hamcrest:java-hamcrest:2.0.0.0(testCompile).
06:24:01.603 [DEBUG] [org.gradle.api.internal.artifacts.ivyservice.resolveengine.graph.DependencyGraphBuilder]
Visiting dependency org.hamcrest:java-hamcrest:2.0.0.0(testCompile) -> junit:junit:4.12(dependency:
junit#junit;4.12 {testCompile=[default]})
06:24:01.611 [DEBUG] [org.gradle.api.internal.artifacts.ivyservice.resolveengine.graph.DependencyGraphBuilder]
Selecting new module version junit:junit:4.12
06:24:01.611 [DEBUG] [org.gradle.api.internal.artifacts.ivyservice.ivyresolve.RepositoryChainDependencyResolver]
Attempting to resolve junit:junit:4.12 using repositories [MavenRepo]
06:24:01.619 [DEBUG] [org.gradle.cache.internal.btree.BTreePersistentIndexedCache] Opening
cache module-metadata.bin (/home/gump/.gradle/caches/modules-2/metadata-2.14/module-metadata.bin)
06:24:01.645 [DEBUG] [org.gradle.api.internal.artifacts.repositories.resolver.DefaultExternalResourceArtifactResolver]
Loading http:/maven2/junit/junit/4.12/junit-4.12.pom
06:24:01.647 [DEBUG] [org.gradle.internal.resource.transfer.DefaultCacheAwareExternalResourceAccessor]
Constructing external resource: http:/maven2/junit/junit/4.12/junit-4.12.pom
06:24:01.648 [DEBUG] [org.gradle.cache.internal.btree.BTreePersistentIndexedCache] Opening
cache artifact-at-url.bin (/home/gump/.gradle/caches/modules-2/metadata-2.14/artifact-at-url.bin)
06:24:01.751 [DEBUG] [org.gradle.internal.resource.transport.http.HttpResourceAccessor] Constructing
external resource metadata: http:/maven2/junit/junit/4.12/junit-4.12.pom
06:24:01.757 [DEBUG] [org.gradle.internal.resource.transport.http.HttpClientHelper] Performing
HTTP HEAD: http:/maven2/junit/junit/4.12/junit-4.12.pom
06:24:02.192 [DEBUG] [org.gradle.api.internal.artifacts.ivyservice.resolveengine.graph.ResolvedConfigurationDependencyGraphVisitor]
Attaching org.hamcrest:java-hamcrest:2.0.0.0(testCompile) to its parents.
06:24:02.199 [DEBUG] [org.gradle.api.internal.artifacts.ivyservice.resolveengine.oldresult.TransientConfigurationResultsBuilder]
Flushing resolved configuration data in Binary store in /tmp/gradle474364245712237686.bin.
Wrote root org.hamcrest:java-hamcrest:2.0.0.0:testCompile.
06:24:02.215 [DEBUG] [org.gradle.api.internal.tasks.execution.ExecuteAtMostOnceTaskExecuter]
Finished executing task ':compileTestJava'
06:24:02.216 [INFO] [org.gradle.execution.taskgraph.AbstractTaskPlanExecutor] :compileTestJava
(Thread[main,5,main]) completed. Took 1.403 secs.
06:24:02.216 [DEBUG] [org.gradle.execution.taskgraph.AbstractTaskPlanExecutor] Task worker
[Thread[main,5,main]] finished, busy: 16.294 secs, idle: 0.011 secs
06:24:02.247 [ERROR] [org.gradle.BuildExceptionReporter] 
06:24:02.247 [ERROR] [org.gradle.BuildExceptionReporter] FAILURE: Build failed with an exception.
06:24:02.247 [ERROR] [org.gradle.BuildExceptionReporter] 
06:24:02.248 [ERROR] [org.gradle.BuildExceptionReporter] * What went wrong:
06:24:02.248 [ERROR] [org.gradle.BuildExceptionReporter] Could not resolve all dependencies
for configuration ':testCompile'.
06:24:02.248 [ERROR] [org.gradle.BuildExceptionReporter] > Could not resolve junit:junit:4.12.
06:24:02.250 [ERROR] [org.gradle.BuildExceptionReporter]   Required by:
06:24:02.250 [ERROR] [org.gradle.BuildExceptionReporter]       org.hamcrest:java-hamcrest:2.0.0.0
06:24:02.250 [ERROR] [org.gradle.BuildExceptionReporter]    > Target host must not be null,
or set in parameters.
06:24:02.250 [ERROR] [org.gradle.BuildExceptionReporter] 
06:24:02.250 [ERROR] [org.gradle.BuildExceptionReporter] * Try:
06:24:02.251 [ERROR] [org.gradle.BuildExceptionReporter] Run with --stacktrace option to get
the stack trace. 
06:24:02.252 [LIFECYCLE] [org.gradle.BuildResultLogger] 
06:24:02.253 [LIFECYCLE] [org.gradle.BuildResultLogger] BUILD FAILED
06:24:02.253 [LIFECYCLE] [org.gradle.BuildResultLogger] 
06:24:02.261 [LIFECYCLE] [org.gradle.BuildResultLogger] Total time: 31.583 secs
06:24:02.262 [DEBUG] [org.gradle.api.internal.tasks.compile.daemon.CompilerDaemonManager]
Stopping 0 compiler daemon(s).
06:24:02.262 [INFO] [org.gradle.api.internal.tasks.compile.daemon.CompilerDaemonManager] Stopped
0 compiler daemon(s).
06:24:02.263 [DEBUG] [org.gradle.cache.internal.DefaultCacheAccess] Cache Plugin Resolution
Cache (/home/gump/.gradle/caches/2.2.1/plugin-resolution) was closed 0 times.
06:24:02.264 [DEBUG] [org.gradle.cache.internal.btree.BTreePersistentIndexedCache] Closing
cache module-metadata.bin (/home/gump/.gradle/caches/modules-2/metadata-2.14/module-metadata.bin)
06:24:02.264 [DEBUG] [org.gradle.cache.internal.btree.BTreePersistentIndexedCache] Closing
cache artifact-at-url.bin (/home/gump/.gradle/caches/modules-2/metadata-2.14/artifact-at-url.bin)
06:24:02.264 [DEBUG] [org.gradle.cache.internal.DefaultFileLockManager] Releasing lock on
artifact cache (/home/gump/.gradle/caches/modules-2).
06:24:02.264 [DEBUG] [org.gradle.cache.internal.DefaultFileLockManager] Releasing lock on
initscript class cache for initialization script '/srv/gump/public/workspace/java-hamcrest/gump_init_script.gradle'
(/home/gump/.gradle/caches/2.2.1/scripts/gump_init_script_12yx9mtnnuqfgx94h66zzd6bx/InitScript/initscript).
06:24:02.266 [DEBUG] [org.gradle.cache.internal.DefaultFileLockManager] Releasing lock on
no_initscript class cache for initialization script '/srv/gump/public/workspace/java-hamcrest/gump_init_script.gradle'
(/home/gump/.gradle/caches/2.2.1/scripts/gump_init_script_12yx9mtnnuqfgx94h66zzd6bx/InitScript/no_initscript).
06:24:02.266 [DEBUG] [org.gradle.cache.internal.DefaultFileLockManager] Releasing lock on
buildscript class cache for build file '/srv/gump/public/workspace/java-hamcrest/build.gradle'
(/home/gump/.gradle/caches/2.2.1/scripts/build_el7aipplekpufwz1suifpnm7v/ProjectScript/buildscript).
06:24:02.266 [DEBUG] [org.gradle.cache.internal.DefaultFileLockManager] Releasing lock on
no_buildscript class cache for build file '/srv/gump/public/workspace/java-hamcrest/build.gradle'
(/home/gump/.gradle/caches/2.2.1/scripts/build_el7aipplekpufwz1suifpnm7v/ProjectScript/no_buildscript).
06:24:02.267 [DEBUG] [org.gradle.cache.internal.btree.BTreePersistentIndexedCache] Closing
cache fileSnapshots.bin (/srv/gump/public/workspace/java-hamcrest/.gradle/2.2.1/taskArtifacts/fileSnapshots.bin)
06:24:02.267 [DEBUG] [org.gradle.cache.internal.btree.BTreePersistentIndexedCache] Closing
cache taskArtifacts.bin (/srv/gump/public/workspace/java-hamcrest/.gradle/2.2.1/taskArtifacts/taskArtifacts.bin)
06:24:02.267 [DEBUG] [org.gradle.cache.internal.btree.BTreePersistentIndexedCache] Closing
cache outputFileStates.bin (/srv/gump/public/workspace/java-hamcrest/.gradle/2.2.1/taskArtifacts/outputFileStates.bin)
06:24:02.267 [DEBUG] [org.gradle.cache.internal.btree.BTreePersistentIndexedCache] Closing
cache fileHashes.bin (/srv/gump/public/workspace/java-hamcrest/.gradle/2.2.1/taskArtifacts/fileHashes.bin)
06:24:02.268 [DEBUG] [org.gradle.cache.internal.DefaultFileLockManager] Releasing lock on
task history cache (/srv/gump/public/workspace/java-hamcrest/.gradle/2.2.1/taskArtifacts).
06:24:02.273 [DEBUG] [org.gradle.api.internal.artifacts.ivyservice.resolveengine.store.CachedStoreFactory]
Resolution result cache closed. Cache reads: 0, disk reads: 0 (avg: 0.0 secs, total: 0.0 secs)
06:24:02.274 [DEBUG] [org.gradle.api.internal.artifacts.ivyservice.resolveengine.store.CachedStoreFactory]
Resolved configuration cache closed. Cache reads: 0, disk reads: 0 (avg: 0.0 secs, total:
0.0 secs)
06:24:02.274 [DEBUG] [org.gradle.api.internal.artifacts.ivyservice.resolveengine.store.ResolutionResultsStoreFactory]
Deleted 2 resolution results binary files in 0.006 secs
06:24:02.274 [DEBUG] [org.gradle.api.internal.artifacts.ivyservice.ivyresolve.memcache.InMemoryCachedRepositoryFactory]
In-memory dependency metadata cache closed. Repos cached: 1, cache instances: 1, modules served
from cache: 0, artifacts: 0
---------------------------------------------

To subscribe to this information via syndicated feeds:
- RSS: http://vmgump.apache.org/gump/public/java-hamcrest/java-hamcrest/rss.xml
- Atom: http://vmgump.apache.org/gump/public/java-hamcrest/java-hamcrest/atom.xml

============================== Gump Tracking Only ===
Produced by Apache Gump(TM) version 2.3.
Gump Run 20150211060003, vmgump.apache.org:vmgump:20150211060003
Gump E-mail Identifier (unique within run) #1.


--
Apache Gump
http://gump.apache.org/ [Instance: vmgump]

---------------------------------------------------------------------
To unsubscribe, e-mail: general-unsubscribe@gump.apache.org
For additional commands, e-mail: general-help@gump.apache.org


Mime
View raw message