gump-general mailing list archives

Site index · List index
Message view « Date » · « Thread »
Top « Date » · « Thread »
From g...@vmgump.apache.org
Subject BATCH: All dressed up, with nowhere to go...
Date Tue, 10 Feb 2015 23:44:51 GMT
Dear Gumpmeisters,
            
The following 1 notifys should have been sent

*********************************************************** G U M P
[GUMP@vmgump]: Project java-hamcrest (in module java-hamcrest) failed
*********************************************************** G U M P
[GUMP@vmgump]: Project java-hamcrest (in module java-hamcrest) failed
To whom it may engage...
        
This is an automated request, but not an unsolicited one. For 
more information please visit http://gump.apache.org/nagged.html, 
and/or contact the folk at general@gump.apache.org.

Project java-hamcrest has an issue affecting its community integration.
This issue affects 1 projects.
The current state of this project is 'Failed', with reason 'Build Failed'.
For reference only, the following projects are affected by this:
    - java-hamcrest :  Provides a library of matcher objects (also known as constra...


Full details are available at:
    http://vmgump.apache.org/gump/public/java-hamcrest/java-hamcrest/index.html

That said, some information snippets are provided here.

The following annotations (debug/informational/warning/error messages) were provided:
 -DEBUG- Sole jar output [java-hamcrest-*[0-9T].jar] identifier set to project name
 -DEBUG- (Apache Gump generated) Gradle Init Script in: /srv/gump/public/workspace/java-hamcrest/gump_init_script.gradle
 -INFO- Failed with reason build failed
 -DEBUG- Gradle build in: /srv/gump/public/workspace/java-hamcrest/build.gradle
 -DEBUG- Extracted fallback artifacts from Gump Repository



The following work was performed:
http://vmgump.apache.org/gump/public/java-hamcrest/java-hamcrest/gump_work/build_java-hamcrest_java-hamcrest.html
Work Name: build_java-hamcrest_java-hamcrest (Type: Build)
Work ended in a state of : Failed
Elapsed: 6 secs
Command Line: gradle --debug -Djava.awt.headless=true -Dbuild.sysclasspath=only -Dmaven.repo.local=/srv/gump/public/workspace/mvnlocalrepo/java-hamcrest.mvnlocalrepo
--refresh-dependencies --init-script /srv/gump/public/workspace/java-hamcrest/gump_init_script.gradle
build 
[Working Directory: /srv/gump/public/workspace/java-hamcrest]
---------------------------------------------
18:31:31.444 [DEBUG] [org.gradle.BuildLogger] Gradle user home: /home/gump/.gradle
18:31:31.449 [DEBUG] [org.gradle.BuildLogger] Current dir: /srv/gump/public/workspace/java-hamcrest
18:31:31.450 [DEBUG] [org.gradle.BuildLogger] Settings file: null
18:31:31.451 [DEBUG] [org.gradle.BuildLogger] Build file: null
18:31:32.226 [DEBUG] [org.gradle.messaging.remote.internal.inet.InetAddressFactory] Adding
IP addresses for network interface eth0
18:31:32.230 [DEBUG] [org.gradle.messaging.remote.internal.inet.InetAddressFactory] Is this
a loopback interface? false
18:31:32.233 [DEBUG] [org.gradle.messaging.remote.internal.inet.InetAddressFactory] Is this
a multicast interface? true
18:31:32.235 [DEBUG] [org.gradle.messaging.remote.internal.inet.InetAddressFactory] Adding
remote address /fe80:0:0:0:250:56ff:feae:19%eth0
18:31:32.236 [DEBUG] [org.gradle.messaging.remote.internal.inet.InetAddressFactory] Adding
remote address /140.211.11.55
18:31:32.236 [DEBUG] [org.gradle.messaging.remote.internal.inet.InetAddressFactory] Adding
remote multicast interface eth0
18:31:32.242 [DEBUG] [org.gradle.messaging.remote.internal.inet.InetAddressFactory] Adding
IP addresses for network interface lo
18:31:32.245 [DEBUG] [org.gradle.messaging.remote.internal.inet.InetAddressFactory] Is this
a loopback interface? true
18:31:32.246 [DEBUG] [org.gradle.messaging.remote.internal.inet.InetAddressFactory] Is this
a multicast interface? false
18:31:32.246 [DEBUG] [org.gradle.messaging.remote.internal.inet.InetAddressFactory] Adding
loopback address /0:0:0:0:0:0:0:1%lo
18:31:32.248 [DEBUG] [org.gradle.messaging.remote.internal.inet.InetAddressFactory] Adding
loopback address /127.0.0.1
18:31:32.263 [DEBUG] [org.gradle.cache.internal.DefaultFileLockManager] Waiting to acquire
shared lock on initscript class cache for initialization script '/srv/gump/public/workspace/java-hamcrest/gump_init_script.gradle'
(/home/gump/.gradle/caches/2.2.1/scripts/gump_init_script_12yx9mtnnuqfgx94h66zzd6bx/InitScript/initscript).
18:31:32.277 [DEBUG] [org.gradle.cache.internal.DefaultFileLockManager] Lock acquired.
18:31:32.279 [DEBUG] [org.gradle.cache.internal.DefaultPersistentDirectoryCache] Invalidating
org.gradle.cache.internal.DefaultPersistentDirectoryCache$Initializer@7df587ef as it was not
closed cleanly.
18:31:32.281 [DEBUG] [org.gradle.cache.internal.DefaultFileLockManager] Releasing lock on
initscript class cache for initialization script '/srv/gump/public/workspace/java-hamcrest/gump_init_script.gradle'
(/home/gump/.gradle/caches/2.2.1/scripts/gump_init_script_12yx9mtnnuqfgx94h66zzd6bx/InitScript/initscript).
18:31:32.285 [DEBUG] [org.gradle.cache.internal.DefaultFileLockManager] Waiting to acquire
exclusive lock on initscript class cache for initialization script '/srv/gump/public/workspace/java-hamcrest/gump_init_script.gradle'
(/home/gump/.gradle/caches/2.2.1/scripts/gump_init_script_12yx9mtnnuqfgx94h66zzd6bx/InitScript/initscript).
18:31:32.287 [DEBUG] [org.gradle.cache.internal.DefaultFileLockManager] Lock acquired.
18:31:32.287 [DEBUG] [org.gradle.cache.internal.DefaultPersistentDirectoryCache] Invalidating
org.gradle.cache.internal.DefaultPersistentDirectoryCache$Initializer@7df587ef as it was not
closed cleanly.
18:31:32.300 [INFO] [org.gradle.groovy.scripts.internal.DefaultScriptCompilationHandler] Compiling
initialization script '/srv/gump/public/workspace/java-hamcrest/gump_init_script.gradle' using
StatementExtractingScriptTransformer.
18:31:32.591 [DEBUG] [org.gradle.cache.internal.DefaultFileLockManager] Releasing lock on
initscript class cache for initialization script '/srv/gump/public/workspace/java-hamcrest/gump_init_script.gradle'
(/home/gump/.gradle/caches/2.2.1/scripts/gump_init_script_12yx9mtnnuqfgx94h66zzd6bx/InitScript/initscript).
18:31:32.638 [ERROR] [org.gradle.BuildExceptionReporter] 
18:31:32.639 [ERROR] [org.gradle.BuildExceptionReporter] FAILURE: Build failed with an exception.
18:31:32.641 [ERROR] [org.gradle.BuildExceptionReporter] 
18:31:32.641 [ERROR] [org.gradle.BuildExceptionReporter] * Where:
18:31:32.641 [ERROR] [org.gradle.BuildExceptionReporter] Initialization script '/srv/gump/public/workspace/java-hamcrest/gump_init_script.gradle'
line: 39
18:31:32.642 [ERROR] [org.gradle.BuildExceptionReporter] 
18:31:32.646 [ERROR] [org.gradle.BuildExceptionReporter] * What went wrong:
18:31:32.649 [ERROR] [org.gradle.BuildExceptionReporter] Could not compile initialization
script '/srv/gump/public/workspace/java-hamcrest/gump_init_script.gradle'.
18:31:32.649 [ERROR] [org.gradle.BuildExceptionReporter] > startup failed:
18:31:32.649 [ERROR] [org.gradle.BuildExceptionReporter]   initialization script '/srv/gump/public/workspace/java-hamcrest/gump_init_script.gradle':
39: expecting anything but ''\n''; got it anyway @ line 39, column 2.
18:31:32.650 [ERROR] [org.gradle.BuildExceptionReporter]      "
18:31:32.650 [ERROR] [org.gradle.BuildExceptionReporter]       ^
18:31:32.650 [ERROR] [org.gradle.BuildExceptionReporter]   
18:31:32.650 [ERROR] [org.gradle.BuildExceptionReporter]   1 error
18:31:32.650 [ERROR] [org.gradle.BuildExceptionReporter] 
18:31:32.651 [ERROR] [org.gradle.BuildExceptionReporter] 
18:31:32.651 [ERROR] [org.gradle.BuildExceptionReporter] * Try:
18:31:32.651 [ERROR] [org.gradle.BuildExceptionReporter] Run with --stacktrace option to get
the stack trace. 
18:31:32.652 [LIFECYCLE] [org.gradle.BuildResultLogger] 
18:31:32.657 [LIFECYCLE] [org.gradle.BuildResultLogger] BUILD FAILED
18:31:32.657 [LIFECYCLE] [org.gradle.BuildResultLogger] 
18:31:32.658 [LIFECYCLE] [org.gradle.BuildResultLogger] Total time: 6.445 secs
18:31:32.661 [DEBUG] [org.gradle.cache.internal.DefaultCacheAccess] Cache Plugin Resolution
Cache (/home/gump/.gradle/caches/2.2.1/plugin-resolution) was closed 0 times.
18:31:32.662 [DEBUG] [org.gradle.cache.internal.DefaultCacheAccess] Cache artifact cache (/home/gump/.gradle/caches/modules-2)
was closed 0 times.
18:31:32.662 [DEBUG] [org.gradle.api.internal.artifacts.ivyservice.ivyresolve.memcache.InMemoryCachedRepositoryFactory]
In-memory dependency metadata cache closed. Repos cached: 0, cache instances: 0, modules served
from cache: 0, artifacts: 0
18:31:32.666 [DEBUG] [org.gradle.api.internal.artifacts.ivyservice.resolveengine.store.ResolutionResultsStoreFactory]
Deleted 0 resolution results binary files in 0.0 secs
---------------------------------------------

To subscribe to this information via syndicated feeds:
- RSS: http://vmgump.apache.org/gump/public/java-hamcrest/java-hamcrest/rss.xml
- Atom: http://vmgump.apache.org/gump/public/java-hamcrest/java-hamcrest/atom.xml

============================== Gump Tracking Only ===
Produced by Apache Gump(TM) version 2.3.
Gump Run 20150210180004, vmgump.apache.org:vmgump:20150210180004
Gump E-mail Identifier (unique within run) #1.


--
Apache Gump
http://gump.apache.org/ [Instance: vmgump]

---------------------------------------------------------------------
To unsubscribe, e-mail: general-unsubscribe@gump.apache.org
For additional commands, e-mail: general-help@gump.apache.org


Mime
View raw message