gump-general mailing list archives

Site index · List index
Message view « Date » · « Thread »
Top « Date » · « Thread »
From g...@vmgump.apache.org
Subject BATCH: All dressed up, with nowhere to go...
Date Mon, 09 Feb 2015 01:43:43 GMT
Dear Gumpmeisters,
            
The following 4 notifys should have been sent

*********************************************************** G U M P
[GUMP@vmgump]: Project hamcrest-java (in module hamcrest) failed
[GUMP@vmgump]: Project openssl-make-install (in module openssl) failed
[GUMP@vmgump]: Project tika-parsers (in module tika) failed
[GUMP@vmgump]: Project tika-reactor (in module tika) failed
*********************************************************** G U M P
[GUMP@vmgump]: Project hamcrest-java (in module hamcrest) failed
To whom it may engage...
        
This is an automated request, but not an unsolicited one. For 
more information please visit http://gump.apache.org/nagged.html, 
and/or contact the folk at general@gump.apache.org.

Project hamcrest-java has an issue affecting its community integration.
This issue affects 14 projects,
 and has been outstanding for 74 runs.
The current state of this project is 'Failed', with reason 'Build Failed'.
For reference only, the following projects are affected by this:
    - hamcrest-java :  Provides a library of matcher objects (also known as constra...
    - org.apache.poi :  POI
    - poi :  POI
    - poi-test :  POI
    - test-ant :  Java based build tool
    - tomcat-tc7.0.x-test-bio :  Tomcat 7.x, a web server implementing Java Servlet 3.0,
    ...
    - tomcat-tc7.0.x-test-nio :  Tomcat 7.x, a web server implementing Java Servlet 3.0,
    ...
    - tomcat-tc8.0.x-test-apr :  Tomcat 8.x, a web server implementing the Java Servlet 3.1,
...
    - tomcat-tc8.0.x-test-bio :  Tomcat 8.x, a web server implementing the Java Servlet 3.1,
...
    - tomcat-tc8.0.x-test-nio :  Tomcat 8.x, a web server implementing the Java Servlet 3.1,
...
    - tomcat-tc8.0.x-test-nio2 :  Tomcat 8.x, a web server implementing the Java Servlet 3.1,
...
    - tomcat-trunk-test-apr :  Tomcat 9.x, a web server implementing the Java Servlet 4.0,
...
    - tomcat-trunk-test-nio :  Tomcat 9.x, a web server implementing the Java Servlet 4.0,
...
    - tomcat-trunk-test-nio2 :  Tomcat 9.x, a web server implementing the Java Servlet 4.0,
...


Full details are available at:
    http://vmgump.apache.org/gump/public/hamcrest/hamcrest-java/index.html

That said, some information snippets are provided here.

The following annotations (debug/informational/warning/error messages) were provided:
 -INFO- Failed with reason build failed
 -INFO- Failed to extract fallback artifacts from Gump Repository



The following work was performed:
http://vmgump.apache.org/gump/public/hamcrest/hamcrest-java/gump_work/build_hamcrest_hamcrest-java.html
Work Name: build_hamcrest_hamcrest-java (Type: Build)
Work ended in a state of : Failed
Elapsed: 
Command Line: /usr/lib/jvm/java-8-oracle/bin/java -Djava.awt.headless=true -Dbuild.sysclasspath=only
org.apache.tools.ant.Main -Dgump.merge=/srv/gump/public/gump/work/merge.xml -Dversion=20150209
bigjar 
[Working Directory: /srv/gump/public/workspace/hamcrest]
CLASSPATH: /usr/lib/jvm/java-8-oracle/lib/tools.jar:/srv/gump/public/workspace/hamcrest/build/temp/hamcrest-api-20150209.jar.contents:/srv/gump/public/workspace/hamcrest/build/temp/hamcrest-generator-20150209.jar.contents:/srv/gump/public/workspace/hamcrest/build/temp/hamcrest-core-20150209.jar.contents:/srv/gump/public/workspace/hamcrest/build/temp/hamcrest-integration-20150209.jar.contents:/srv/gump/public/workspace/hamcrest/build/temp/hamcrest-library-20150209.jar.contents:/srv/gump/public/workspace/hamcrest/build/hamcrest-api-20150209-tests.jar:/srv/gump/public/workspace/hamcrest/build/hamcrest-integration-20150209-tests.jar:/srv/gump/public/workspace/hamcrest/build/hamcrest-generator-20150209-tests.jar:/srv/gump/public/workspace/hamcrest/build/hamcrest-library-20150209-tests.jar:/srv/gump/public/workspace/hamcrest/build/hamcrest-core-20150209-tests.jar:/srv/gump/public/workspace/hamcrest/lib/integration/ant-junit-1.8.4.jar:/srv/gump/public/workspace/hamcrest/lib/integration/juni
 t-dep-4.11.jar:/srv/gump/public/workspace/hamcrest/lib/integration/easymock-2.2.jar:/srv/gump/public/workspace/hamcrest/lib/integration/jmock-1.10RC1.jar:/srv/gump/public/workspace/hamcrest/lib/integration/testng-6.5.2.jar:/srv/gump/public/workspace/hamcrest/lib/generator/qdox-2.0-M2.jar:/srv/gump/public/workspace/ant/bootstrap/lib/ant.jar:/srv/gump/public/workspace/ant/bootstrap/lib/ant-launcher.jar:/srv/gump/packages/jarjar/jarjar-0.6.jar
---------------------------------------------
Buildfile: build.xml does not exist!
Build failed
---------------------------------------------

To subscribe to this information via syndicated feeds:
- RSS: http://vmgump.apache.org/gump/public/hamcrest/hamcrest-java/rss.xml
- Atom: http://vmgump.apache.org/gump/public/hamcrest/hamcrest-java/atom.xml

============================== Gump Tracking Only ===
Produced by Apache Gump(TM) version 2.3.
Gump Run 20150209000006, vmgump.apache.org:vmgump:20150209000006
Gump E-mail Identifier (unique within run) #1.

*********************************************************** G U M P
[GUMP@vmgump]: Project openssl-make-install (in module openssl) failed
To whom it may engage...
        
This is an automated request, but not an unsolicited one. For 
more information please visit http://gump.apache.org/nagged.html, 
and/or contact the folk at general@gump.apache.org.

Project openssl-make-install has an issue affecting its community integration.
This issue affects 4 projects,
 and has been outstanding for 66 runs.
The current state of this project is 'Failed', with reason 'Build Failed'.
For reference only, the following projects are affected by this:
    - openssl-make-install :  OpenSSL Encryption Library
    - tomcat-native-configure :  Tomcat native library using Apache Portable Runtime
    - tomcat-native-make :  Tomcat native library using Apache Portable Runtime
    - tomcat-native-make-install :  Tomcat native library using Apache Portable Runtime


Full details are available at:
    http://vmgump.apache.org/gump/public/openssl/openssl-make-install/index.html

That said, some information snippets are provided here.

The following annotations (debug/informational/warning/error messages) were provided:
 -INFO- Failed with reason build failed
 -INFO- Failed to extract fallback artifacts from Gump Repository



The following work was performed:
http://vmgump.apache.org/gump/public/openssl/openssl-make-install/gump_work/build_openssl_openssl-make-install.html
Work Name: build_openssl_openssl-make-install (Type: Build)
Work ended in a state of : Failed
Elapsed: 1 min 6 secs
Command Line: make install 
[Working Directory: /srv/gump/public/workspace/openssl]
---------------------------------------------
SSL_use_PrivateKey_ASN1.3 => SSL_CTX_use_certificate.3
SSL_use_PrivateKey.3 => SSL_CTX_use_certificate.3
SSL_use_RSAPrivateKey.3 => SSL_CTX_use_certificate.3
SSL_use_RSAPrivateKey_ASN1.3 => SSL_CTX_use_certificate.3
SSL_use_RSAPrivateKey_file.3 => SSL_CTX_use_certificate.3
SSL_CTX_check_private_key.3 => SSL_CTX_use_certificate.3
SSL_check_private_key.3 => SSL_CTX_use_certificate.3
installing man3/SSL_CTX_use_psk_identity_hint.3
SSL_use_psk_identity_hint.3 => SSL_CTX_use_psk_identity_hint.3
SSL_CTX_set_psk_server_callback.3 => SSL_CTX_use_psk_identity_hint.3
SSL_set_psk_server_callback.3 => SSL_CTX_use_psk_identity_hint.3
installing man3/SSL_CTX_use_serverinfo.3
.3 => SSL_CTX_use_serverinfo.3
installing man3/SSL_SESSION_free.3
installing man3/SSL_SESSION_get_ex_new_index.3
SSL_SESSION_set_ex_data.3 => SSL_SESSION_get_ex_new_index.3
SSL_SESSION_get_ex_data.3 => SSL_SESSION_get_ex_new_index.3
installing man3/SSL_SESSION_get_time.3
SSL_SESSION_set_time.3 => SSL_SESSION_get_time.3
SSL_SESSION_get_timeout.3 => SSL_SESSION_get_time.3
SSL_SESSION_set_timeout.3 => SSL_SESSION_get_time.3
installing man3/SSL_accept.3
installing man3/SSL_alert_type_string.3
SSL_alert_type_string_long.3 => SSL_alert_type_string.3
SSL_alert_desc_string.3 => SSL_alert_type_string.3
SSL_alert_desc_string_long.3 => SSL_alert_type_string.3
installing man3/SSL_clear.3
installing man3/SSL_connect.3
installing man3/SSL_do_handshake.3
installing man3/SSL_free.3
installing man3/SSL_get_SSL_CTX.3
installing man3/SSL_get_ciphers.3
SSL_get_cipher_list.3 => SSL_get_ciphers.3
installing man3/SSL_get_client_CA_list.3
SSL_CTX_get_client_CA_list.3 => SSL_get_client_CA_list.3
installing man3/SSL_get_current_cipher.3
SSL_get_cipher.3 => SSL_get_current_cipher.3
SSL_get_cipher_name.3 => SSL_get_current_cipher.3
SSL_get_cipher_bits.3 => SSL_get_current_cipher.3
SSL_get_cipher_version.3 => SSL_get_current_cipher.3
installing man3/SSL_get_default_timeout.3
installing man3/SSL_get_error.3
installing man3/SSL_get_ex_data_X509_STORE_CTX_idx.3
installing man3/SSL_get_ex_new_index.3
SSL_set_ex_data.3 => SSL_get_ex_new_index.3
SSL_get_ex_data.3 => SSL_get_ex_new_index.3
installing man3/SSL_get_extms_support.3
SSL_get_extms_support.pod around line 27: =back without =over
POD document had syntax errors at /usr/bin/pod2man line 71.
make: *** [install_docs] Error 255
---------------------------------------------

To subscribe to this information via syndicated feeds:
- RSS: http://vmgump.apache.org/gump/public/openssl/openssl-make-install/rss.xml
- Atom: http://vmgump.apache.org/gump/public/openssl/openssl-make-install/atom.xml

============================== Gump Tracking Only ===
Produced by Apache Gump(TM) version 2.3.
Gump Run 20150209000006, vmgump.apache.org:vmgump:20150209000006
Gump E-mail Identifier (unique within run) #2.

*********************************************************** G U M P
[GUMP@vmgump]: Project tika-parsers (in module tika) failed
To whom it may engage...
        
This is an automated request, but not an unsolicited one. For 
more information please visit http://gump.apache.org/nagged.html, 
and/or contact the folk at general@gump.apache.org.

Project tika-parsers has an issue affecting its community integration.
This issue affects 2 projects,
 and has been outstanding for 124 runs.
The current state of this project is 'Failed', with reason 'Build Failed'.
For reference only, the following projects are affected by this:
    - tika-parsers :  Apache Tika is a toolkit for detecting and extracting metada...
    - tika-parsers-test :  Apache Tika is a toolkit for detecting and extracting metada...


Full details are available at:
    http://vmgump.apache.org/gump/public/tika/tika-parsers/index.html

That said, some information snippets are provided here.

The following annotations (debug/informational/warning/error messages) were provided:
 -DEBUG- Sole jar output [tika-parsers-*[0-9T].jar] identifier set to project name
 -INFO- Optional dependency org.apache.poi prerequisite failed with reason build failed
 -DEBUG- (Apache Gump generated) Apache Maven Settings in: /srv/gump/public/workspace/tika/tika-parsers/gump_mvn_settings.xml
 -INFO- Failed with reason build failed
 -DEBUG- Maven POM in: /srv/gump/public/workspace/tika/tika-parsers/pom.xml
 -INFO- Failed to extract fallback artifacts from Gump Repository



The following work was performed:
http://vmgump.apache.org/gump/public/tika/tika-parsers/gump_work/build_tika_tika-parsers.html
Work Name: build_tika_tika-parsers (Type: Build)
Work ended in a state of : Failed
Elapsed: 23 secs
Command Line: /opt/maven3/bin/mvn --batch-mode -DskipTests=true --settings /srv/gump/public/workspace/tika/tika-parsers/gump_mvn_settings.xml
package 
[Working Directory: /srv/gump/public/workspace/tika/tika-parsers]
M2_HOME: /opt/maven3
---------------------------------------------
[INFO] Downloading: http://localhost:8192/maven2/c3p0/c3p0/0.9.1.1/c3p0-0.9.1.1.pom
[INFO] Downloaded: http://localhost:8192/maven2/c3p0/c3p0/0.9.1.1/c3p0-0.9.1.1.pom (856 B
at 8.9 KB/sec)
[INFO] Downloading: http://localhost:8192/maven2/org/slf4j/slf4j-api/1.6.6/slf4j-api-1.6.6.pom
[INFO] Downloaded: http://localhost:8192/maven2/org/slf4j/slf4j-api/1.6.6/slf4j-api-1.6.6.pom
(3 KB at 28.5 KB/sec)
[INFO] Downloading: http://localhost:8192/maven2/org/slf4j/slf4j-parent/1.6.6/slf4j-parent-1.6.6.pom
[INFO] Downloaded: http://localhost:8192/maven2/org/slf4j/slf4j-parent/1.6.6/slf4j-parent-1.6.6.pom
(13 KB at 135.7 KB/sec)
[INFO] Downloading: http://localhost:8192/maven2/com/google/protobuf/protobuf-java/2.5.0/protobuf-java-2.5.0.pom
[INFO] Downloaded: http://localhost:8192/maven2/com/google/protobuf/protobuf-java/2.5.0/protobuf-java-2.5.0.pom
(9 KB at 89.9 KB/sec)
[INFO] Downloading: http://localhost:8192/maven2/net/sf/ehcache/ehcache-core/2.6.2/ehcache-core-2.6.2.pom
[INFO] Downloaded: http://localhost:8192/maven2/net/sf/ehcache/ehcache-core/2.6.2/ehcache-core-2.6.2.pom
(30 KB at 305.9 KB/sec)
[INFO] Downloading: http://localhost:8192/maven2/net/sf/ehcache/ehcache-parent/2.3/ehcache-parent-2.3.pom
[INFO] Downloaded: http://localhost:8192/maven2/net/sf/ehcache/ehcache-parent/2.3/ehcache-parent-2.3.pom
(16 KB at 170.5 KB/sec)
[INFO] Downloading: http://localhost:8192/maven2/org/slf4j/slf4j-api/1.6.1/slf4j-api-1.6.1.pom
[INFO] Downloaded: http://localhost:8192/maven2/org/slf4j/slf4j-api/1.6.1/slf4j-api-1.6.1.pom
(3 KB at 29.5 KB/sec)
[INFO] Downloading: http://localhost:8192/maven2/org/slf4j/slf4j-parent/1.6.1/slf4j-parent-1.6.1.pom
[INFO] Downloaded: http://localhost:8192/maven2/org/slf4j/slf4j-parent/1.6.1/slf4j-parent-1.6.1.pom
(10 KB at 97.9 KB/sec)
[INFO] Downloading: http://localhost:8192/maven2/com/google/guava/guava/17.0/guava-17.0.pom
[INFO] Downloaded: http://localhost:8192/maven2/com/google/guava/guava/17.0/guava-17.0.pom
(6 KB at 311.3 KB/sec)
[INFO] Downloading: http://localhost:8192/maven2/org/itadaki/bzip2/0.9.1/bzip2-0.9.1.pom
[INFO] Downloading: https://artifacts.unidata.ucar.edu/content/repositories/unidata/org/itadaki/bzip2/0.9.1/bzip2-0.9.1.pom
[INFO] Downloaded: https://artifacts.unidata.ucar.edu/content/repositories/unidata/org/itadaki/bzip2/0.9.1/bzip2-0.9.1.pom
(389 B at 4.0 KB/sec)
[INFO] Downloading: http://localhost:8192/maven2/com/beust/jcommander/1.35/jcommander-1.35.pom
[INFO] Downloaded: http://localhost:8192/maven2/com/beust/jcommander/1.35/jcommander-1.35.pom
(8 KB at 72.7 KB/sec)
[INFO] Downloading: http://localhost:8192/maven2/org/sonatype/oss/oss-parent/3/oss-parent-3.pom
[INFO] Downloaded: http://localhost:8192/maven2/org/sonatype/oss/oss-parent/3/oss-parent-3.pom
(4 KB at 34.8 KB/sec)
[INFO] Downloading: http://localhost:8192/maven2/net/java/dev/jna/jna/4.1.0/jna-4.1.0.pom
[INFO] Downloaded: http://localhost:8192/maven2/net/java/dev/jna/jna/4.1.0/jna-4.1.0.pom (2
KB at 13.1 KB/sec)
[INFO] Downloading: http://localhost:8192/maven2/edu/ucar/grib/4.5.4/grib-4.5.4.pom
[INFO] Downloaded: http://localhost:8192/maven2/edu/ucar/grib/4.5.4/grib-4.5.4.pom (4 KB at
33.4 KB/sec)
[INFO] Downloading: http://localhost:8192/maven2/org/jsoup/jsoup/1.7.2/jsoup-1.7.2.pom
[INFO] Downloaded: http://localhost:8192/maven2/org/jsoup/jsoup/1.7.2/jsoup-1.7.2.pom (6 KB
at 58.1 KB/sec)
[INFO] Downloading: http://localhost:8192/maven2/edu/ucar/jj2000/5.2/jj2000-5.2.pom
[INFO] Downloading: https://artifacts.unidata.ucar.edu/content/repositories/unidata/edu/ucar/jj2000/5.2/jj2000-5.2.pom
[INFO] Downloaded: https://artifacts.unidata.ucar.edu/content/repositories/unidata/edu/ucar/jj2000/5.2/jj2000-5.2.pom
(3 KB at 22.8 KB/sec)
[INFO] Downloading: http://localhost:8192/maven2/com/google/guava/guava/10.0.1/guava-10.0.1.pom
[INFO] Downloaded: http://localhost:8192/maven2/com/google/guava/guava/10.0.1/guava-10.0.1.pom
(6 KB at 845.0 KB/sec)
[INFO] ------------------------------------------------------------------------
[INFO] BUILD FAILURE
[INFO] ------------------------------------------------------------------------
[INFO] Total time: 21.599 s
[INFO] Finished at: 2015-02-09T01:09:51+00:00
[INFO] Final Memory: 10M/24M
[INFO] ------------------------------------------------------------------------
[ERROR] Failed to execute goal on project tika-parsers: Could not resolve dependencies for
project org.apache.tika:tika-parsers:bundle:1.8-SNAPSHOT: Failed to collect dependencies at
org.apache.tika:tika-core:jar:1.8-SNAPSHOT: Failed to read artifact descriptor for org.apache.tika:tika-core:jar:1.8-SNAPSHOT:
Could not transfer artifact org.apache.tika:tika-core:pom:1.8-SNAPSHOT from/to gump-apache.snapshots
(http://localhost:8192/repo/m2-snapshot-repository): TransferFailedException: ClientProtocolException:
Status line contains invalid status code: HTTP/1.1 :01 :01 -> [Help 1]
[ERROR] 
[ERROR] To see the full stack trace of the errors, re-run Maven with the -e switch.
[ERROR] Re-run Maven using the -X switch to enable full debug logging.
[ERROR] 
[ERROR] For more information about the errors and possible solutions, please read the following
articles:
[ERROR] [Help 1] http://cwiki.apache.org/confluence/display/MAVEN/DependencyResolutionException
---------------------------------------------

To subscribe to this information via syndicated feeds:
- RSS: http://vmgump.apache.org/gump/public/tika/tika-parsers/rss.xml
- Atom: http://vmgump.apache.org/gump/public/tika/tika-parsers/atom.xml

============================== Gump Tracking Only ===
Produced by Apache Gump(TM) version 2.3.
Gump Run 20150209000006, vmgump.apache.org:vmgump:20150209000006
Gump E-mail Identifier (unique within run) #3.

*********************************************************** G U M P
[GUMP@vmgump]: Project tika-reactor (in module tika) failed
To whom it may engage...
        
This is an automated request, but not an unsolicited one. For 
more information please visit http://gump.apache.org/nagged.html, 
and/or contact the folk at general@gump.apache.org.

Project tika-reactor has an issue affecting its community integration.
This issue affects 1 projects,
 and has been outstanding for 124 runs.
The current state of this project is 'Failed', with reason 'Build Failed'.
For reference only, the following projects are affected by this:
    - tika-reactor :  Apache Tika is a toolkit for detecting and extracting metada...


Full details are available at:
    http://vmgump.apache.org/gump/public/tika/tika-reactor/index.html

That said, some information snippets are provided here.

The following annotations (debug/informational/warning/error messages) were provided:
 -INFO- Optional dependency tika-parsers failed with reason build failed
 -DEBUG- (Apache Gump generated) Apache Maven Settings in: /srv/gump/public/workspace/tika/gump_mvn_settings.xml
 -INFO- Failed with reason build failed
 -DEBUG- Maven POM in: /srv/gump/public/workspace/tika/pom.xml



The following work was performed:
http://vmgump.apache.org/gump/public/tika/tika-reactor/gump_work/build_tika_tika-reactor.html
Work Name: build_tika_tika-reactor (Type: Build)
Work ended in a state of : Failed
Elapsed: 49 secs
Command Line: /opt/maven3/bin/mvn --batch-mode -DskipTests=true --settings /srv/gump/public/workspace/tika/gump_mvn_settings.xml
install 
[Working Directory: /srv/gump/public/workspace/tika]
MAVEN_OPTS: -Xmx512m 
M2_HOME: /opt/maven3
---------------------------------------------
[INFO] 5 errors 
[INFO] -------------------------------------------------------------
[INFO] ------------------------------------------------------------------------
[INFO] Reactor Summary:
[INFO] 
[INFO] Apache Tika parent ................................. SUCCESS [  3.019 s]
[INFO] Apache Tika core ................................... SUCCESS [ 17.000 s]
[INFO] Apache Tika parsers ................................ FAILURE [ 25.447 s]
[INFO] Apache Tika XMP .................................... SKIPPED
[INFO] Apache Tika serialization .......................... SKIPPED
[INFO] Apache Tika application ............................ SKIPPED
[INFO] Apache Tika OSGi bundle ............................ SKIPPED
[INFO] Apache Tika server ................................. SKIPPED
[INFO] Apache Tika translate .............................. SKIPPED
[INFO] Apache Tika examples ............................... SKIPPED
[INFO] Apache Tika Java-7 Components ...................... SKIPPED
[INFO] Apache Tika ........................................ SKIPPED
[INFO] ------------------------------------------------------------------------
[INFO] BUILD FAILURE
[INFO] ------------------------------------------------------------------------
[INFO] Total time: 47.041 s
[INFO] Finished at: 2015-02-09T01:10:41+00:00
[INFO] Final Memory: 40M/96M
[INFO] ------------------------------------------------------------------------
[ERROR] Failed to execute goal org.apache.maven.plugins:maven-compiler-plugin:3.1:compile
(default-compile) on project tika-parsers: Compilation failure: Compilation failure:
[ERROR] /srv/gump/public/workspace/tika/tika-parsers/src/main/java/org/apache/tika/parser/font/AdobeFontMetricParser.java:[26,30]
cannot find symbol
[ERROR] symbol:   class FontMetric
[ERROR] location: package org.apache.fontbox.afm
[ERROR] /srv/gump/public/workspace/tika/tika-parsers/src/main/java/org/apache/tika/parser/font/AdobeFontMetricParser.java:[70,8]
cannot find symbol
[ERROR] symbol:   class FontMetric
[ERROR] location: class org.apache.tika.parser.font.AdobeFontMetricParser
[ERROR] /srv/gump/public/workspace/tika/tika-parsers/src/main/java/org/apache/tika/parser/font/AdobeFontMetricParser.java:[75,28]
cannot find symbol
[ERROR] symbol:   method getResult()
[ERROR] location: variable parser of type org.apache.fontbox.afm.AFMParser
[ERROR] /srv/gump/public/workspace/tika/tika-parsers/src/main/java/org/apache/tika/parser/font/TrueTypeParser.java:[67,26]
cannot find symbol
[ERROR] symbol:   method parseTTF(java.io.File)
[ERROR] location: variable parser of type org.apache.fontbox.ttf.TTFParser
[ERROR] /srv/gump/public/workspace/tika/tika-parsers/src/main/java/org/apache/tika/parser/font/TrueTypeParser.java:[69,26]
cannot find symbol
[ERROR] symbol:   method parseTTF(java.io.InputStream)
[ERROR] location: variable parser of type org.apache.fontbox.ttf.TTFParser
[ERROR] -> [Help 1]
[ERROR] 
[ERROR] To see the full stack trace of the errors, re-run Maven with the -e switch.
[ERROR] Re-run Maven using the -X switch to enable full debug logging.
[ERROR] 
[ERROR] For more information about the errors and possible solutions, please read the following
articles:
[ERROR] [Help 1] http://cwiki.apache.org/confluence/display/MAVEN/MojoFailureException
[ERROR] 
[ERROR] After correcting the problems, you can resume the build with the command
[ERROR]   mvn <goals> -rf :tika-parsers
---------------------------------------------

To subscribe to this information via syndicated feeds:
- RSS: http://vmgump.apache.org/gump/public/tika/tika-reactor/rss.xml
- Atom: http://vmgump.apache.org/gump/public/tika/tika-reactor/atom.xml

============================== Gump Tracking Only ===
Produced by Apache Gump(TM) version 2.3.
Gump Run 20150209000006, vmgump.apache.org:vmgump:20150209000006
Gump E-mail Identifier (unique within run) #4.


--
Apache Gump
http://gump.apache.org/ [Instance: vmgump]

---------------------------------------------------------------------
To unsubscribe, e-mail: general-unsubscribe@gump.apache.org
For additional commands, e-mail: general-help@gump.apache.org


Mime
View raw message