gump-general mailing list archives

Site index · List index
Message view « Date » · « Thread »
Top « Date » · « Thread »
From g...@vmgump.apache.org
Subject BATCH: All dressed up, with nowhere to go...
Date Wed, 31 Dec 2014 03:05:22 GMT
Dear Gumpmeisters,
            
The following 7 notifys should have been sent

*********************************************************** G U M P
[GUMP@vmgump]: Module pcre failed
[GUMP@vmgump]: Project pcre-autogen (in module pcre) failed
[GUMP@vmgump]: Project pcre-configure (in module pcre) failed
[GUMP@vmgump]: Project hamcrest-java (in module hamcrest) failed
[GUMP@vmgump]: Project compress-antlib-test (in module antlibs-compress) failed
[GUMP@vmgump]: Project tika-parsers (in module tika) failed
[GUMP@vmgump]: Project tika-reactor (in module tika) failed
*********************************************************** G U M P
[GUMP@vmgump]: Module pcre failed
To whom it may engage...
        
This is an automated request, but not an unsolicited one. For 
more information please visit http://gump.apache.org/nagged.html, 
and/or contact the folk at general@gump.apache.org.

Module pcre has an issue affecting its community integration,
 and has been outstanding for 15 runs.
The current state of this module is 'Failed', with reason 'Update Failed'.

Full details are available at:
    http://vmgump.apache.org/gump/public/pcre/index.html

That said, some information snippets are provided here.

The following annotations (debug/informational/warning/error messages) were provided:
 -INFO- Failed with reason update failed



The following work was performed:
http://vmgump.apache.org/gump/public/pcre/gump_work/update_pcre.html
Work Name: update_pcre (Type: Update)
Work ended in a state of : Failed
Elapsed: 
Command Line: svn --quiet update --non-interactive pcre 
[Working Directory: /srv/gump/public/workspace/cvs]
---------------------------------------------
svn: E155004: Run 'svn cleanup' to remove locks (type 'svn help cleanup' for details)
svn: E155004: Working copy '/srv/gump/public/workspace/cvs/pcre' locked.
svn: E155004: '/srv/gump/public/workspace/cvs/pcre' is already locked.
---------------------------------------------

To subscribe to this information via syndicated feeds:
- RSS: http://vmgump.apache.org/gump/public/pcre/rss.xml
- Atom: http://vmgump.apache.org/gump/public/pcre/atom.xml

============================== Gump Tracking Only ===
Produced by Apache Gump(TM) version 2.3.
Gump Run 20141231000004, vmgump.apache.org:vmgump:20141231000004
Gump E-mail Identifier (unique within run) #1.

*********************************************************** G U M P
[GUMP@vmgump]: Project pcre-autogen (in module pcre) failed
To whom it may engage...
        
This is an automated request, but not an unsolicited one. For 
more information please visit http://gump.apache.org/nagged.html, 
and/or contact the folk at general@gump.apache.org.

Project pcre-autogen has an issue affecting its community integration,
 and has been outstanding for 15 runs.
The current state of this project is 'Failed', with reason 'Update Failed'.

Full details are available at:
    http://vmgump.apache.org/gump/public/pcre/pcre-autogen/index.html

That said, some information snippets are provided here.

The following annotations (debug/informational/warning/error messages) were provided:
 -INFO- Failed with reason update failed

To subscribe to this information via syndicated feeds:
- RSS: http://vmgump.apache.org/gump/public/pcre/pcre-autogen/rss.xml
- Atom: http://vmgump.apache.org/gump/public/pcre/pcre-autogen/atom.xml

============================== Gump Tracking Only ===
Produced by Apache Gump(TM) version 2.3.
Gump Run 20141231000004, vmgump.apache.org:vmgump:20141231000004
Gump E-mail Identifier (unique within run) #2.

*********************************************************** G U M P
[GUMP@vmgump]: Project pcre-configure (in module pcre) failed
To whom it may engage...
        
This is an automated request, but not an unsolicited one. For 
more information please visit http://gump.apache.org/nagged.html, 
and/or contact the folk at general@gump.apache.org.

Project pcre-configure has an issue affecting its community integration,
 and has been outstanding for 15 runs.
The current state of this project is 'Failed', with reason 'Update Failed'.

Full details are available at:
    http://vmgump.apache.org/gump/public/pcre/pcre-configure/index.html

That said, some information snippets are provided here.

The following annotations (debug/informational/warning/error messages) were provided:
 -INFO- Failed with reason update failed

To subscribe to this information via syndicated feeds:
- RSS: http://vmgump.apache.org/gump/public/pcre/pcre-configure/rss.xml
- Atom: http://vmgump.apache.org/gump/public/pcre/pcre-configure/atom.xml

============================== Gump Tracking Only ===
Produced by Apache Gump(TM) version 2.3.
Gump Run 20141231000004, vmgump.apache.org:vmgump:20141231000004
Gump E-mail Identifier (unique within run) #3.

*********************************************************** G U M P
[GUMP@vmgump]: Project hamcrest-java (in module hamcrest) failed
To whom it may engage...
        
This is an automated request, but not an unsolicited one. For 
more information please visit http://gump.apache.org/nagged.html, 
and/or contact the folk at general@gump.apache.org.

Project hamcrest-java has an issue affecting its community integration.
This issue affects 17 projects.
The current state of this project is 'Failed', with reason 'Build Failed'.
For reference only, the following projects are affected by this:
    - hamcrest-java :  Provides a library of matcher objects (also known as constra...
    - org.apache.poi :  POI
    - org.xmlunit :  Extension for XML unit tests.
    - poi :  POI
    - poi-test :  POI
    - test-ant :  Java based build tool
    - tomcat-tc7.0.x-test-bio :  Tomcat 7.x, a web server implementing Java Servlet 3.0,
    ...
    - tomcat-tc7.0.x-test-nio :  Tomcat 7.x, a web server implementing Java Servlet 3.0,
    ...
    - tomcat-tc8.0.x-test-apr :  Tomcat 8.x, a web server implementing the Java Servlet 3.1,
...
    - tomcat-tc8.0.x-test-bio :  Tomcat 8.x, a web server implementing the Java Servlet 3.1,
...
    - tomcat-tc8.0.x-test-nio :  Tomcat 8.x, a web server implementing the Java Servlet 3.1,
...
    - tomcat-tc8.0.x-test-nio2 :  Tomcat 8.x, a web server implementing the Java Servlet 3.1,
...
    - tomcat-trunk-test-apr :  Tomcat 9.x, a web server implementing the Java Servlet 4.0,
...
    - tomcat-trunk-test-nio :  Tomcat 9.x, a web server implementing the Java Servlet 4.0,
...
    - tomcat-trunk-test-nio2 :  Tomcat 9.x, a web server implementing the Java Servlet 4.0,
...
    - xmlunit :  Extension for XML unit tests.
    - xmlunit-test :  Extension for XML unit tests.


Full details are available at:
    http://vmgump.apache.org/gump/public/hamcrest/hamcrest-java/index.html

That said, some information snippets are provided here.

The following annotations (debug/informational/warning/error messages) were provided:
 -INFO- Failed with reason build failed
 -DEBUG- Extracted fallback artifacts from Gump Repository



The following work was performed:
http://vmgump.apache.org/gump/public/hamcrest/hamcrest-java/gump_work/build_hamcrest_hamcrest-java.html
Work Name: build_hamcrest_hamcrest-java (Type: Build)
Work ended in a state of : Failed
Elapsed: 3 secs
Command Line: /usr/lib/jvm/java-8-oracle/bin/java -Djava.awt.headless=true -Dbuild.sysclasspath=only
org.apache.tools.ant.Main -Dgump.merge=/srv/gump/public/gump/work/merge.xml -Dversion=20141231
bigjar 
[Working Directory: /srv/gump/public/workspace/hamcrest]
CLASSPATH: /usr/lib/jvm/java-8-oracle/lib/tools.jar:/srv/gump/public/workspace/hamcrest/build/temp/hamcrest-api-20141231.jar.contents:/srv/gump/public/workspace/hamcrest/build/temp/hamcrest-generator-20141231.jar.contents:/srv/gump/public/workspace/hamcrest/build/temp/hamcrest-core-20141231.jar.contents:/srv/gump/public/workspace/hamcrest/build/temp/hamcrest-integration-20141231.jar.contents:/srv/gump/public/workspace/hamcrest/build/temp/hamcrest-library-20141231.jar.contents:/srv/gump/public/workspace/hamcrest/build/hamcrest-api-20141231-tests.jar:/srv/gump/public/workspace/hamcrest/build/hamcrest-integration-20141231-tests.jar:/srv/gump/public/workspace/hamcrest/build/hamcrest-generator-20141231-tests.jar:/srv/gump/public/workspace/hamcrest/build/hamcrest-library-20141231-tests.jar:/srv/gump/public/workspace/hamcrest/build/hamcrest-core-20141231-tests.jar:/srv/gump/public/workspace/hamcrest/lib/integration/ant-junit-1.8.4.jar:/srv/gump/public/workspace/hamcrest/lib/integration/juni
 t-dep-4.11.jar:/srv/gump/public/workspace/hamcrest/lib/integration/easymock-2.2.jar:/srv/gump/public/workspace/hamcrest/lib/integration/jmock-1.10RC1.jar:/srv/gump/public/workspace/hamcrest/lib/integration/testng-6.5.2.jar:/srv/gump/public/workspace/hamcrest/lib/generator/qdox-2.0-M2.jar:/srv/gump/public/workspace/ant/bootstrap/lib/ant.jar:/srv/gump/public/workspace/ant/bootstrap/lib/ant-launcher.jar:/srv/gump/packages/jarjar/jarjar-0.6.jar
---------------------------------------------
api:
    [mkdir] Created dir: /srv/gump/public/workspace/hamcrest/build/temp/hamcrest-api-20141231-sources.jar.contents
     [copy] Copying 4 files to /srv/gump/public/workspace/hamcrest/build/temp/hamcrest-api-20141231-sources.jar.contents
    [mkdir] Created dir: /srv/gump/public/workspace/hamcrest/build/temp/hamcrest-api-20141231.jar.contents
    [javac] Compiling 4 source files to /srv/gump/public/workspace/hamcrest/build/temp/hamcrest-api-20141231.jar.contents
    [javac] warning: [options] source value 1.5 is obsolete and will be removed in a future
release
    [javac] warning: [options] target value 1.5 is obsolete and will be removed in a future
release
    [javac] warning: [options] To suppress warnings about obsolete options, use -Xlint:-options.
    [javac] 3 warnings
    [mkdir] Created dir: /srv/gump/public/workspace/hamcrest/build/temp/hamcrest-api-20141231-tests-sources.jar.contents
     [copy] Copying 1 file to /srv/gump/public/workspace/hamcrest/build/temp/hamcrest-api-20141231-tests-sources.jar.contents
    [mkdir] Created dir: /srv/gump/public/workspace/hamcrest/build/temp/hamcrest-api-20141231-tests.jar.contents
    [javac] Compiling 1 source file to /srv/gump/public/workspace/hamcrest/build/temp/hamcrest-api-20141231-tests.jar.contents
    [javac] warning: [options] source value 1.5 is obsolete and will be removed in a future
release
    [javac] warning: [options] target value 1.5 is obsolete and will be removed in a future
release
    [javac] warning: [options] To suppress warnings about obsolete options, use -Xlint:-options.
    [javac] 3 warnings
    [mkdir] Created dir: /srv/gump/public/workspace/hamcrest/build/temp/hamcrest-api-20141231.jar.manifest
     [copy] Copying 1 file to /srv/gump/public/workspace/hamcrest/build/temp/hamcrest-api-20141231.jar.contents/META-INF
      [jar] Building jar: /srv/gump/public/workspace/hamcrest/build/hamcrest-api-20141231.jar
     [copy] Copying 1 file to /srv/gump/public/workspace/hamcrest/build/temp/hamcrest-api-20141231-tests.jar.contents/META-INF
      [jar] Building jar: /srv/gump/public/workspace/hamcrest/build/hamcrest-api-20141231-tests.jar
     [copy] Copying 1 file to /srv/gump/public/workspace/hamcrest/build/temp/hamcrest-api-20141231-sources.jar.contents/META-INF
      [jar] Building jar: /srv/gump/public/workspace/hamcrest/build/hamcrest-api-20141231-sources.jar
    [mkdir] Created dir: /srv/gump/public/workspace/hamcrest/build/temp/hamcrest-api/test-wrk
    [junit] Testsuite: org.hamcrest.NullDescriptionTest
    [junit] Tests run: 1, Failures: 0, Errors: 0, Time elapsed: 0.072 sec
    [junit] 

generator:
    [mkdir] Created dir: /srv/gump/public/workspace/hamcrest/build/temp/hamcrest-generator-20141231-sources.jar.contents
     [copy] Warning: /srv/gump/public/workspace/hamcrest/hamcrest-generator/src/main/java
does not exist.
    [mkdir] Created dir: /srv/gump/public/workspace/hamcrest/build/temp/hamcrest-generator-20141231.jar.contents
    [mkdir] Created dir: /srv/gump/public/workspace/hamcrest/build/temp/hamcrest-generator-20141231-tests-sources.jar.contents
     [copy] Warning: /srv/gump/public/workspace/hamcrest/hamcrest-generator/src/test/java
does not exist.
    [mkdir] Created dir: /srv/gump/public/workspace/hamcrest/build/temp/hamcrest-generator-20141231-tests.jar.contents
    [mkdir] Created dir: /srv/gump/public/workspace/hamcrest/build/temp/hamcrest-generator-20141231.jar.manifest
     [copy] Copying 1 file to /srv/gump/public/workspace/hamcrest/build/temp/hamcrest-generator-20141231.jar.contents/META-INF
      [jar] Building jar: /srv/gump/public/workspace/hamcrest/build/hamcrest-generator-20141231.jar
     [copy] Copying 1 file to /srv/gump/public/workspace/hamcrest/build/temp/hamcrest-generator-20141231-tests.jar.contents/META-INF
      [jar] Building jar: /srv/gump/public/workspace/hamcrest/build/hamcrest-generator-20141231-tests.jar
     [copy] Copying 1 file to /srv/gump/public/workspace/hamcrest/build/temp/hamcrest-generator-20141231-sources.jar.contents/META-INF
      [jar] Building jar: /srv/gump/public/workspace/hamcrest/build/hamcrest-generator-20141231-sources.jar
    [mkdir] Created dir: /srv/gump/public/workspace/hamcrest/build/temp/hamcrest-generator/test-wrk
     [copy] Copying 1 file to /srv/gump/public/workspace/hamcrest/build

BUILD FAILED
/srv/gump/public/workspace/hamcrest/build.xml:35: The archive qdox-2.0-M2.jar doesn't exist

Total time: 2 seconds
---------------------------------------------

To subscribe to this information via syndicated feeds:
- RSS: http://vmgump.apache.org/gump/public/hamcrest/hamcrest-java/rss.xml
- Atom: http://vmgump.apache.org/gump/public/hamcrest/hamcrest-java/atom.xml

============================== Gump Tracking Only ===
Produced by Apache Gump(TM) version 2.3.
Gump Run 20141231000004, vmgump.apache.org:vmgump:20141231000004
Gump E-mail Identifier (unique within run) #4.

*********************************************************** G U M P
[GUMP@vmgump]: Project compress-antlib-test (in module antlibs-compress) failed
To whom it may engage...
        
This is an automated request, but not an unsolicited one. For 
more information please visit http://gump.apache.org/nagged.html, 
and/or contact the folk at general@gump.apache.org.

Project compress-antlib-test has an issue affecting its community integration.
This issue affects 1 projects,
 and has been outstanding for 88 runs.
The current state of this project is 'Failed', with reason 'Build Failed'.
For reference only, the following projects are affected by this:
    - compress-antlib-test :  The Apache Compress Antlib contains tasks and resources that...


Full details are available at:
    http://vmgump.apache.org/gump/public/antlibs-compress/compress-antlib-test/index.html

That said, some information snippets are provided here.

The following annotations (debug/informational/warning/error messages) were provided:
 -DEBUG- Dependency on ant exists, no need to add for property ant.home.
 -INFO- Failed with reason build failed



The following work was performed:
http://vmgump.apache.org/gump/public/antlibs-compress/compress-antlib-test/gump_work/build_antlibs-compress_compress-antlib-test.html
Work Name: build_antlibs-compress_compress-antlib-test (Type: Build)
Work ended in a state of : Failed
Elapsed: 4 mins 18 secs
Command Line: /usr/lib/jvm/java-8-oracle/bin/java -Djava.awt.headless=true -Dbuild.sysclasspath=only
-Xbootclasspath/p:/srv/gump/public/workspace/xml-xerces2/build/xercesImpl.jar:/srv/gump/public/workspace/xml-commons/java/external/build/xml-apis.jar
org.apache.tools.ant.Main -Dgump.merge=/srv/gump/public/gump/work/merge.xml -Dant.home=/srv/gump/public/workspace/ant/dist
test 
[Working Directory: /srv/gump/public/workspace/antlibs-compress]
CLASSPATH: /usr/lib/jvm/java-8-oracle/lib/tools.jar:/srv/gump/public/workspace/antlibs-compress/ivy/ivy.jar:/srv/gump/public/workspace/antlibs-compress/build/ant-compress-20141231.jar:/srv/gump/public/workspace/ant/dist/lib/ant.jar:/srv/gump/public/workspace/ant/dist/lib/ant-launcher.jar:/srv/gump/public/workspace/ant/dist/lib/ant-jmf.jar:/srv/gump/public/workspace/ant/dist/lib/ant-junit.jar:/srv/gump/public/workspace/ant/dist/lib/ant-junit4.jar:/srv/gump/public/workspace/ant/dist/lib/ant-swing.jar:/srv/gump/public/workspace/ant/dist/lib/ant-apache-resolver.jar:/srv/gump/public/workspace/ant/dist/lib/ant-apache-xalan2.jar:/srv/gump/public/workspace/apache-commons/compress/target/commons-compress-1.10-SNAPSHOT.jar:/srv/gump/public/workspace/xz-java/build/jar-20141231/xz.jar:/srv/gump/public/workspace/antlibs-antunit/build/ant-antunit-20141231.jar:/srv/gump/public/workspace/xml-commons/java/external/build/xml-apis-ext.jar
---------------------------------------------
[au:antunit] Target: testImplicitDirectoriesUsePermissions took 0.007 sec
[au:antunit] Target: testReplaceOfOutOfDate took 4.025 sec
[au:antunit] Target: testRoundDown took 0.017 sec
[au:antunit] Target: testUpdateOfUpToDate took 4.014 sec
[au:antunit] Target: testUpdateOfOutOfDate took 4.043 sec
[au:antunit] Target: testSkipEmpty took 0.008 sec
[au:antunit] Target: testWithDirectories took 0.027 sec
[au:antunit] Target: testFullpath took 0.026 sec
[au:antunit] Target: testPreserve0Permissions took 0.029 sec
[au:antunit] Target: testForceCreateOfUpToDate took 4.03 sec
[au:antunit] Target: testNoDirectoriesByDefault took 0.017 sec
[au:antunit] Target: testPlainFileSet took 0.012 sec
[au:antunit] Target: testReplaceOfUpToDate took 4.022 sec
[au:antunit] Target: testCoreZipFileSet took 0.014 sec
[au:antunit] Target: testAntlibTarFileSet took 0.016 sec
[au:antunit] Target: testCreateOfOutOfDate took 4.047 sec
[au:antunit] Target: testFileSetPermissionsWin took 0.013 sec
[au:antunit] Target: testAddDuplicates took 0.012 sec
[au:antunit] Target: testRemoveLeadingSlashes took 0.014 sec
[au:antunit] Target: testPrefixWithSlash took 0.03 sec
[au:antunit] Target: testWithImplicitDirectories took 0.034 sec
[au:antunit] Target: testForceReplaceOfUpToDate took 4.036 sec
[au:antunit] Target: test0PermissionsGetReplaced took 0.012 sec
[au:antunit] Target: testFailDuplicates took 0.004 sec
[au:antunit] Build File: /srv/gump/public/workspace/antlibs-compress/src/tests/antunit/zipentry-test.xml
[au:antunit] Tests run: 3, Failures: 0, Errors: 0, Time elapsed: 0.03 sec
[au:antunit] Target: testResourceProperties took 0.012 sec
[au:antunit] Target: testUncompressSource took 0.005 sec
[au:antunit] Target: testZipSource took 0.006 sec
[au:antunit] Build File: /srv/gump/public/workspace/antlibs-compress/src/tests/antunit/zipfileset-test.xml
[au:antunit] Tests run: 9, Failures: 0, Errors: 0, Time elapsed: 0.107 sec
[au:antunit] Target: testSkipUnreadableEntries took 0.006 sec
[au:antunit] Target: testMissingArchive took 0.003 sec
[au:antunit] Target: testUncompressSource took 0.005 sec
[au:antunit] Target: test-refid-check-encoding took 0.003 sec
[au:antunit] Target: testZipSource took 0.003 sec
[au:antunit] Target: test-refid-modify took 0.042 sec
[au:antunit] Target: test-refid-check-prefix took 0.002 sec
[au:antunit] Target: testMissingArchiveDoesntMatter took 0.008 sec
[au:antunit] Target: testFailsOnUnreadableEntries took 0.008 sec
[au:antunit] Build File: /srv/gump/public/workspace/antlibs-compress/src/tests/antunit/zresource-test.xml
[au:antunit] Tests run: 1, Failures: 0, Errors: 0, Time elapsed: 0.013 sec
[au:antunit] Target: testNativeZ took 0.011 sec

test:

BUILD FAILED
/srv/gump/public/workspace/antlibs-compress/common/build.xml:209: At least one AntUnit test
has failed.

Total time: 4 minutes 18 seconds
---------------------------------------------

To subscribe to this information via syndicated feeds:
- RSS: http://vmgump.apache.org/gump/public/antlibs-compress/compress-antlib-test/rss.xml
- Atom: http://vmgump.apache.org/gump/public/antlibs-compress/compress-antlib-test/atom.xml

============================== Gump Tracking Only ===
Produced by Apache Gump(TM) version 2.3.
Gump Run 20141231000004, vmgump.apache.org:vmgump:20141231000004
Gump E-mail Identifier (unique within run) #7.

*********************************************************** G U M P
[GUMP@vmgump]: Project tika-parsers (in module tika) failed
To whom it may engage...
        
This is an automated request, but not an unsolicited one. For 
more information please visit http://gump.apache.org/nagged.html, 
and/or contact the folk at general@gump.apache.org.

Project tika-parsers has an issue affecting its community integration.
This issue affects 2 projects,
 and has been outstanding for 108 runs.
The current state of this project is 'Failed', with reason 'Build Timed Out'.
For reference only, the following projects are affected by this:
    - tika-parsers :  Apache Tika is a toolkit for detecting and extracting metada...
    - tika-parsers-test :  Apache Tika is a toolkit for detecting and extracting metada...


Full details are available at:
    http://vmgump.apache.org/gump/public/tika/tika-parsers/index.html

That said, some information snippets are provided here.

The following annotations (debug/informational/warning/error messages) were provided:
 -DEBUG- Sole jar output [tika-parsers-*[0-9T].jar] identifier set to project name
 -INFO- Optional dependency org.apache.poi prerequisite failed with reason build failed
 -DEBUG- (Apache Gump generated) Apache Maven Settings in: /srv/gump/public/workspace/tika/tika-parsers/gump_mvn_settings.xml
 -INFO- Failed with reason build timed out
 -DEBUG- Maven POM in: /srv/gump/public/workspace/tika/tika-parsers/pom.xml
 -INFO- Failed to extract fallback artifacts from Gump Repository



The following work was performed:
http://vmgump.apache.org/gump/public/tika/tika-parsers/gump_work/build_tika_tika-parsers.html
Work Name: build_tika_tika-parsers (Type: Build)
Work ended in a state of : Failed
Elapsed: 1 hour 1 sec
Command Line: /opt/maven2/bin/mvn --batch-mode -DskipTests=true --settings /srv/gump/public/workspace/tika/tika-parsers/gump_mvn_settings.xml
package 
[Working Directory: /srv/gump/public/workspace/tika/tika-parsers]
M2_HOME: /opt/maven2
---------------------------------------------
114K downloaded  (xmpcore-5.1.2.jar)
Downloading: http://localhost:8192/maven2/net/sourceforge/jmatio/jmatio/1.0/jmatio-1.0.jar
64K downloaded  (jmatio-1.0.jar)
Downloading: http://localhost:8192/maven2/org/aspectj/aspectjrt/1.8.0/aspectjrt-1.8.0.jar
114K downloaded  (aspectjrt-1.8.0.jar)
Downloading: http://localhost:8192/maven2/org/apache/james/apache-mime4j-dom/0.7.2/apache-mime4j-dom-0.7.2.jar
297K downloaded  (apache-mime4j-dom-0.7.2.jar)
2666K downloaded  (xmlbeans-2.6.0.jar)
Downloading: http://jbig2-imageio.googlecode.com/svn/maven-repository//org/apache/pdfbox/fontbox/1.8.8/fontbox-1.8.8.jar
Downloading: http://localhost:8192/maven2/org/bouncycastle/bcprov-jdk15/1.45/bcprov-jdk15-1.45.jar
[INFO] Unable to find resource 'org.apache.pdfbox:fontbox:jar:1.8.8' in repository jbig2.googlecode
(http://jbig2-imageio.googlecode.com/svn/maven-repository/)
Downloading: http://www.mygrid.org.uk/maven/repository/org/apache/pdfbox/fontbox/1.8.8/fontbox-1.8.8.jar
1624K downloaded  (bcprov-jdk15-1.45.jar)
Downloading: http://download.oracle.com/maven/edu/ucar/unidataCommon/4.2.20/unidataCommon-4.2.20.jar
[INFO] Unable to find resource 'org.slf4j:slf4j-api:jar:1.6.1' in repository Oracle (http://download.oracle.com/maven)
Downloading: http://maven.geotoolkit.org//org/slf4j/slf4j-api/1.6.1/slf4j-api-1.6.1.jar
[INFO] Unable to find resource 'net.jcip:jcip-annotations:jar:1.0' in repository Oracle (http://download.oracle.com/maven)
Downloading: http://maven.geotoolkit.org//net/jcip/jcip-annotations/1.0/jcip-annotations-1.0.jar
[INFO] Unable to find resource 'edu.ucar:unidataCommon:jar:4.2.20' in repository Oracle (http://download.oracle.com/maven)
Downloading: http://maven.geotoolkit.org//edu/ucar/unidataCommon/4.2.20/unidataCommon-4.2.20.jar
[INFO] Unable to find resource 'commons-httpclient:commons-httpclient:jar:3.1' in repository
Oracle (http://download.oracle.com/maven)
Downloading: http://maven.geotoolkit.org//commons-httpclient/commons-httpclient/3.1/commons-httpclient-3.1.jar
[INFO] Unable to find resource 'net.jcip:jcip-annotations:jar:1.0' in repository geotoolkit
(http://maven.geotoolkit.org/)
Downloading: http://localhost:8192/maven2/net/jcip/jcip-annotations/1.0/jcip-annotations-1.0.jar
[INFO] Unable to find resource 'edu.ucar:unidataCommon:jar:4.2.20' in repository geotoolkit
(http://maven.geotoolkit.org/)
Downloading: http://localhost:8192/maven2/edu/ucar/unidataCommon/4.2.20/unidataCommon-4.2.20.jar
[INFO] Unable to find resource 'org.slf4j:slf4j-api:jar:1.6.1' in repository geotoolkit (http://maven.geotoolkit.org/)
Downloading: http://localhost:8192/maven2/org/slf4j/slf4j-api/1.6.1/slf4j-api-1.6.1.jar
[INFO] Unable to find resource 'commons-httpclient:commons-httpclient:jar:3.1' in repository
geotoolkit (http://maven.geotoolkit.org/)
Downloading: http://localhost:8192/maven2/commons-httpclient/commons-httpclient/3.1/commons-httpclient-3.1.jar
2K downloaded  (jcip-annotations-1.0.jar)
205K downloaded  (unidataCommon-4.2.20.jar)
24K downloaded  (slf4j-api-1.6.1.jar)
297K downloaded  (commons-httpclient-3.1.jar)
Downloading: http://localhost:8192/maven2/org/gagravarr/vorbis-java-core/0.6/vorbis-java-core-0.6.jar
Downloading: http://localhost:8192/maven2/org/apache/poi/poi-scratchpad/3.11/poi-scratchpad-3.11.jar
74K downloaded  (vorbis-java-core-0.6.jar)
Downloading: http://localhost:8192/maven2/org/slf4j/slf4j-log4j12/1.7.7/slf4j-log4j12-1.7.7.jar
8K downloaded  (slf4j-log4j12-1.7.7.jar)
1259K downloaded  (poi-scratchpad-3.11.jar)
Downloading: http://localhost:8192/maven2/org/apache/poi/poi-ooxml/3.11/poi-ooxml-3.11.jar
1182K downloaded  (poi-ooxml-3.11.jar)
Downloading: http://localhost:8192/maven2/org/apache/poi/poi-ooxml-schemas/3.11/poi-ooxml-schemas-3.11.jar
5464K downloaded  (poi-ooxml-schemas-3.11.jar)
[WARNING] Unable to get resource 'org.apache.pdfbox:fontbox:jar:1.8.8' from repository mygrid-repository
(http://www.mygrid.org.uk/maven/repository): Error transferring file: Connection reset
Downloading: http://localhost:8192/maven2/org/apache/pdfbox/fontbox/1.8.8/fontbox-1.8.8.jar
1423K downloaded  (fontbox-1.8.8.jar)
Downloading: http://jbig2-imageio.googlecode.com/svn/maven-repository//org/apache/pdfbox/jempbox/1.8.8/jempbox-1.8.8.jar
[INFO] Unable to find resource 'org.apache.pdfbox:jempbox:jar:1.8.8' in repository jbig2.googlecode
(http://jbig2-imageio.googlecode.com/svn/maven-repository/)
Downloading: http://www.mygrid.org.uk/maven/repository/org/apache/pdfbox/jempbox/1.8.8/jempbox-1.8.8.jar
---------------------------------------------

To subscribe to this information via syndicated feeds:
- RSS: http://vmgump.apache.org/gump/public/tika/tika-parsers/rss.xml
- Atom: http://vmgump.apache.org/gump/public/tika/tika-parsers/atom.xml

============================== Gump Tracking Only ===
Produced by Apache Gump(TM) version 2.3.
Gump Run 20141231000004, vmgump.apache.org:vmgump:20141231000004
Gump E-mail Identifier (unique within run) #8.

*********************************************************** G U M P
[GUMP@vmgump]: Project tika-reactor (in module tika) failed
To whom it may engage...
        
This is an automated request, but not an unsolicited one. For 
more information please visit http://gump.apache.org/nagged.html, 
and/or contact the folk at general@gump.apache.org.

Project tika-reactor has an issue affecting its community integration.
This issue affects 1 projects,
 and has been outstanding for 108 runs.
The current state of this project is 'Failed', with reason 'Build Failed'.
For reference only, the following projects are affected by this:
    - tika-reactor :  Apache Tika is a toolkit for detecting and extracting metada...


Full details are available at:
    http://vmgump.apache.org/gump/public/tika/tika-reactor/index.html

That said, some information snippets are provided here.

The following annotations (debug/informational/warning/error messages) were provided:
 -INFO- Optional dependency tika-parsers failed with reason build timed out
 -DEBUG- (Apache Gump generated) Apache Maven Settings in: /srv/gump/public/workspace/tika/gump_mvn_settings.xml
 -INFO- Failed with reason build failed
 -DEBUG- Maven POM in: /srv/gump/public/workspace/tika/pom.xml



The following work was performed:
http://vmgump.apache.org/gump/public/tika/tika-reactor/gump_work/build_tika_tika-reactor.html
Work Name: build_tika_tika-reactor (Type: Build)
Work ended in a state of : Failed
Elapsed: 4 mins 33 secs
Command Line: /opt/maven2/bin/mvn --batch-mode -DskipTests=true --settings /srv/gump/public/workspace/tika/gump_mvn_settings.xml
install 
[Working Directory: /srv/gump/public/workspace/tika]
MAVEN_OPTS: -Xmx512m 
M2_HOME: /opt/maven2
---------------------------------------------
[INFO] 4 warnings 
[INFO] -------------------------------------------------------------
[INFO] -------------------------------------------------------------
[ERROR] COMPILATION ERROR : 
[INFO] -------------------------------------------------------------
[ERROR] /srv/gump/public/workspace/tika/tika-parsers/src/main/java/org/apache/tika/parser/font/AdobeFontMetricParser.java:[26,30]
cannot find symbol
  symbol:   class FontMetric
  location: package org.apache.fontbox.afm
[ERROR] /srv/gump/public/workspace/tika/tika-parsers/src/main/java/org/apache/tika/parser/font/AdobeFontMetricParser.java:[70,8]
cannot find symbol
  symbol:   class FontMetric
  location: class org.apache.tika.parser.font.AdobeFontMetricParser
[ERROR] /srv/gump/public/workspace/tika/tika-parsers/src/main/java/org/apache/tika/parser/font/AdobeFontMetricParser.java:[75,28]
cannot find symbol
  symbol:   method getResult()
  location: variable parser of type org.apache.fontbox.afm.AFMParser
[ERROR] /srv/gump/public/workspace/tika/tika-parsers/src/main/java/org/apache/tika/parser/font/TrueTypeParser.java:[67,26]
cannot find symbol
  symbol:   method parseTTF(java.io.File)
  location: variable parser of type org.apache.fontbox.ttf.TTFParser
[ERROR] /srv/gump/public/workspace/tika/tika-parsers/src/main/java/org/apache/tika/parser/font/TrueTypeParser.java:[69,26]
cannot find symbol
  symbol:   method parseTTF(java.io.InputStream)
  location: variable parser of type org.apache.fontbox.ttf.TTFParser
[INFO] 5 errors 
[INFO] -------------------------------------------------------------
[INFO] ------------------------------------------------------------------------
[ERROR] BUILD FAILURE
[INFO] ------------------------------------------------------------------------
[INFO] Compilation failure

/srv/gump/public/workspace/tika/tika-parsers/src/main/java/org/apache/tika/parser/font/AdobeFontMetricParser.java:[26,30]
cannot find symbol
  symbol:   class FontMetric
  location: package org.apache.fontbox.afm
/srv/gump/public/workspace/tika/tika-parsers/src/main/java/org/apache/tika/parser/font/AdobeFontMetricParser.java:[70,8]
cannot find symbol
  symbol:   class FontMetric
  location: class org.apache.tika.parser.font.AdobeFontMetricParser
/srv/gump/public/workspace/tika/tika-parsers/src/main/java/org/apache/tika/parser/font/AdobeFontMetricParser.java:[75,28]
cannot find symbol
  symbol:   method getResult()
  location: variable parser of type org.apache.fontbox.afm.AFMParser
/srv/gump/public/workspace/tika/tika-parsers/src/main/java/org/apache/tika/parser/font/TrueTypeParser.java:[67,26]
cannot find symbol
  symbol:   method parseTTF(java.io.File)
  location: variable parser of type org.apache.fontbox.ttf.TTFParser
/srv/gump/public/workspace/tika/tika-parsers/src/main/java/org/apache/tika/parser/font/TrueTypeParser.java:[69,26]
cannot find symbol
  symbol:   method parseTTF(java.io.InputStream)
  location: variable parser of type org.apache.fontbox.ttf.TTFParser

[INFO] ------------------------------------------------------------------------
[INFO] For more information, run Maven with the -e switch
[INFO] ------------------------------------------------------------------------
[INFO] Total time: 4 minutes 31 seconds
[INFO] Finished at: Wed Dec 31 02:55:53 UTC 2014
[INFO] Final Memory: 62M/185M
[INFO] ------------------------------------------------------------------------
---------------------------------------------

To subscribe to this information via syndicated feeds:
- RSS: http://vmgump.apache.org/gump/public/tika/tika-reactor/rss.xml
- Atom: http://vmgump.apache.org/gump/public/tika/tika-reactor/atom.xml

============================== Gump Tracking Only ===
Produced by Apache Gump(TM) version 2.3.
Gump Run 20141231000004, vmgump.apache.org:vmgump:20141231000004
Gump E-mail Identifier (unique within run) #9.


--
Apache Gump
http://gump.apache.org/ [Instance: vmgump]

---------------------------------------------------------------------
To unsubscribe, e-mail: general-unsubscribe@gump.apache.org
For additional commands, e-mail: general-help@gump.apache.org


Mime
View raw message