gump-general mailing list archives

Site index · List index
Message view « Date » · « Thread »
Top « Date » · « Thread »
Subject BATCH: All dressed up, with nowhere to go...
Date Thu, 13 Nov 2014 16:21:35 GMT
Dear Gumpmeisters,
The following 1 notifys should have been sent

*********************************************************** G U M P
[GUMP@vmgump]: Project checkstyle (in module checkstyle) failed
*********************************************************** G U M P
[GUMP@vmgump]: Project checkstyle (in module checkstyle) failed
To whom it may engage...
This is an automated request, but not an unsolicited one. For 
more information please visit, 
and/or contact the folk at

Project checkstyle has an issue affecting its community integration.
This issue affects 5 projects.
The current state of this project is 'Failed', with reason 'Build Failed'.
For reference only, the following projects are affected by this:
    - checkstyle :  Java style checker
    - tomcat-tc7.0.x-validate :  Tomcat 7.x, a web server implementing Java Servlet 3.0,
    - tomcat-tc8.0.x-validate :  Tomcat 8.x, a web server implementing the Java Servlet 3.1,
    - tomcat-trunk-validate :  Tomcat 9.x, a web server implementing the Java Servlet 4.0,
    - xmlgraphics-commons-test :  Apache XML Graphics Commons - Common Components for Batik

Full details are available at:

That said, some information snippets are provided here.

The following annotations (debug/informational/warning/error messages) were provided:
 -INFO- Optional dependency google-guava failed with reason build failed
 -DEBUG- (Apache Gump generated) Apache Maven Settings in: /srv/gump/public/workspace/checkstyle/gump_mvn_settings.xml
 -INFO- Failed with reason build failed
 -DEBUG- Maven POM in: /srv/gump/public/workspace/checkstyle/pom.xml
 -INFO- Failed to extract fallback artifacts from Gump Repository

The following work was performed:
Work Name: build_checkstyle_checkstyle (Type: Build)
Work ended in a state of : Failed
Elapsed: 59 secs
Command Line: /opt/maven3/bin/mvn --batch-mode -DskipTests=true --settings /srv/gump/public/workspace/checkstyle/gump_mvn_settings.xml
[Working Directory: /srv/gump/public/workspace/checkstyle]
M2_HOME: /opt/maven3
[INFO] Using 'iso-8859-1' encoding to copy filtered resources.
[INFO] Copying 378 resources
[INFO] --- maven-compiler-plugin:2.3.2:testCompile (default-testCompile) @ checkstyle ---
[INFO] Compiling 215 source files to /srv/gump/public/workspace/checkstyle/target/test-classes
[INFO] --- maven-surefire-plugin:2.9:test (default-test) @ checkstyle ---
Downloading: http://localhost:8192/maven2/org/apache/maven/surefire/surefire-booter/2.9/surefire-booter-2.9.pom
Downloaded: http://localhost:8192/maven2/org/apache/maven/surefire/surefire-booter/2.9/surefire-booter-2.9.pom
(3 KB at 10.6 KB/sec)
Downloading: http://localhost:8192/maven2/org/apache/maven/surefire/surefire-api/2.9/surefire-api-2.9.pom
Downloaded: http://localhost:8192/maven2/org/apache/maven/surefire/surefire-api/2.9/surefire-api-2.9.pom
(3 KB at 25.9 KB/sec)
Downloading: http://localhost:8192/maven2/org/apache/maven/surefire/maven-surefire-common/2.9/maven-surefire-common-2.9.pom
Downloaded: http://localhost:8192/maven2/org/apache/maven/surefire/maven-surefire-common/2.9/maven-surefire-common-2.9.pom
(4 KB at 46.6 KB/sec)
Downloading: http://localhost:8192/maven2/org/apache/maven/surefire/surefire-booter/2.9/surefire-booter-2.9.jar
Downloading: http://localhost:8192/maven2/org/apache/maven/surefire/surefire-api/2.9/surefire-api-2.9.jar
Downloading: http://localhost:8192/maven2/org/apache/maven/surefire/maven-surefire-common/2.9/maven-surefire-common-2.9.jar
Downloaded: http://localhost:8192/maven2/org/apache/maven/surefire/surefire-booter/2.9/surefire-booter-2.9.jar
(33 KB at 125.0 KB/sec)
Downloaded: http://localhost:8192/maven2/org/apache/maven/surefire/maven-surefire-common/2.9/maven-surefire-common-2.9.jar
(60 KB at 236.2 KB/sec)
Downloaded: http://localhost:8192/maven2/org/apache/maven/surefire/surefire-api/2.9/surefire-api-2.9.jar
(156 KB at 531.0 KB/sec)
[INFO] Tests are skipped.
[INFO] --- maven-jar-plugin:2.3.1:jar (default-jar) @ checkstyle ---
[INFO] Building jar: /srv/gump/public/workspace/checkstyle/target/checkstyle-6.1-SNAPSHOT.jar
[INFO] --- maven-antrun-plugin:1.7:run (ant-phase-verify) @ checkstyle ---
[INFO] Executing tasks


[checkstyle] Running Checkstyle 6.1-SNAPSHOT on 659 files
[checkstyle] /srv/gump/public/workspace/checkstyle/src/main/java/com/puppycrawl/tools/checkstyle/
Line matches the illegal pattern '\s+$'.
[checkstyle] /srv/gump/public/workspace/checkstyle/src/main/java/com/puppycrawl/tools/checkstyle/
Line matches the illegal pattern '\s+$'.
[INFO] ------------------------------------------------------------------------
[INFO] ------------------------------------------------------------------------
[INFO] Total time: 57.238s
[INFO] Finished at: Thu Nov 13 13:30:50 UTC 2014
[INFO] Final Memory: 37M/181M
[INFO] ------------------------------------------------------------------------
[ERROR] Failed to execute goal org.apache.maven.plugins:maven-antrun-plugin:1.7:run (ant-phase-verify)
on project checkstyle: An Ant BuildException has occured: The following error occurred while
executing this line:
[ERROR] /srv/gump/public/workspace/checkstyle/ant-phase-verify.xml:35: Checkstyle failed:
Got 2 errors and 0 warnings.
[ERROR] around Ant part ...<ant antfile="ant-phase-verify.xml"/>... @ 7:40 in /srv/gump/public/workspace/checkstyle/target/antrun/build-main.xml
[ERROR] -> [Help 1]
[ERROR] To see the full stack trace of the errors, re-run Maven with the -e switch.
[ERROR] Re-run Maven using the -X switch to enable full debug logging.
[ERROR] For more information about the errors and possible solutions, please read the following
[ERROR] [Help 1]

To subscribe to this information via syndicated feeds:
- RSS:
- Atom:

============================== Gump Tracking Only ===
Produced by Apache Gump(TM) version 2.3.
Gump Run 20141113120003,
Gump E-mail Identifier (unique within run) #1.

Apache Gump [Instance: vmgump]

To unsubscribe, e-mail:
For additional commands, e-mail:

View raw message