gump-general mailing list archives

Site index · List index
Message view « Date » · « Thread »
Top « Date » · « Thread »
From g...@vmgump.apache.org
Subject BATCH: All dressed up, with nowhere to go...
Date Sun, 02 Nov 2014 00:59:21 GMT
Dear Gumpmeisters,
            
The following 8 notifys should have been sent

*********************************************************** G U M P
[GUMP@vmgump]: Module ant-contrib failed
[GUMP@vmgump]: Project ant-contrib-private-ivy2 (in module ant-contrib) failed
[GUMP@vmgump]: Project ant-contrib-private-ivy (in module ant-contrib) failed
[GUMP@vmgump]: Project hamcrest-java (in module hamcrest) failed
[GUMP@vmgump]: Project poi-ooxml-deps (in module poi) failed
[GUMP@vmgump]: Project ant-contrib (in module ant-contrib) failed
[GUMP@vmgump]: Project tika-parsers (in module tika) failed
[GUMP@vmgump]: Project tika-reactor (in module tika) failed
*********************************************************** G U M P
[GUMP@vmgump]: Module ant-contrib failed
To whom it may engage...
        
This is an automated request, but not an unsolicited one. For 
more information please visit http://gump.apache.org/nagged.html, 
and/or contact the folk at general@gump.apache.org.

Module ant-contrib has an issue affecting its community integration,
 and has been outstanding for 12 runs.
The current state of this module is 'Failed', with reason 'Update Failed'.

Full details are available at:
    http://vmgump.apache.org/gump/public/ant-contrib/index.html

That said, some information snippets are provided here.

The following annotations (debug/informational/warning/error messages) were provided:
 -INFO- Failed with reason update failed



The following work was performed:
http://vmgump.apache.org/gump/public/ant-contrib/gump_work/update_ant-contrib.html
Work Name: update_ant-contrib (Type: Update)
Work ended in a state of : Failed
Elapsed: 1 sec
Command Line: svn --quiet update --non-interactive ant-contrib 
[Working Directory: /srv/gump/public/workspace/cvs]
---------------------------------------------
svn: E230001: Unable to connect to a repository at URL 'https://svn.code.sf.net/p/ant-contrib/code/ant-contrib/trunk'
svn: E230001: Server SSL certificate verification failed: issuer is not trusted
---------------------------------------------

To subscribe to this information via syndicated feeds:
- RSS: http://vmgump.apache.org/gump/public/ant-contrib/rss.xml
- Atom: http://vmgump.apache.org/gump/public/ant-contrib/atom.xml

============================== Gump Tracking Only ===
Produced by Apache Gump(TM) version 2.3.
Gump Run 20141102000015, vmgump.apache.org:vmgump:20141102000015
Gump E-mail Identifier (unique within run) #1.

*********************************************************** G U M P
[GUMP@vmgump]: Project ant-contrib-private-ivy2 (in module ant-contrib) failed
To whom it may engage...
        
This is an automated request, but not an unsolicited one. For 
more information please visit http://gump.apache.org/nagged.html, 
and/or contact the folk at general@gump.apache.org.

Project ant-contrib-private-ivy2 has an issue affecting its community integration,
 and has been outstanding for 12 runs.
The current state of this project is 'Failed', with reason 'Update Failed'.

Full details are available at:
    http://vmgump.apache.org/gump/public/ant-contrib/ant-contrib-private-ivy2/index.html

That said, some information snippets are provided here.

The following annotations (debug/informational/warning/error messages) were provided:
 -DEBUG- Sole jar output [ivy-2.0.0.jar] identifier set to project name
 -INFO- Failed with reason update failed
 -DEBUG- Extracted fallback artifacts from Gump Repository

To subscribe to this information via syndicated feeds:
- RSS: http://vmgump.apache.org/gump/public/ant-contrib/ant-contrib-private-ivy2/rss.xml
- Atom: http://vmgump.apache.org/gump/public/ant-contrib/ant-contrib-private-ivy2/atom.xml

============================== Gump Tracking Only ===
Produced by Apache Gump(TM) version 2.3.
Gump Run 20141102000015, vmgump.apache.org:vmgump:20141102000015
Gump E-mail Identifier (unique within run) #2.

*********************************************************** G U M P
[GUMP@vmgump]: Project ant-contrib-private-ivy (in module ant-contrib) failed
To whom it may engage...
        
This is an automated request, but not an unsolicited one. For 
more information please visit http://gump.apache.org/nagged.html, 
and/or contact the folk at general@gump.apache.org.

Project ant-contrib-private-ivy has an issue affecting its community integration,
 and has been outstanding for 12 runs.
The current state of this project is 'Failed', with reason 'Update Failed'.

Full details are available at:
    http://vmgump.apache.org/gump/public/ant-contrib/ant-contrib-private-ivy/index.html

That said, some information snippets are provided here.

The following annotations (debug/informational/warning/error messages) were provided:
 -DEBUG- Sole jar output [ivy-1.4.1.jar] identifier set to project name
 -INFO- Failed with reason update failed
 -DEBUG- Extracted fallback artifacts from Gump Repository

To subscribe to this information via syndicated feeds:
- RSS: http://vmgump.apache.org/gump/public/ant-contrib/ant-contrib-private-ivy/rss.xml
- Atom: http://vmgump.apache.org/gump/public/ant-contrib/ant-contrib-private-ivy/atom.xml

============================== Gump Tracking Only ===
Produced by Apache Gump(TM) version 2.3.
Gump Run 20141102000015, vmgump.apache.org:vmgump:20141102000015
Gump E-mail Identifier (unique within run) #3.

*********************************************************** G U M P
[GUMP@vmgump]: Project hamcrest-java (in module hamcrest) failed
To whom it may engage...
        
This is an automated request, but not an unsolicited one. For 
more information please visit http://gump.apache.org/nagged.html, 
and/or contact the folk at general@gump.apache.org.

Project hamcrest-java has an issue affecting its community integration.
This issue affects 14 projects.
The current state of this project is 'Failed', with reason 'Build Failed'.
For reference only, the following projects are affected by this:
    - hamcrest-java :  Provides a library of matcher objects (also known as constra...
    - net.sf.xmlunit :  JUnit extension for XML unit tests.
    - org.apache.poi :  POI
    - poi :  POI
    - poi-test :  POI
    - test-ant :  Java based build tool
    - tomcat-tc7.0.x-test-bio :  Tomcat 7.x, a web server implementing Java Servlet 3.0,
    ...
    - tomcat-tc7.0.x-test-nio :  Tomcat 7.x, a web server implementing Java Servlet 3.0,
    ...
    - tomcat-trunk-test-apr :  Tomcat 8.x, a web server implementing the Java Servlet 3.1,
...
    - tomcat-trunk-test-bio :  Tomcat 8.x, a web server implementing the Java Servlet 3.1,
...
    - tomcat-trunk-test-nio :  Tomcat 8.x, a web server implementing the Java Servlet 3.1,
...
    - tomcat-trunk-test-nio2 :  Tomcat 8.x, a web server implementing the Java Servlet 3.1,
...
    - xmlunit :  JUnit extension for XML unit tests.
    - xmlunit-test :  JUnit extension for XML unit tests.


Full details are available at:
    http://vmgump.apache.org/gump/public/hamcrest/hamcrest-java/index.html

That said, some information snippets are provided here.

The following annotations (debug/informational/warning/error messages) were provided:
 -INFO- Failed with reason build failed
 -DEBUG- Extracted fallback artifacts from Gump Repository



The following work was performed:
http://vmgump.apache.org/gump/public/hamcrest/hamcrest-java/gump_work/build_hamcrest_hamcrest-java.html
Work Name: build_hamcrest_hamcrest-java (Type: Build)
Work ended in a state of : Failed
Elapsed: 3 secs
Command Line: /usr/lib/jvm/java-7-oracle/bin/java -Djava.awt.headless=true -Dbuild.sysclasspath=only
org.apache.tools.ant.Main -Dgump.merge=/srv/gump/public/gump/work/merge.xml -Dversion=20141102
bigjar 
[Working Directory: /srv/gump/public/workspace/hamcrest]
CLASSPATH: /usr/lib/jvm/java-7-oracle/lib/tools.jar:/srv/gump/public/workspace/hamcrest/build/temp/hamcrest-api-20141102.jar.contents:/srv/gump/public/workspace/hamcrest/build/temp/hamcrest-generator-20141102.jar.contents:/srv/gump/public/workspace/hamcrest/build/temp/hamcrest-core-20141102.jar.contents:/srv/gump/public/workspace/hamcrest/build/temp/hamcrest-integration-20141102.jar.contents:/srv/gump/public/workspace/hamcrest/build/temp/hamcrest-library-20141102.jar.contents:/srv/gump/public/workspace/hamcrest/build/hamcrest-api-20141102-tests.jar:/srv/gump/public/workspace/hamcrest/build/hamcrest-integration-20141102-tests.jar:/srv/gump/public/workspace/hamcrest/build/hamcrest-generator-20141102-tests.jar:/srv/gump/public/workspace/hamcrest/build/hamcrest-library-20141102-tests.jar:/srv/gump/public/workspace/hamcrest/build/hamcrest-core-20141102-tests.jar:/srv/gump/public/workspace/hamcrest/lib/integration/ant-junit-1.8.4.jar:/srv/gump/public/workspace/hamcrest/lib/integration/juni
 t-dep-4.11.jar:/srv/gump/public/workspace/hamcrest/lib/integration/easymock-2.2.jar:/srv/gump/public/workspace/hamcrest/lib/integration/jmock-1.10RC1.jar:/srv/gump/public/workspace/hamcrest/lib/integration/testng-6.5.2.jar:/srv/gump/public/workspace/ant/bootstrap/lib/ant.jar:/srv/gump/public/workspace/ant/bootstrap/lib/ant-launcher.jar:/srv/gump/packages/qdox/qdox-1.12.jar:/srv/gump/packages/jarjar/jarjar-0.6.jar
---------------------------------------------
    [javac]   symbol:   class JavaType
    [javac]   location: package com.thoughtworks.qdox.model
    [javac] /srv/gump/public/workspace/hamcrest/build/temp/hamcrest-generator-20141102-sources.jar.contents/org/hamcrest/generator/QDoxFactoryReader.java:17:
error: cannot find symbol
    [javac] import com.thoughtworks.qdox.model.JavaTypeVariable;
    [javac]                                   ^
    [javac]   symbol:   class JavaTypeVariable
    [javac]   location: package com.thoughtworks.qdox.model
    [javac] /srv/gump/public/workspace/hamcrest/build/temp/hamcrest-generator-20141102-sources.jar.contents/org/hamcrest/generator/QDoxFactoryReader.java:117:
error: cannot find symbol
    [javac]     private static String typeToString(JavaType type) {
    [javac]                                        ^
    [javac]   symbol:   class JavaType
    [javac]   location: class QDoxFactoryReader
    [javac] /srv/gump/public/workspace/hamcrest/build/temp/hamcrest-generator-20141102-sources.jar.contents/org/hamcrest/generator/QDox.java:19:
error: cannot find symbol
    [javac]     private final JavaProjectBuilder javaDocBuilder = new JavaProjectBuilder();
    [javac]                                                           ^
    [javac]   symbol:   class JavaProjectBuilder
    [javac]   location: class QDox
    [javac] /srv/gump/public/workspace/hamcrest/build/temp/hamcrest-generator-20141102-sources.jar.contents/org/hamcrest/generator/QDoxFactoryReader.java:51:
error: cannot find symbol
    [javac]             for (JavaTypeVariable<?> tv : jm.getTypeParameters()) {
    [javac]                  ^
    [javac]   symbol:   class JavaTypeVariable
    [javac]   location: class QDoxFactoryReader
    [javac] /srv/gump/public/workspace/hamcrest/build/temp/hamcrest-generator-20141102-sources.jar.contents/org/hamcrest/generator/QDoxFactoryReader.java:68:
error: cannot find symbol
    [javac]             for (JavaType exception : jm.getExceptions()) {
    [javac]                  ^
    [javac]   symbol:   class JavaType
    [javac]   location: class QDoxFactoryReader
    [javac] /srv/gump/public/workspace/hamcrest/build/temp/hamcrest-generator-20141102-sources.jar.contents/org/hamcrest/generator/QDoxFactoryReader.java:105:
error: cannot find symbol
    [javac]                 && !javaMethod.getReturnType().equals(JavaType.VOID);
    [javac]                                                       ^
    [javac]   symbol:   variable JavaType
    [javac]   location: class QDoxFactoryReader
    [javac] /srv/gump/public/workspace/hamcrest/build/temp/hamcrest-generator-20141102-sources.jar.contents/org/hamcrest/generator/QDoxFactoryReader.java:109:
error: cannot find symbol
    [javac]         for (JavaAnnotation a : javaMethod.getAnnotations()) {
    [javac]              ^
    [javac]   symbol:   class JavaAnnotation
    [javac]   location: class QDoxFactoryReader
    [javac] /srv/gump/public/workspace/hamcrest/build/temp/hamcrest-generator-20141102-sources.jar.contents/org/hamcrest/generator/QDoxFactoryReader.java:126:
error: incompatible types
    [javac]         List<DocletTag> tags = methodSource.getTags();
    [javac]                                                    ^
    [javac]   required: List<DocletTag>
    [javac]   found:    DocletTag[]
    [javac] 12 errors

BUILD FAILED
/srv/gump/public/workspace/hamcrest/build.xml:28: The following error occurred while executing
this line:
/srv/gump/public/workspace/hamcrest/build.xml:159: The following error occurred while executing
this line:
/srv/gump/public/workspace/hamcrest/build.xml:182: Compile failed; see the compiler error
output for details.

Total time: 3 seconds
---------------------------------------------

To subscribe to this information via syndicated feeds:
- RSS: http://vmgump.apache.org/gump/public/hamcrest/hamcrest-java/rss.xml
- Atom: http://vmgump.apache.org/gump/public/hamcrest/hamcrest-java/atom.xml

============================== Gump Tracking Only ===
Produced by Apache Gump(TM) version 2.3.
Gump Run 20141102000015, vmgump.apache.org:vmgump:20141102000015
Gump E-mail Identifier (unique within run) #4.

*********************************************************** G U M P
[GUMP@vmgump]: Project poi-ooxml-deps (in module poi) failed
To whom it may engage...
        
This is an automated request, but not an unsolicited one. For 
more information please visit http://gump.apache.org/nagged.html, 
and/or contact the folk at general@gump.apache.org.

Project poi-ooxml-deps has an issue affecting its community integration.
This issue affects 3 projects,
 and has been outstanding for 4 runs.
The current state of this project is 'Failed', with reason 'Missing Build Outputs'.
For reference only, the following projects are affected by this:
    - ooxml-schemas :  POI
    - poi-ooxml-deps :  POI
    - poi-ooxml-schemas :  POI


Full details are available at:
    http://vmgump.apache.org/gump/public/poi/poi-ooxml-deps/index.html

That said, some information snippets are provided here.

The following annotations (debug/informational/warning/error messages) were provided:
 -INFO- Failed with reason missing build outputs
 -ERROR- Missing Output: /srv/gump/public/workspace/poi/compile-lib/bcpkix-jdk15on-1.51.jar
 -ERROR- Missing Output: /srv/gump/public/workspace/poi/compile-lib/bcprov-ext-jdk15on-1.51.jar
 -ERROR- Missing Output: /srv/gump/public/workspace/poi/compile-lib/slf4j-api-1.7.7.jar
 -ERROR- Missing Output: /srv/gump/public/workspace/poi/compile-lib/xmlsec-2.0.1.jar
 -ERROR- See Directory Listing Work for Missing Outputs
 -INFO- Failed to extract fallback artifacts from Gump Repository



The following work was performed:
http://vmgump.apache.org/gump/public/poi/poi-ooxml-deps/gump_work/build_poi_poi-ooxml-deps.html
Work Name: build_poi_poi-ooxml-deps (Type: Build)
Work ended in a state of : Success
Elapsed: 2 secs
Command Line: /usr/lib/jvm/java-7-oracle/bin/java -Djava.awt.headless=true -Dbuild.sysclasspath=only
org.apache.tools.ant.Main -Dgump.merge=/srv/gump/public/gump/work/merge.xml fetch-ooxml-jars

[Working Directory: /srv/gump/public/workspace/poi]
CLASSPATH: /usr/lib/jvm/java-7-oracle/lib/tools.jar:/srv/gump/public/workspace/ant/dist/lib/ant.jar:/srv/gump/public/workspace/ant/dist/lib/ant-launcher.jar:/srv/gump/public/workspace/ant/dist/lib/ant-jmf.jar:/srv/gump/public/workspace/ant/dist/lib/ant-junit.jar:/srv/gump/public/workspace/ant/dist/lib/ant-junit4.jar:/srv/gump/public/workspace/ant/dist/lib/ant-swing.jar:/srv/gump/public/workspace/ant/dist/lib/ant-apache-resolver.jar:/srv/gump/public/workspace/ant/dist/lib/ant-apache-xalan2.jar:/srv/gump/public/workspace/xml-commons/java/build/resolver.jar
---------------------------------------------
Buildfile: /srv/gump/public/workspace/poi/build.xml

check-ooxml-jars:

fetch-ooxml-jars:

testexist:

downloadfile:
      [get] Getting: http://repo1.maven.org/maven2/org/apache/xmlbeans/xmlbeans/2.3.0/xmlbeans-2.3.0.jar
      [get] To: /srv/gump/public/workspace/poi/ooxml-lib/xmlbeans-2.3.0.jar

testexist:

downloadfile:
      [get] Getting: http://repo1.maven.org/maven2/org/apache/xmlbeans/xmlbeans/2.6.0/xmlbeans-2.6.0.jar
      [get] To: /srv/gump/public/workspace/poi/ooxml-lib/xmlbeans-2.6.0.jar

BUILD SUCCESSFUL
Total time: 2 seconds
---------------------------------------------

To subscribe to this information via syndicated feeds:
- RSS: http://vmgump.apache.org/gump/public/poi/poi-ooxml-deps/rss.xml
- Atom: http://vmgump.apache.org/gump/public/poi/poi-ooxml-deps/atom.xml

============================== Gump Tracking Only ===
Produced by Apache Gump(TM) version 2.3.
Gump Run 20141102000015, vmgump.apache.org:vmgump:20141102000015
Gump E-mail Identifier (unique within run) #5.

*********************************************************** G U M P
[GUMP@vmgump]: Project ant-contrib (in module ant-contrib) failed
To whom it may engage...
        
This is an automated request, but not an unsolicited one. For 
more information please visit http://gump.apache.org/nagged.html, 
and/or contact the folk at general@gump.apache.org.

Project ant-contrib has an issue affecting its community integration,
 and has been outstanding for 12 runs.
The current state of this project is 'Failed', with reason 'Update Failed'.

Full details are available at:
    http://vmgump.apache.org/gump/public/ant-contrib/ant-contrib/index.html

That said, some information snippets are provided here.

The following annotations (debug/informational/warning/error messages) were provided:
 -INFO- Failed with reason update failed
 -DEBUG- Extracted fallback artifacts from Gump Repository

To subscribe to this information via syndicated feeds:
- RSS: http://vmgump.apache.org/gump/public/ant-contrib/ant-contrib/rss.xml
- Atom: http://vmgump.apache.org/gump/public/ant-contrib/ant-contrib/atom.xml

============================== Gump Tracking Only ===
Produced by Apache Gump(TM) version 2.3.
Gump Run 20141102000015, vmgump.apache.org:vmgump:20141102000015
Gump E-mail Identifier (unique within run) #6.

*********************************************************** G U M P
[GUMP@vmgump]: Project tika-parsers (in module tika) failed
To whom it may engage...
        
This is an automated request, but not an unsolicited one. For 
more information please visit http://gump.apache.org/nagged.html, 
and/or contact the folk at general@gump.apache.org.

Project tika-parsers has an issue affecting its community integration.
This issue affects 2 projects,
 and has been outstanding for 11 runs.
The current state of this project is 'Failed', with reason 'Build Failed'.
For reference only, the following projects are affected by this:
    - tika-parsers :  Apache Tika is a toolkit for detecting and extracting metada...
    - tika-parsers-test :  Apache Tika is a toolkit for detecting and extracting metada...


Full details are available at:
    http://vmgump.apache.org/gump/public/tika/tika-parsers/index.html

That said, some information snippets are provided here.

The following annotations (debug/informational/warning/error messages) were provided:
 -DEBUG- Sole jar output [tika-parsers-*[0-9T].jar] identifier set to project name
 -INFO- Optional dependency org.apache.poi prerequisite failed with reason build failed
 -DEBUG- (Apache Gump generated) Apache Maven Settings in: /srv/gump/public/workspace/tika/tika-parsers/gump_mvn_settings.xml
 -INFO- Failed with reason build failed
 -DEBUG- Maven POM in: /srv/gump/public/workspace/tika/tika-parsers/pom.xml
 -INFO- Failed to extract fallback artifacts from Gump Repository



The following work was performed:
http://vmgump.apache.org/gump/public/tika/tika-parsers/gump_work/build_tika_tika-parsers.html
Work Name: build_tika_tika-parsers (Type: Build)
Work ended in a state of : Failed
Elapsed: 53 secs
Command Line: /opt/maven2/bin/mvn --batch-mode -DskipTests=true --settings /srv/gump/public/workspace/tika/tika-parsers/gump_mvn_settings.xml
package 
[Working Directory: /srv/gump/public/workspace/tika/tika-parsers]
M2_HOME: /opt/maven2
---------------------------------------------
[INFO] 4 warnings 
[INFO] -------------------------------------------------------------
[INFO] -------------------------------------------------------------
[ERROR] COMPILATION ERROR : 
[INFO] -------------------------------------------------------------
[ERROR] /srv/gump/public/workspace/tika/tika-parsers/src/main/java/org/apache/tika/parser/font/AdobeFontMetricParser.java:[26,30]
cannot find symbol
  symbol:   class FontMetric
  location: package org.apache.fontbox.afm
[ERROR] /srv/gump/public/workspace/tika/tika-parsers/src/main/java/org/apache/tika/parser/font/AdobeFontMetricParser.java:[70,8]
cannot find symbol
  symbol:   class FontMetric
  location: class org.apache.tika.parser.font.AdobeFontMetricParser
[ERROR] /srv/gump/public/workspace/tika/tika-parsers/src/main/java/org/apache/tika/parser/font/AdobeFontMetricParser.java:[75,28]
cannot find symbol
  symbol:   method getResult()
  location: variable parser of type org.apache.fontbox.afm.AFMParser
[ERROR] /srv/gump/public/workspace/tika/tika-parsers/src/main/java/org/apache/tika/parser/font/TrueTypeParser.java:[67,26]
cannot find symbol
  symbol:   method parseTTF(java.io.File)
  location: variable parser of type org.apache.fontbox.ttf.TTFParser
[ERROR] /srv/gump/public/workspace/tika/tika-parsers/src/main/java/org/apache/tika/parser/font/TrueTypeParser.java:[69,26]
cannot find symbol
  symbol:   method parseTTF(java.io.InputStream)
  location: variable parser of type org.apache.fontbox.ttf.TTFParser
[INFO] 5 errors 
[INFO] -------------------------------------------------------------
[INFO] ------------------------------------------------------------------------
[ERROR] BUILD FAILURE
[INFO] ------------------------------------------------------------------------
[INFO] Compilation failure

/srv/gump/public/workspace/tika/tika-parsers/src/main/java/org/apache/tika/parser/font/AdobeFontMetricParser.java:[26,30]
cannot find symbol
  symbol:   class FontMetric
  location: package org.apache.fontbox.afm
/srv/gump/public/workspace/tika/tika-parsers/src/main/java/org/apache/tika/parser/font/AdobeFontMetricParser.java:[70,8]
cannot find symbol
  symbol:   class FontMetric
  location: class org.apache.tika.parser.font.AdobeFontMetricParser
/srv/gump/public/workspace/tika/tika-parsers/src/main/java/org/apache/tika/parser/font/AdobeFontMetricParser.java:[75,28]
cannot find symbol
  symbol:   method getResult()
  location: variable parser of type org.apache.fontbox.afm.AFMParser
/srv/gump/public/workspace/tika/tika-parsers/src/main/java/org/apache/tika/parser/font/TrueTypeParser.java:[67,26]
cannot find symbol
  symbol:   method parseTTF(java.io.File)
  location: variable parser of type org.apache.fontbox.ttf.TTFParser
/srv/gump/public/workspace/tika/tika-parsers/src/main/java/org/apache/tika/parser/font/TrueTypeParser.java:[69,26]
cannot find symbol
  symbol:   method parseTTF(java.io.InputStream)
  location: variable parser of type org.apache.fontbox.ttf.TTFParser

[INFO] ------------------------------------------------------------------------
[INFO] For more information, run Maven with the -e switch
[INFO] ------------------------------------------------------------------------
[INFO] Total time: 51 seconds
[INFO] Finished at: Sun Nov 02 00:52:42 UTC 2014
[INFO] Final Memory: 35M/111M
[INFO] ------------------------------------------------------------------------
---------------------------------------------

To subscribe to this information via syndicated feeds:
- RSS: http://vmgump.apache.org/gump/public/tika/tika-parsers/rss.xml
- Atom: http://vmgump.apache.org/gump/public/tika/tika-parsers/atom.xml

============================== Gump Tracking Only ===
Produced by Apache Gump(TM) version 2.3.
Gump Run 20141102000015, vmgump.apache.org:vmgump:20141102000015
Gump E-mail Identifier (unique within run) #7.

*********************************************************** G U M P
[GUMP@vmgump]: Project tika-reactor (in module tika) failed
To whom it may engage...
        
This is an automated request, but not an unsolicited one. For 
more information please visit http://gump.apache.org/nagged.html, 
and/or contact the folk at general@gump.apache.org.

Project tika-reactor has an issue affecting its community integration.
This issue affects 1 projects,
 and has been outstanding for 11 runs.
The current state of this project is 'Failed', with reason 'Build Failed'.
For reference only, the following projects are affected by this:
    - tika-reactor :  Apache Tika is a toolkit for detecting and extracting metada...


Full details are available at:
    http://vmgump.apache.org/gump/public/tika/tika-reactor/index.html

That said, some information snippets are provided here.

The following annotations (debug/informational/warning/error messages) were provided:
 -INFO- Optional dependency tika-parsers failed with reason build failed
 -DEBUG- (Apache Gump generated) Apache Maven Settings in: /srv/gump/public/workspace/tika/gump_mvn_settings.xml
 -INFO- Failed with reason build failed
 -DEBUG- Maven POM in: /srv/gump/public/workspace/tika/pom.xml



The following work was performed:
http://vmgump.apache.org/gump/public/tika/tika-reactor/gump_work/build_tika_tika-reactor.html
Work Name: build_tika_tika-reactor (Type: Build)
Work ended in a state of : Failed
Elapsed: 34 secs
Command Line: /opt/maven2/bin/mvn --batch-mode -DskipTests=true --settings /srv/gump/public/workspace/tika/gump_mvn_settings.xml
install 
[Working Directory: /srv/gump/public/workspace/tika]
MAVEN_OPTS: -Xmx512m 
M2_HOME: /opt/maven2
---------------------------------------------
[INFO] 4 warnings 
[INFO] -------------------------------------------------------------
[INFO] -------------------------------------------------------------
[ERROR] COMPILATION ERROR : 
[INFO] -------------------------------------------------------------
[ERROR] /srv/gump/public/workspace/tika/tika-parsers/src/main/java/org/apache/tika/parser/font/AdobeFontMetricParser.java:[26,30]
cannot find symbol
  symbol:   class FontMetric
  location: package org.apache.fontbox.afm
[ERROR] /srv/gump/public/workspace/tika/tika-parsers/src/main/java/org/apache/tika/parser/font/AdobeFontMetricParser.java:[70,8]
cannot find symbol
  symbol:   class FontMetric
  location: class org.apache.tika.parser.font.AdobeFontMetricParser
[ERROR] /srv/gump/public/workspace/tika/tika-parsers/src/main/java/org/apache/tika/parser/font/AdobeFontMetricParser.java:[75,28]
cannot find symbol
  symbol:   method getResult()
  location: variable parser of type org.apache.fontbox.afm.AFMParser
[ERROR] /srv/gump/public/workspace/tika/tika-parsers/src/main/java/org/apache/tika/parser/font/TrueTypeParser.java:[67,26]
cannot find symbol
  symbol:   method parseTTF(java.io.File)
  location: variable parser of type org.apache.fontbox.ttf.TTFParser
[ERROR] /srv/gump/public/workspace/tika/tika-parsers/src/main/java/org/apache/tika/parser/font/TrueTypeParser.java:[69,26]
cannot find symbol
  symbol:   method parseTTF(java.io.InputStream)
  location: variable parser of type org.apache.fontbox.ttf.TTFParser
[INFO] 5 errors 
[INFO] -------------------------------------------------------------
[INFO] ------------------------------------------------------------------------
[ERROR] BUILD FAILURE
[INFO] ------------------------------------------------------------------------
[INFO] Compilation failure

/srv/gump/public/workspace/tika/tika-parsers/src/main/java/org/apache/tika/parser/font/AdobeFontMetricParser.java:[26,30]
cannot find symbol
  symbol:   class FontMetric
  location: package org.apache.fontbox.afm
/srv/gump/public/workspace/tika/tika-parsers/src/main/java/org/apache/tika/parser/font/AdobeFontMetricParser.java:[70,8]
cannot find symbol
  symbol:   class FontMetric
  location: class org.apache.tika.parser.font.AdobeFontMetricParser
/srv/gump/public/workspace/tika/tika-parsers/src/main/java/org/apache/tika/parser/font/AdobeFontMetricParser.java:[75,28]
cannot find symbol
  symbol:   method getResult()
  location: variable parser of type org.apache.fontbox.afm.AFMParser
/srv/gump/public/workspace/tika/tika-parsers/src/main/java/org/apache/tika/parser/font/TrueTypeParser.java:[67,26]
cannot find symbol
  symbol:   method parseTTF(java.io.File)
  location: variable parser of type org.apache.fontbox.ttf.TTFParser
/srv/gump/public/workspace/tika/tika-parsers/src/main/java/org/apache/tika/parser/font/TrueTypeParser.java:[69,26]
cannot find symbol
  symbol:   method parseTTF(java.io.InputStream)
  location: variable parser of type org.apache.fontbox.ttf.TTFParser

[INFO] ------------------------------------------------------------------------
[INFO] For more information, run Maven with the -e switch
[INFO] ------------------------------------------------------------------------
[INFO] Total time: 32 seconds
[INFO] Finished at: Sun Nov 02 00:53:18 UTC 2014
[INFO] Final Memory: 61M/178M
[INFO] ------------------------------------------------------------------------
---------------------------------------------

To subscribe to this information via syndicated feeds:
- RSS: http://vmgump.apache.org/gump/public/tika/tika-reactor/rss.xml
- Atom: http://vmgump.apache.org/gump/public/tika/tika-reactor/atom.xml

============================== Gump Tracking Only ===
Produced by Apache Gump(TM) version 2.3.
Gump Run 20141102000015, vmgump.apache.org:vmgump:20141102000015
Gump E-mail Identifier (unique within run) #8.


--
Apache Gump
http://gump.apache.org/ [Instance: vmgump]

---------------------------------------------------------------------
To unsubscribe, e-mail: general-unsubscribe@gump.apache.org
For additional commands, e-mail: general-help@gump.apache.org


Mime
View raw message